Vocabulary Of Attribution and Governance
type: Ontology
imports: vaem-xina
uses non imported resource: VOAG Catalog Entry
has graph role: SchemaGraph
with attribution to: TopQuadrant attribution
imports: prov
uses non imported resource: title
uses non imported resource: TopQuadrant attribution
description: VOAG stands for "Vocabulary Of Attribution and Governance". The ontology is intended to specify licensing, attribution, provenance and governance of an ontology. VOAG captures many common license types and their restrictions. Where a license requires attribution, VOAG provides resources that allow the attribution should be made. Provenance is defined in terms of source and pedigree. A miminal model of governance is provided based on how issues, releases and changes are managed. VOAG does not import, but makes uses of some concepts from VOID (http://vocab.deri.ie/void), notably void:Dataset.
imports: vaem
namespace prefix: voag
name: VOAG
uses non imported resource: subject
imports: dtype
intent: Provides a schema for intellectual capital rights, attribution and governance. Uses the PROVO ontology for provenance. Typical use of the ontology is to refer to its resources, as opposed to importing the ontology.
imports: void
author: Ralph Hodgson
uses non imported resource: contributor
uses non imported resource: description
subject: Licensing, Attribution and Governance
revision: 1.0
date created: 2011-01-31T10:00:00
uses non imported resource: author
last updated: 2012-11-01
imports: vaem-xics
has catalog entry: VOAG Catalog Entry
url: http://voag.linkedmodel.org/1.0/owl/schema/voag
namespace: http://voag.linkedmodel.org/voag

VOAG Catalog Entry
type: CatalogEntry
type: Schema graph

Schema graph
type: Class
equivalent class: Class
  intersection of: Graph
  intersection of: Restriction
    on property: hasGraphRole
    has value: SchemaGraph
subclass of: Restriction
  on property: hasGraphRole
  has value: SchemaGraph
subclass of: Graph

TopQuadrant attribution
type: Attributed Source
name: TopQuadrant, Inc.
url: http://www.topquadrant.com
point of contact: Ralph Hodgson, TopQuadrant, Inc.
has logo: TopQuadrant Logo 613 x 150

TopQuadrant Logo 613 x 150
type: Organization logo
description: TopQuadrant's logo - diamond with company name to the right
width: 613
height: 150
type: Attribution logo

Attribution logo
type: Class
subclass of: Logo

title
type: AnnotationProperty
range: string

subject
type: AnnotationProperty
range: string

Governance Process
type: Class
subclass of: Process
description: A "Process".

Process
type: Class
subclass of: Restriction
  on property: name
  max cardinality: 1
subclass of: Restriction
  on property: id
  max cardinality: 1
subclass of: Thing

Icon
type: Class
subclass of: Image
description: A logo of some kind

Image
type: Class
subclass of: Restriction
  on property: width
  max cardinality: 1
subclass of: Restriction
  on property: height
  max cardinality: 1
subclass of: Restriction
  on property: caption
  max cardinality: 1
subclass of: Restriction
  on property: image
  cardinality: 1
subclass of: Thing
description: Image is a class for figures, pictures, logos, and icons of various kinds

Creative Commons Prohibition
type: Class
subclass of: Metadata Enumerated value
description: something you may be asked not to do

Metadata Enumerated value
type: Class
subclass of: EnumeratedValue
description: The base class in LMC for enumerated values

Publication Status
type: Class
subclass of: Metadata Enumerated value

Party
type: Class
subclass of: Restriction
  on property: name
  max cardinality: 1
subclass of: Restriction
  on property: id
  max cardinality: 1

id
type: DatatypeProperty
range: anySimpleType

Priority value
type: Class
subclass of: Metadata Enumerated value

Product logo
type: Class
subclass of: Logo
description: Product logo is used for products, solutions, etc.

Logo
type: Class
subclass of: Image
description: Logo is ...

Issue Resolution Process
type: Class
subclass of: Governance Process
description: A "Governance Process".

Creative commons jurisdiction
type: Class
subclass of: Thing
label: Creative Commons Jurisdiction
description: the legal jurisdiction of a license

Requirement
type: Class
subclass of: Metadata Enumerated value
description: An action that may or may not be requested of you
description: an action that may or may not be requested of you

Non-Concurrence Event
type: Class
subclass of: Governance Event
description: A "Governance Event".

Governance Event
type: Class
subclass of: Event
description: A "Governance Event".

Deletion Event
type: Class
subclass of: Event
description: A "Archival Event".

Event
type: Class
subclass of: Restriction
  on property: description
  max cardinality: 1
subclass of: Restriction
  on property: id
  max cardinality: 1
subclass of: Restriction
  on property: event date
  max cardinality: 1
subclass of: Restriction
  on property: end date
  max cardinality: 1
subclass of: Restriction
  on property: name
  max cardinality: 1
subclass of: Restriction
  on property: instigated by
  all values from: Party
subclass of: Restriction
  on property: start date
  max cardinality: 1
subclass of: Thing
subclass of: Restriction
  on property: instigated by
  max cardinality: 1

Governed service
type: Class
subclass of: Service

Service
type: Class
subclass of: Restriction
  on property: name
  max cardinality: 1
subclass of: Restriction
  on property: id
  max cardinality: 1
subclass of: Thing

Qualifier
type: Class
subclass of: Restriction
  on property: name
  max cardinality: 1
subclass of: Restriction
  on property: id
  max cardinality: 1
subclass of: Thing

Confidentiality level
type: Class
subclass of: Metadata Enumerated value
description: An enumerated codelist for values thath pertain to the security of a set of resources, or a resource. In 'lmc' an ontology can carry a property to denote its confidentiality.

Change type
type: Class
subclass of: Metadata Enumerated value
description: Change Type provides an indicator for how an artifact has or will change in the future. This indicator is important to understanding the stability of an ontology.

Vocab graph
type: Class
equivalent class: Class
  intersection of: Graph
  intersection of: Restriction
    on property: hasGraphRole
    has value: VocabularyGraph
subclass of: Restriction
  on property: hasGraphRole
  has value: VocabularyGraph
subclass of: Graph

Graph
type: Class
subclass of: Restriction
  on property: curated graph URI
  cardinality: 1
description: A set of RDF triples in an ontology graph specified according to VOAG.
subclass of: Restriction
  on property: withAttributionTo
  all values from: Attributed Source
subclass of: Restriction
  on property: namespace
  cardinality: 1
subclass of: Restriction
  on property: hasGraphRole
  all values from: GraphRole
subclass of: Restriction
  on property: has logo
  all values from: Product logo
subclass of: Restriction
  on property: namespacePrefix
  cardinality: 1
subclass of: Restriction
  on property: hasLicenseType
  max cardinality: 1
subclass of: Restriction
  on property: aspectScope
  all values from: Aspect
subclass of: Restriction
  on property: downloads
  max cardinality: 1
subclass of: Restriction
  on property: url of turtle file
  max cardinality: 1
subclass of: Restriction
  on property: disciplineScope
  all values from: Discipline
subclass of: Restriction
  on property: hasGraphRole
  max cardinality: 1
subclass of: Restriction
  on property: domainScope
  all values from: Domain
subclass of: VOID Dataset
subclass of: Restriction
  on property: has logo
  max cardinality: 1
subclass of: Restriction
  on property: url address of RDF file
  max cardinality: 1
subclass of: Restriction
  on property: viewpointScope
  all values from: Viewpoint
subclass of: Restriction
  on property: attribution text
  cardinality: 1
subclass of: Restriction
  on property: hasLicenseType
  all values from: License Model

Document
type: Class
subclass of: Restriction
  on property: title
  max cardinality: 1
subclass of: Thing
subclass of: Restriction
  on property: url
  min cardinality: 0
subclass of: Restriction
  on property: description
  max cardinality: 1
subclass of: Restriction
  on property: name
  max cardinality: 1
subclass of: Restriction
  on property: dateCreated
  max cardinality: 1
subclass of: Restriction
  on property: lastUpdated
  max cardinality: 1

title
type: DatatypeProperty
range: string

url
type: DatatypeProperty
range: anyURI

description
range: string

Pedigree
type: Class
subclass of: Restriction
  on property: used by
  all values from: Party
description: The origin or source of something. The primary purpose of provenance is to capture the time, place, and if appropriate the person responsible, for the creation, production or provisioning of some information object.
subclass of: Restriction
  on property: has maturity
  max cardinality: 1
subclass of: Qualifier
description: Pedigree captures aspects of an artifact that have to do with maturity, quality, salience, and accredidation.
subclass of: Restriction
  on property: has maturity
  all values from: Maturity
subclass of: Restriction
  on property: has accredidation
  max cardinality: 1
subclass of: Restriction
  on property: has accredidation
  all values from: Accredidation
subclass of: Restriction
  on property: usage
  max cardinality: 1

used by
type: ObjectProperty
description: The property 'usedBy' is a general property to record a dependency. One use is in stating how a schema or a vocabulary is used by another ontology graph.

has maturity
type: ObjectProperty

Maturity
type: Class
union of: Widely adopted
union of: Some adoption
union of: Early adoption
union of: Proposed
union of: Unknown maturity
union of: Experimental
union of: In development
subclass of: Metadata Enumerated value

has accredidation
type: ObjectProperty

Accredidation
type: Class
subclass of: Qualifier

usage
type: DatatypeProperty
range: string

Rejection Event
type: Class
subclass of: Event
description: A "Governance Event".

Creative commons work
type: Class
subclass of: Restriction
  on property: url
  max cardinality: 1
subclass of: Thing
label: Creative Commons Work
description: A potentially copyrightable work

Retreival Event
type: Class
subclass of: Event
description: A "Archival Event".

Approval Event
type: Class
disjoint with: Rejection Event
subclass of: Event
description: A "Governance Event".

curated graph URI
type: DatatypeProperty
range: anyURI
description: The property 'voag:curatedGraphURI' provides a means to specify the base URI of the specific version of the onotlogy that is being documented. In each versioned graph the 'vaem:namespace' carries a URI without a version number.

Attributed Source
type: Class
description: An 'Attribution' specifies how credit should be given when citing the creators of a piece of work. Attribution must use the specified attribution text and optionally use logos that are provided in the attribution details below., with the names of points of contact.
subclass of: Restriction
  on property: has logo
  max cardinality: 1
subclass of: Qualifier
subclass of: Restriction
  on property: has logo
  all values from: Attribution logo
subclass of: Restriction
  on property: name
  cardinality: 1
subclass of: Restriction
  on property: url
  max cardinality: 1
description: The name, url and other details of an attribution.
subclass of: Restriction
  on property: point of contact
  all values from: string

has logo
type: ObjectProperty
range: Logo
description: A property to reference an image that is used as a logo.

downloads
type: DatatypeProperty
range: integer

url of turtle file
type: DatatypeProperty
range: anyURI
description: Used to refer to a Turtle (N3) representation of an ontology

VOID Dataset
type: Class
subclass of: Governed Object
description: A set of RDF triples that are published, maintained or aggregated by a single provider.

url address of RDF file
type: DatatypeProperty
range: anyURI
description: Used to refer to a an RDF XML representation of an ontology

attribution text
type: DatatypeProperty
range: string

License Model
type: Class
subclass of: Restriction
  on property: image
  max cardinality: 1
description: A License Model describes the licensing conditions associated with a software artifact.
subclass of: Restriction
  on property: url
  max cardinality: 1
subclass of: Restriction
  on property: derived from
  all values from: License Model
subclass of: Restriction
  on property: acronym
  max cardinality: 1
subclass of: Governed Object
subclass of: Restriction
  on property: incompatible with
  all values from: License Model
subclass of: Restriction
  on property: compatible with
  all values from: License Model

Provenance
type: Class
subclass of: Restriction
  on property: has pedigree
  all values from: Pedigree
subclass of: Restriction
  on property: revision
  max cardinality: 1
subclass of: Restriction
  on property: has change type
  all values from: Change type
subclass of: Restriction
  on property: source
  min cardinality: 1
subclass of: Restriction
  on property: supercedes
  all values from: Governed Object
description: The origin or source of something. The primary purpose of provenance is to capture the time, place, and if appropriate the person responsible, for the creation, production or provisioning of some information object.
subclass of: Restriction
  on property: derived from
  min cardinality: 0
description: Provenance specifies the origin or source of some artifact. The primary purpose of provenance is to capture the time, place, and if appropriate the person responsible, for the creation, production or provisioning of The artifact. Provenance also captures a record of how a version may have been superceded by another version of the artifact.
subclass of: Restriction
  on property: has pedigree
  max cardinality: 1
subclass of: Restriction
  on property: source
  all values from: Class
    union of: Party
    union of: Document
subclass of: Restriction
  on property: timestamp
  cardinality: 1
subclass of: Restriction
  on property: superceded by
  all values from: Governed Object
subclass of: Qualifier
subclass of: Restriction
  on property: lastUpdated
  max cardinality: 1

has pedigree
type: ObjectProperty
description: A reference to a description about the pedigree of something.

has change type
type: ObjectProperty

source
type: ObjectProperty

supercedes
type: TransitiveProperty
inverse of: superceded by
description: A pointer to one or more 'GovernedEntities' that are replaced by this entity.
type: ObjectProperty

Governed Object
type: Class
subclass of: Restriction
  on property: has provenance
  max cardinality: 1
subclass of: Restriction
  on property: description
  max cardinality: 1
description: An abstract class for all governed entities
subclass of: Restriction
  on property: lastUpdated
  max cardinality: 1
subclass of: Restriction
  on property: name
  max cardinality: 1
subclass of: Restriction
  on property: id
  max cardinality: 1
subclass of: Restriction
  on property: revision
  max cardinality: 1
subclass of: Restriction
  on property: has governance
  all values from: Governance
subclass of: Restriction
  on property: normative URL
  max cardinality: 1
subclass of: Restriction
  on property: url
  min cardinality: 0
subclass of: Restriction
  on property: has provenance
  all values from: Provenance
subclass of: Entity
subclass of: Restriction
  on property: title
  max cardinality: 1
subclass of: Restriction
  on property: documented at
  max cardinality: 1
subclass of: Restriction
  on property: dateCreated
  max cardinality: 1
subclass of: Restriction
  on property: has governance
  max cardinality: 1

derived from
type: Property

superceded by
type: TransitiveProperty
inverse of: supercedes
description: A pointer to one or more 'GovernedEntities' that replace this entity.
type: ObjectProperty

Issue
type: Class
subclass of: Restriction
  on property: user ID
  cardinality: 1
subclass of: Restriction
  on property: priority
  max cardinality: 1
subclass of: Restriction
  on property: has status
  all values from: Issue Status
subclass of: Restriction
  on property: title
  cardinality: 1
subclass of: Restriction
  on property: disposition
  cardinality: 1
subclass of: Restriction
  on property: has status
  cardinality: 1
subclass of: Restriction
  on property: id
  max cardinality: 1
subclass of: Restriction
  on property: description
  max cardinality: 1
subclass of: Thing
subclass of: Restriction
  on property: disposition status
  all values from: BoardDispositionStatus
description: captures issues such as raising of an issue related to a particular entity in a registry
subclass of: Restriction
  on property: priority
  all values from: Priority value

user ID
type: DatatypeProperty
range: anySimpleType

priority
type: ObjectProperty

has status
type: ObjectProperty

Issue Status
type: Class
subclass of: Metadata Enumerated value
description: The status of an issue: "Closed", "Deferred", "Non issue", "Open", "Resolved".

disposition
type: DatatypeProperty
range: string
comment: used to connect to the text describing disposition of something, for example, a disposition of an issue

disposition status
type: ObjectProperty
sub property of: has approval status
description: An object propoert that denotes the state of a governance issue.

Standard
type: Class
subclass of: Restriction
  on property: has logo
  max cardinality: 1
subclass of: Restriction
  on property: has logo
  all values from: Icon
subclass of: Governed Object
description: An industry, de facto or de jure standard

Administrative Event
type: Class
subclass of: Event
description: An event that is associated with the admistration aspect of governance. Typically these are curation events.

Person
type: Class
subclass of: Person
subclass of: Party

Organization
type: Class
subclass of: Restriction
  on property: url
  min cardinality: 0
subclass of: Restriction
  on property: has logo
  max cardinality: 1
subclass of: Restriction
  on property: has logo
  all values from: Organization logo
subclass of: Organization
subclass of: Party

Organization logo
type: Class
subclass of: Logo
description: A logo for an organization

Review
type: Class
subclass of: Restriction
  on property: performed by
  all values from: Organization
subclass of: Governance Event
description: A "Governance Event".

performed by
type: ObjectProperty

image
type: DatatypeProperty
range: anyURI
description: The property 'vaem:image' points to an image using a URL.

incompatible with
type: SymmetricProperty
type: ObjectProperty

compatible with
type: SymmetricProperty
type: ObjectProperty

point of contact
type: DatatypeProperty
range: string

event date
type: DatatypeProperty
range: dateUnion

end date
type: DatatypeProperty
range: dateUnion

instigated by
type: ObjectProperty

start date
type: DatatypeProperty
range: dateUnion

Approval Process
type: Class
subclass of: Governance Process
description: A "Governance Process".

has provenance
type: ObjectProperty
description: A pointer to a provenance record that details the source, version and time of some subject of interest.

has governance
type: ObjectProperty

Governance
type: Class
subclass of: Restriction
  on property: has owner
  max cardinality: 1
description: Governance is mainly concerned with how an artifact is provisioned and managed over its lifecycle. Governance also concerns the status tracking and processes that need to exist on information objects and services for a successful initiaitve, mission, program, or project. Such governance needs to outline the relationships between all internal and external groups involved, describe the proper flow of information regarding to all stakeholders, ensure the appropriate review of issues encountered and ensure that required approvals and direction are obtained at each appropriate stage.
subclass of: Restriction
  on property: is FOSS
  max cardinality: 1
subclass of: Restriction
  on property: has confidentiality
  max cardinality: 1
subclass of: Restriction
  on property: has protocol
  cardinality: 1
subclass of: Restriction
  on property: frequency of change
  all values from: Change frequency
subclass of: Restriction
  on property: has confidentiality
  all values from: Confidentiality level
subclass of: Restriction
  on property: has reference document
  all values from: Document
subclass of: Restriction
  on property: has applicable document
  all values from: Document
subclass of: Restriction
  on property: has governance event
  all values from: Governance Event
subclass of: Restriction
  on property: has protocol
  all values from: Governance Protocol
subclass of: Restriction
  on property: has owner
  all values from: Party
subclass of: Qualifier
subclass of: Restriction
  on property: has anticipated change type
  all values from: Change type
subclass of: Restriction
  on property: has approval status
  cardinality: 1
subclass of: Restriction
  on property: is ITAR
  max cardinality: 1
subclass of: Restriction
  on property: has issue
  all values from: Issue
subclass of: Restriction
  on property: has normative document
  all values from: Document
subclass of: Restriction
  on property: supercedes
  all values from: Governance

normative URL
type: DatatypeProperty
range: anyURI

documented at
type: Property
description: The property 'vaem:documentedAt' is intended for general use as the name implies. In some cases the property could have scalar values and in other cases may need to refer to a first class concept that holds more information about a documentation resource. For this reason, the type of this property is set as 'rdf:Property' and the property is rangeless.

Catalog
type: Class
subclass of: Restriction
  on property: has logo
  max cardinality: 1
subclass of: Governed Object
description: An index to a set of resources

has owner
type: ObjectProperty

is FOSS
type: DatatypeProperty
range: boolean
description: A boolean property to specify whether or not software is free or open source. Free and open-source software (F/OSS, FOSS) or free/libre/open-source software (FLOSS) is software that is liberally licensed to grant the right of users to use, study, change, and improve its design through the availability of its source code.

has confidentiality
type: ObjectProperty
description: An object property that specifies a level of confidentiality. Typicall the range of this property will be 'voag:Confidentiality'.

has protocol
type: ObjectProperty
description: A pointer to a record that holds governance information for one or more governed entities. Often governance can be shared across entities.

frequency of change
type: ObjectProperty

Change frequency
type: Class
one of: Never
one of: Daily
one of: Weekly
one of: Bi-Weekly
one of: Monthly
one of: Bi monthly
one of: Quarterly
one of: Bi quarterly
one of: Annually
one of: Uncertain frequency
subclass of: Metadata Enumerated value

has reference document
type: ObjectProperty

has applicable document
type: ObjectProperty
description: A document that is of help to application of the subject matter. Documents include specifications, models, standards, guidelines, handbooks and other special publications.

has governance event
type: ObjectProperty
description: An event associated with governance processes.

Governance Protocol
type: Class
subclass of: Restriction
  on property: has approval process
  all values from: Approval Process
subclass of: Restriction
  on property: reviewed by
  all values from: Stakeholder Group
subclass of: Restriction
  on property: is governed by
  all values from: Organization
subclass of: Restriction
  on property: id
  max cardinality: 1
subclass of: Restriction
  on property: has approval process
  max cardinality: 1
subclass of: Restriction
  some values from: Stakeholder Group
  on property: is governed by
subclass of: Restriction
  on property: is governed by
  cardinality: 1
subclass of: Restriction
  on property: has change management process
  all values from: Change Management Process
subclass of: Restriction
  on property: is approved by
  all values from: Stakeholder Group
subclass of: Restriction
  on property: may need concurrence from
  all values from: Stakeholder Group
subclass of: Restriction
  on property: has change management process
  max cardinality: 1
subclass of: Qualifier
equivalent class: Class
  intersection of: Restriction
    some values from: Stakeholder Group
    on property: is governed by
  intersection of: Restriction
    some values from: Governance Process
    on property: has process
  intersection of: Restriction
    some values from: Document
    on property: has normative document
subclass of: Restriction
  on property: has issue resolution process
  all values from: Issue Resolution Process
subclass of: Restriction
  on property: has issue resolution process
  max cardinality: 1
subclass of: Restriction
  on property: has process
  cardinality: 3
description: Governance is used to mean the processes that need to exist for a successful initiaitve, mission, program, or project. Such governance needs to outline the relationships between all internal and external groups involved, describe the proper flow of information regarding to all stakeholders, ensure the appropriate review of issues encountered and ensure that required approvals and direction for a 'GovernedEntity' is obtained at each appropriate stage.
subclass of: Restriction
  some values from: Document
  on property: has normative document
subclass of: Restriction
  on property: interest of
  all values from: Stakeholder Group

has anticipated change type
type: ObjectProperty

has approval status
type: ObjectProperty
description: An object property that referes to an enumerated value that denotes the state of an approval.

is ITAR
type: DeprecatedProperty
range: boolean
description: International Traffic in Arms Regulations (ITAR) is a set of United States government regulations that control the export and import of defense-related articles and services on the United States Munitions List. These regulations implement the provisions of the Arms Export Control Act, and are described in Title 22 (Foreign Relations), Chapter I (Department of State), Subchapter M of the Code of Federal Regulations. The Department of State interprets and enforces ITAR. Its goal is to advance national strategic objectives and U.S. foreign policy via the trade controls. For practical purposes, ITAR regulations dictate that information and material pertaining to defense and military related technologies may only be shared with US Persons unless approval from the Department of State is received or a special exemption is used.
type: DatatypeProperty

has issue
type: ObjectProperty
range: Issue
description: A pointer to an issue that exists on a subject of interest.

has normative document
type: ObjectProperty

Figure
type: Class
subclass of: Restriction
  on property: image map
  max cardinality: 1
subclass of: Image
description: An illustration of some kind.

image map
type: Property

Assigned role
type: Class
subclass of: Thing

Creative Commons Permission
type: Class
subclass of: Metadata Enumerated value
description: An action that may or may not be allowed or desired

Governance Role
type: Class
subclass of: Metadata Enumerated value
description: A "Role" with the following instance(s): "authorizer", "steward", "submitter".

Concurrence event
type: Class
disjoint with: Non-Concurrence Event
subclass of: Event
description: A Governance Event.

width
type: DatatypeProperty
description: Width is typically used to specify an image's width attribute.

height
type: DatatypeProperty
range: string
description: Height is typically used to specify an image's height attribute.

caption
type: DatatypeProperty
range: string
description: A short description, typically used on a table or a figure.

Widely adopted
type: Maturity

Some adoption
type: Maturity

Early adoption
type: Maturity

Proposed
type: Maturity

Unknown maturity
type: Maturity

Experimental
type: Maturity

In development
type: Maturity

Stakeholder Group
type: Class
equivalent class: Restriction
  some values from: Person
  on property: has stakeholder
subclass of: Restriction
  on property: has stakeholder
  min cardinality: 1
subclass of: Restriction
  on property: has stakeholder
  all values from: Person
subclass of: Organization
subclass of: Party
description: A Stakeholder Group is a party of people who have common interests and concerns.

has stakeholder
type: ObjectProperty

Never
type: Change frequency

Daily
type: Change frequency

Weekly
type: Change frequency

Bi-Weekly
type: Change frequency
value: bi-weekly

Monthly
type: Change frequency

Bi monthly
type: Change frequency
value: bi-monthly

Quarterly
type: Change frequency

Bi quarterly
type: Change frequency
value: bi-quarterly

Annually
type: Change frequency
value: annual

Uncertain frequency
type: Change frequency

Designated Governance Role
type: Class
subclass of: Restriction
  on property: performed by
  cardinality: 1
subclass of: Restriction
  on property: hasGraphRole
  all values from: Governance Role
subclass of: Event
description: A "Assigned Role" with the following instance(s): "Assurer", "Project Management", "Resource & Process Policy", "Technical Definitions", "User", "Verifier".

Change Management Process
type: Class
subclass of: Governance Process
description: A "Governance Process".

has approval process
type: ObjectProperty
description: An object property that specifies a process that is used for approval in a 'Governance Protocol'.

reviewed by
type: ObjectProperty
inverse of: reviews
sub property of: is governed by
description: References to which parties review a data or information asset.

is governed by
type: ObjectProperty
description: A pointer to who is responsible for the governance of some entity of interest. This is a two-way reference with the inverse property 'governs'.

has change management process
type: ObjectProperty
sub property of: has process
description: An object property that specifies a process that is used for managing change in a 'Governance Protocol'.

is approved by
type: ObjectProperty
sub property of: is governed by
description: References to which parties approve an entity.

may need concurrence from
type: ObjectProperty
inverse of: gives concurrence for
sub property of: is governed by
description: An object property that specifies that a party may need to give consent, in the form of agreement, either written or verbally to the approval of some govenance concern.

has process
type: ObjectProperty
description: A reference to a process description.

has issue resolution process
type: ObjectProperty
sub property of: has process

interest of
type: ObjectProperty
description: A pointer to parties who have an interest in an entity. This is a two-way reference with the inverse property 'interestIn'.

reviews
type: ObjectProperty
inverse of: reviewed by
sub property of: governs

gives concurrence for
type: ObjectProperty
inverse of: may need concurrence from
sub property of: governs
description: An object property that specifies what a party may need to give consent, in the form of agreement, either written or verbally for in the approval of some govenance concern. This is the inverse property of 'mayNeedConcurrenceFrom' and, as such, may be deprecated in the future.

governs
type: ObjectProperty
inverse of: is governed by
description: A super-property of governance properties: 'approves', 'gives concurrence for', 'reviews' and 'witness to'.

jurisdiction
type: ObjectProperty
range: Creative commons jurisdiction
domain: License Model
type: Property

accountable for
type: ObjectProperty
description: An object property used in governance that refers a resource to the party that is accountable for it.

obsoleted by
type: ObjectProperty

more permissions
type: ObjectProperty
range: Resource
domain: Creative commons work
type: Property

supervised by
type: ObjectProperty
sub property of: is governed by

wintnessed by
type: ObjectProperty
sub property of: is governed by

has category
type: ObjectProperty

permits
type: ObjectProperty
range: Creative Commons Permission
domain: License Model
type: Property

prepared by
type: ObjectProperty
sub property of: is governed by

has identifier
type: ObjectProperty

has steward
type: ObjectProperty
description: A pointer to the person that is a curator.

legalcode
type: ObjectProperty
range: Resource
domain: License Model
type: Property

related issue
type: ObjectProperty
range: Issue
domain: Issue
comment: This property connects two issue events. Issues connected by this property must be about the same subject

witness to
type: ObjectProperty
inverse of: wintnessed by
sub property of: governs

submitted by
type: ObjectProperty
sub property of: is governed by

has value
type: ObjectProperty
range: Resource

has ontology architecture diagram
type: ObjectProperty

prohibits
type: ObjectProperty
range: Creative Commons Prohibition
domain: License Model
type: Property

requires
type: ObjectProperty
range: Requirement
domain: License Model
type: Property

participant
type: ObjectProperty

owns
type: ObjectProperty

interest in
type: ObjectProperty
inverse of: interest of

normative reference
type: ObjectProperty

approves
type: ObjectProperty
inverse of: is approved by
sub property of: governs
description: An object property that specifies that a party governs the approval of a resource.

instigating event
type: ObjectProperty

owner
type: ObjectProperty

use guidelines
type: Property
range: Resource
domain: Creative commons work

subject
type: DatatypeProperty
range: string

intent
type: DatatypeProperty
range: string

subject
type: DatatypeProperty
range: string

url for HTML
type: DatatypeProperty
range: anyURI

proprietary
type: DatatypeProperty
range: boolean
description: A boolean flag to indicate if an information asset is propretary.

release date
type: DatatypeProperty
range: dateUnion

licence
type: DatatypeProperty
range: string

timestamp
type: DatatypeProperty
range: dateTime

owned by
type: DatatypeProperty
range: string

related to
type: SymmetricProperty
type: ObjectProperty

Creative Commons Lesser Copyleft
type: Requirement
description: derivative works must be licensed under specified terms, with at least the same conditions as the original work; combinations with the work may be licensed under different terms

TBD
type: Priority value
value: tbd

deprecated on
type: AnnotationProperty
range: dateUnion
domain: License Model
type: Property

No governance specified
type: Governance

Review
type: Publication Status
value: review

Unclassified
type: Confidentiality level
description: Unclassified is not technically a "classification"; this is the default, and refers to information that can be released to individuals without a clearance (Level 0). Information that is unclassified is sometimes restricted in its dissemination as SBU or FOUO. For example, the "law enforcement bulletins" often reported by the U.S. media when United States Department of Homeland Security raises the U.S. terror threat level are usually classified as "U//LES" or "Unclassified - Law Enforcement Sensitive." This information is only supposed to be released to Law Enforcement groups (Sheriff, Police, etc.) Because the information is unclassified, however, it is sometimes released to the public as well. Information which is unclassified, but which the government does not believe should be subject to Freedom of Information Act requests is often classified as U//FOUO - "Unclassified - For Official Use Only". In addition to FOUO information, information can be categorized according to its availability to be distributed (Distribution D may only be released to approved Department of Defense and Government Contractor personnel). Also, the statement of NOFORN (meaning No Foreign Nationals) is applied to any information which may not be released to any non-US Citizen. NOFORN and Distribution statements are often used in conjunction with classified information or alone on SBU information. Documents subject to export controls have a specific warning to that effect.
value: unclassified
order: 3
code: 2

Disapproved Issue
type: Issue Status

VOAG Logo
type: Product logo
width: 180
height: 55
caption: VOAG Logo

Low priority
type: Priority value
value: low

Authorizer
type: Governance Role
value: authorizer

Non-issue
type: Issue Status
value: non-issue

Draft Status
type: Publication Status
value: draft

Top secret
type: Confidentiality level
description: "Top Secret" shall be applied to information, the unauthorized disclosure of which reasonably could be expected to cause exceptionally grave damage to the national security that the original classification authority is able to identify or describe [US Executive Order 12958].
value: topsecret
order: 7
code: 6

Final Status
type: Publication Status

LinkedModel ICON 200 x 80
type: Logo
description: LinkedModel Logo
width: 200
height: 80
caption: LinkedModel Standard ICON

Closed
type: Issue Status
value: closed

No provenance specified
type: Provenance

Creative Commons Attribution
type: Requirement
description: Credit to be given to copyright holder and/or author

Not Applicable
type: Priority value
value: na

Refactoring change
type: Change type

Steward
type: Governance Role
value: steward

No pedigree specified
type: Pedigree

Turtle Icon 32 X 35
type: Icon
description: Turtle is a representation format for RDF/OWL.
width: 32
height: 35
caption: Turtle ICON

Creative Commons Notice
type: Requirement
description: copyright and license notices be kept intact

High income nation use
type: Creative Commons Prohibition
label: Creative Commons High Income Nation Use
description: Use in a non-developing country

Submitter
type: Governance Role
value: submitter

SPARQL ICON 80 X 15
type: Icon
description: SPARQL Standard
width: 80
height: 15
caption: SPARQL Standard ICON

Creative Commons Commercial Use
type: Creative Commons Prohibition
description: Exercising rights for commercial purposes

Deferred
type: Issue Status
value: deferred

Interim Status
type: Publication Status
value: interim

Append change
type: Change type

Open
type: Issue Status
description: An issue with undetermined disposition,
value: open

Creative Commons Share Alike
type: Requirement
description: derivative works be licensed under the same terms or compatible terms as the original work

RDF Icon 32 X 35
type: Icon
description: RDF Standard
width: 32
height: 35
caption: RDF Standard ICON

Sharing
type: Creative Commons Permission
label: Creative Commons Sharing
description: permits commercial derivatives, but only non-commercial distribution

Restricted
type: Confidentiality level
description: During and before World War II, the U.S. had a category of classified information called restricted, which was below confidential. The U.S. no longer has a restricted classification, but many other nations and NATO do. The U.S. treats "restricted" information it receives from other governments as confidential. The U.S. does use the term restricted data in a completely different way to refer to nuclear secrets.
value: restricted
order: 2
code: 1

Modification change
type: Change type

exclude
type: AnnotationProperty
range: boolean

Secret
type: Confidentiality level
description: "Secret" shall be applied to information, the unauthorized disclosure of which reasonably could be expected to cause serious damage to the national security that the original classification authority is able to identify or describe [US Executive Order 12958].
value: secret
order: 6
code: 5

Documentation change
type: Change type

Reproduction
type: Creative Commons Permission
label: Creative Commons Reproduction
description: making multiple copies

Approved Issue
type: Issue Status
value: approved

Sensitive but Unclassified
type: Confidentiality level
description: Sensitive but Unclassified (SBU) information should not be disclosed but is not national security information and cannot be classified according to Executive Order (EO)12958, as amended. These materials must be: properly marked, locked up when not under the supervision of an authorized person, and encrypted while in transit over a non-secure network. Some examples are: trade secrets, proprietary information, financial information, personnel and medical records, procurement-sensitive information, IT system security plans, contingency plans, audit logs (recordings of exceptions and other security-related events), vulnerability reports, incident reports and Personally Identifiable Information (PII).
value: sbu
order: 4
code: 3

Medium priority
type: Priority value
value: medium

Obsolete
type: Publication Status
value: obsolete

Unknown Status
type: Publication Status
value: unknown

No attribution specified
type: Attributed Source

Derivative works
type: Creative Commons Permission
label: Creative Commons Derivative Works
description: Distribution of derivative works

Resolved
type: Issue Status
value: resolved

Creative Commons Copyleft
type: Requirement
url: http://www.gnu.org/copyleft/copyleft.html
description: combined works must be licensed under specified terms, similar to those on the original work
description: Copyleft is a general method for making a program (or other work) free, and requiring all modified and extended versions of the program to be free as well. The simplest way to make a program free software is to put it in the public domain, uncopyrighted. This allows people to share the program and their improvements, if they are so minded. But it also allows uncooperative people to convert the program into proprietary software. They can make changes, many or few, and distribute the result as a proprietary product. People who receive the program in that modified form do not have the freedom that the original author gave them; the middleman has stripped it away. In the GNU project, Copyleft says that anyone who redistributes the software, with or without changes, must pass along the freedom to further copy and change it. Copyleft guarantees that every user has freedom.

High priority
type: Priority value
value: high

Creative Commons Source Code
type: Requirement
description: Source code (the preferred form for making modifications) must be provided when exercising some rights granted by the license.

None
type: Confidentiality level
value: none
order: 1
code: 0

Distribution
type: Creative Commons Permission
label: Creative Commons Distribution
description: Creative Commons - distribution, public display, and publicly performance

Creative Commons Attribution-Share Alike 3.0 United States License
type: License Model