VIVO-ISF Ontology version 1.6
type: Ontology

Note
type: Class
comment: Notes or annotations about a resource.
subclass of: Document
example of usage: Short Definition from bibo ontology
definition: Notes or annotations about a resource
term status: stable

has language
type: DatatypeProperty
comment: Use 2 char language code from RFC5646
range: string

offered by
type: ObjectProperty

date/time value
type: ObjectProperty
range: Date/Time Value

Seminar Series
type: Class
subclass of: Event Series
example of usage: Applied Microeconomics Seminars; Future of Rural New York Seminar Series
example of usage: For individual seminars, use seminar instead. core:ConferenceSeries and core:SeminarSeries are very similar.
definition: An organized series of a meeting for an exchange of ideas, typically put on by a department or center.

supplemental information
type: DatatypeProperty

is quality measured as
type: ObjectProperty
has curation status: IAO_0000120
definition: inverse of the relation of is quality measurement of
editor note: 2009/10/19 Alan Ruttenberg. Named 'junk' relation useful in restrictions, but not a real instance relationship
term editor: Person:Alan Ruttenberg
inverse of: is quality measurement of

Female
type: Class
subclass of: Gender

Phase 1 Clinical Trial
type: Class
subclass of: Clinical Trial
definition: In Phase I trials, researchers test an experimental drug or treatment in a small group of people (20-80) for the first time to evaluate its safety, determine a safe dosage range, and identify side effects
definition: Phase 1 Clinical Trial

assignee for patent
type: ObjectProperty
domain: Agent
range: Patent
inverse of: assignee

Company
type: Class
subclass of: Organization
example of usage: from Wikipedia: "A company is a form of business organization. It is an association or collection of individual real persons and/or other companies ... This collection, group or association of persons can be made to exist in law and then a company is itself considered a "legal person". The name company arose because, at least originally, it represented or was owned by more than one real or legal person."
definition: A legally-recognized business organization
definition: A legally-recognized business organization.
imported from: VIVO-ISF Ontology version 1.6

organization name
type: DatatypeProperty
domain: Organization Name
range: string

has organizational unit name
type: ObjectProperty
range: Organizational Unit Name

Other
type: Class
subclass of: Territory

Licensure
type: Class
subclass of: Issued Credential
example of usage: A granted license, which gives a 'permission to practice.' Such licenses are usually issued in order to regulate some activity that is deemed to be dangerous or a threat to the person or the public or which involves a high level of specialized skill. See also core:License.
definition: A granted license, which gives a 'permission to practice.'

Serial Item and Contribution Identifier (SICI)
type: DatatypeProperty
comment: Serial Item and Contribution Identifier
sub property of: identifier
example of usage: A sub property of identifier (http://en.wikipedia.org/wiki/SICI).
term status: stable

in press
type: Document Status
type: NamedIndividual
definition: Document to be published
description: Document to be published

Government Agency
type: Class
subclass of: Organization
example of usage: United States Library of Congress
example of usage: Definition take from: http://en.wikipedia.org/wiki/Government_agency.
definition: A unit of government responsible for oversight and regulation of certain activities or the administration and provision of specific services.
imported from: VIVO-ISF Ontology version 1.6

Geopolitical Ontology

Person
definition: An instance of a human being (Homo sapiens)
subclass of: Restriction
  all values from: Credential
  on property: credential eligibility attained
subclass of: Restriction
  all values from: Thing
  on property: research areas
term editor: PERSON: Melissa Haendel
editor preferred term: person
type: Class
definition: The most general classification of a person
comment: A person
subclass of: Restriction
  all values from: Geographic Region
  on property: geographic focus
subclass of: Agent
subclass of: Restriction
  all values from: Credential
  on property: credential eligibility attained
subclass of: Restriction
  all values from: Thing
  on property: research areas
subclass of: Restriction
  all values from: Geographic Region
  on property: geographic focus

has grain
type: ObjectProperty
sub property of: has part
editor preferred term: has grain
definition: the relation of the cells in the finger of the skin to the finger, in which an indeterminate number of grains are parts of the whole by virtue of being grains in a collective that is part of the whole, and in which removing one granular part does not nec- essarily damage or diminish the whole. Ontological Whether there is a fixed, or nearly fixed number of parts - e.g. fingers of the hand, chambers of the heart, or wheels of a car - such that there can be a notion of a single one being missing, or whether, by contrast, the number of parts is indeterminate - e.g., cells in the skin of the hand, red cells in blood, or rubber molecules in the tread of the tire of the wheel of the car.
editor note: Discussion in Karslruhe with, among others, Alan Rector, Stefan Schulz, Marijke Keet, Melanie Courtot, and Alan Ruttenberg. Definition take from the definition of granular parthood in the cited paper. Needs work to put into standard form
term editor: PERSON: Alan Ruttenberg
definition source: PAPER: Granularity, scale and collectivity: When size does and does not matter, Alan Rector, Jeremy Rogers, Thomas Bittner, Journal of Biomedical Informatics 39 (2006) 333-349
imported from: obi webservice.owl

Identification
type: Class
comment: These types are used to capture information associated with the identification and naming of the entity associated with the vCard
equivalent class: Class
  intersection of: Class
    intersection of: Restriction
      on property: geo
      some values from: anyURI
    intersection of: Restriction
      max cardinality: 1
      on property: geo
  intersection of: Class
    intersection of: Restriction
      on property: timezone
      some values from: string
    intersection of: Restriction
      max cardinality: 1
      on property: timezone
  intersection of: Class
    intersection of: Restriction
      all values from: string
      on property: has language
    intersection of: Restriction
      max cardinality: 1
      on property: has language
  intersection of: Class
    intersection of: Restriction
      all values from: string
      on property: sort as
    intersection of: Restriction
      max cardinality: 1
      on property: sort as
equivalent class: Class
  intersection of: Class
    intersection of: Restriction
      on property: geo
      some values from: anyURI
    intersection of: Restriction
      max cardinality: 1
      on property: geo
  intersection of: Class
    intersection of: Restriction
      on property: timezone
      some values from: string
    intersection of: Restriction
      max cardinality: 1
      on property: timezone
  intersection of: Class
    intersection of: Restriction
      all values from: string
      on property: has language
    intersection of: Restriction
      max cardinality: 1
      on property: has language
  intersection of: Class
    intersection of: Restriction
      all values from: string
      on property: sort as
    intersection of: Restriction
      max cardinality: 1
      on property: sort as

start page
type: DatatypeProperty
comment: Starting page number within a continuous page range.
sub property of: locator
term status: stable

manuscript
type: Class
comment: An unpublished Document, which may also be submitted to a publisher for publication.
label: Manuscript
subclass of: Document
example of usage: Short Definition is the Medical Subject Heading (MeSH) definition
definition: Works prepared by hand including handwritten or typescript drafts of pre-publication papers or works not otherwise reproduced in multiple copies
term status: stable

Presentation
type: Class
subclass of: Event
definition: Encompasses talk, speech, lecture, slide lecture, conference presentation

has time zone
type: ObjectProperty
range: Time Zone

relates
type: ObjectProperty
definition: Relates a Relationship instance to the one or more Thing of the Relationship. There is a separate property (assigned by) to relate to the Agent that defines the Relationship.
inverse of: related by

has role

Technique
type: Class
comment: Protocol is added to eagle-i temporarily until a relationship between the informatio entity "protocol" and these planned processes is created. This class refers to the axtual process not the document
subclass of: Planned Process
example of usage: Flow cytometry is a technique.
has curation status: IAO_0000120
definition: A technique is a planned process used to accomplish a specific activity or task.
term editor: PERSON: Melissa Haendel
definition source: http://en.wikipedia.org/wiki/Technique

Data about an Ontology Part
type: Class
subclass of: Data Item
definition: data about an ontology part is a data item about a part of an ontology, for example a term
term editor: Person:Alan Ruttenberg

Territory
subclass of: Restriction
  max cardinality: 1
  on property: nameCurrencyIT
subclass of: Restriction
  max cardinality: 1
  on property: nameCurrencyEN
subclass of: Restriction
  max cardinality: 1
  on property: land area notes
subclass of: Restriction
  max cardinality: 1
  on property: GDP notes
subclass of: Restriction
  max cardinality: 1
  on property: nationalityES
subclass of: Restriction
  max cardinality: 1
  on property: nationalityEN
subclass of: Restriction
  max cardinality: 1
  on property: GDP total in current prices
subclass of: Restriction
  max cardinality: 1
  on property: agriculturalAreaTotal
subclass of: Restriction
  max cardinality: 1
  on property: has maximum longitude
subclass of: Restriction
  max cardinality: 1
  on property: nameCurrencyRU
subclass of: Restriction
  max cardinality: 1
  on property: population unit
subclass of: Restriction
  max cardinality: 1
  on property: agricultural area unit
subclass of: Restriction
  max cardinality: 1
  on property: country area notes
subclass of: Restriction
  max cardinality: 1
  on property: nationalityFR
subclass of: Restriction
  max cardinality: 1
  on property: codeCurrency
subclass of: Restriction
  max cardinality: 1
  on property: GDP unit
subclass of: Restriction
  max cardinality: 1
  on property: land area unit
subclass of: Area
subclass of: Restriction
  max cardinality: 1
  on property: total land area
subclass of: Restriction
  max cardinality: 1
  on property: populationYear
subclass of: Restriction
  max cardinality: 1
  on property: nationalityRU
subclass of: Restriction
  max cardinality: 1
  on property: has minimum latitude
subclass of: Restriction
  max cardinality: 1
  on property: nationalityAR
subclass of: Restriction
  max cardinality: 1
  on property: HDITotal
subclass of: Restriction
  max cardinality: 1
  on property: agriculturalAreaYear
subclass of: Restriction
  max cardinality: 1
  on property: HDINotes
subclass of: Restriction
  max cardinality: 1
  on property: has minimum longitude
subclass of: Restriction
  max cardinality: 1
  on property: GDPYear
subclass of: Restriction
  max cardinality: 1
  on property: nameCurrencyES
subclass of: Restriction
  max cardinality: 1
  on property: total country area
subclass of: Restriction
  max cardinality: 1
  on property: country area unit
type: Class
subclass of: Restriction
  max cardinality: 1
  on property: nationalityIT
subclass of: Restriction
  max cardinality: 1
  on property: total population
subclass of: Restriction
  max cardinality: 1
  on property: HDIUnit
subclass of: Restriction
  max cardinality: 1
  on property: landAreaYear
subclass of: Restriction
  max cardinality: 1
  on property: population notes
subclass of: Restriction
  max cardinality: 1
  on property: nameCurrencyFR
subclass of: Restriction
  max cardinality: 1
  on property: countryAreaYear
subclass of: Geopolitical Entity
subclass of: Restriction
  max cardinality: 1
  on property: HDIYear
subclass of: Restriction
  max cardinality: 1
  on property: nameCurrencyZH
subclass of: Restriction
  max cardinality: 1
  on property: has maximum latitude
subclass of: Restriction
  max cardinality: 1
  on property: agricultural area notes
subclass of: Restriction
  max cardinality: 1
  on property: nationalityZH
subclass of: Restriction
  max cardinality: 1
  on property: nameCurrencyIT
subclass of: Restriction
  max cardinality: 1
  on property: nameCurrencyEN
subclass of: Restriction
  max cardinality: 1
  on property: land area notes
subclass of: Restriction
  max cardinality: 1
  on property: GDP notes
subclass of: Restriction
  max cardinality: 1
  on property: nationalityES
subclass of: Restriction
  max cardinality: 1
  on property: nationalityEN
subclass of: Restriction
  max cardinality: 1
  on property: GDP total in current prices
subclass of: Restriction
  max cardinality: 1
  on property: agriculturalAreaTotal
subclass of: Restriction
  max cardinality: 1
  on property: has maximum longitude
subclass of: Restriction
  max cardinality: 1
  on property: nameCurrencyRU
subclass of: Restriction
  max cardinality: 1
  on property: population unit
subclass of: Restriction
  max cardinality: 1
  on property: agricultural area unit
subclass of: Restriction
  max cardinality: 1
  on property: country area notes
subclass of: Restriction
  max cardinality: 1
  on property: nationalityFR
subclass of: Restriction
  max cardinality: 1
  on property: codeCurrency
subclass of: Restriction
  max cardinality: 1
  on property: GDP unit
subclass of: Restriction
  max cardinality: 1
  on property: land area unit
subclass of: Restriction
  max cardinality: 1
  on property: total land area
subclass of: Restriction
  max cardinality: 1
  on property: populationYear
subclass of: Restriction
  max cardinality: 1
  on property: nationalityRU
subclass of: Restriction
  max cardinality: 1
  on property: has minimum latitude
subclass of: Restriction
  max cardinality: 1
  on property: nationalityAR
subclass of: Restriction
  max cardinality: 1
  on property: HDITotal
subclass of: Restriction
  max cardinality: 1
  on property: agriculturalAreaYear

Organization Name
type: Class
subclass of: Organizational
equivalent class: Class
  intersection of: Restriction
    on property: organization name
    some values from: string
  intersection of: Restriction
    min cardinality: 1
    on property: organization name
equivalent class: Class
  intersection of: Restriction
    on property: organization name
    some values from: string
  intersection of: Restriction
    min cardinality: 1
    on property: organization name

research area of
type: ObjectProperty
sub property of: concept for

total population
type: DatatypeProperty

nationalityFR
source identifier: http://www.fao.org/termportal/contr/es/
source creator: FAO terminology
source identifier: http://www.fao.org/termportal/contr/zh/
source identifier: http://www.fao.org/termportal/contr/ar/
source identifier: http://www.fao.org/termportal/en/
type: DatatypeProperty
source: FAO terminology http://www.fao.org/termportal/en/
source modified: 2010-06-24
source identifier: http://www.fao.org/termportal/contr/en/
source identifier: http://www.fao.org/termportal/contr/fr/

Reagent
equivalent class: Class
  intersection of: Material Entity
term editor: PERSON: Melissa Haendel
has curation status: IAO_0000120
example of usage: A plasmid can be used as a reagent.
editor preferred term: reagent
comment: Placeholder for class to be imported from the Reagent Ontology (ReO).
subclass of: Material Entity
definition: Processed material that is used in a chemical reaction or other experimental process to detect, measure, examine, or produce other substances.
definition source: http://www.yourdictionary.com/reagent
type: Class
equivalent class: Class
  intersection of: Material Entity

reproduces
type: ObjectProperty
domain: Document
range: Document
sub property of: has part
inverse of: reproduced in

Textual Entity
example of usage: Words, sentences, paragraphs, and the written (non-figure) parts of publications are all textual entities
term editor: PERSON: Lawrence Hunter
type: Class
editor note: AR, (IAO call 2009-09-01): a document as a whole is not typically a textual entity, because it has pictures in it - rather there are parts of it that are textual entities. Examples: The title, paragraph 2 sentence 7, etc.
alternative term: text
editor note: MC, 2009-09-14 (following IAO call 2009-09-01): textual entities live at the FRBR (http://en.wikipedia.org/wiki/Functional_Requirements_for_Bibliographic_Records) manifestation level. Everything is significant: line break, pdf and html versions of same document are different textual entities.
definition: A textual entity is a part of a manifestation (FRBR sense), a generically dependent continuant whose concretizations are patterns of glyphs intended to be interpreted as words, formulas, etc.
editor preferred term: textual entity
subclass of: Information Content Entity

Faculty Member Emeritus
type: Class
subclass of: Person
definition: A retired faculty member who has retained their rank, title and privileges.

Video
type: Class
subclass of: Audio-Visual Document
definition: Audiovisual recording in video format

mentions
type: ObjectProperty
sub property of: is about

submitted
type: Document Status
type: NamedIndividual

Issue
type: Class
comment: something that is printed or published and distributed, esp. a given number of a periodical
subclass of: Collected Document
example of usage: Short Definition from the bibo ontology
definition: something that is printed or published and distributed, esp. a given number of a periodical
term status: stable

uid
type: DatatypeProperty
comment: To specify a value that represents a globally unique identifier corresponding to the entity associated with the vCard
range: anyURI

Post-Baccalaureate Trainee
type: Class
subclass of: Student Role
has curation status: IAO_0000123
definition: A student role inhering in a person that is realized when the bearer participates in a post-baccalaureate training program in pursuit of an additional bachelor degree or new or additional training in a particular field.
term editor: PERSON: Nicole Vasilevsky
definition source: PERSON: Nicole Vasilevsky

File

Academic Year
type: Class
subclass of: Date/Time Interval
definition: An explicit individual period considered by an academic institution to be its primary academic cycle.

Event Ontology

codeISO3
type: DatatypeProperty
source creator: United Nations Statistics Division
source identifier: http://unstats.un.org/unsd/methods/m49/m49alpha.htm
source identifier: http://unstats.un.org/unsd/methods/m49/m49alphaf.htm
source modified: 2010-04-01
source: United Nations Statistics Division http://unstats.un.org/unsd/methods/m49/m49alpha.htm

locality
type: DatatypeProperty
domain: Address
range: string

Service
comment: Coordinate with NIF. NIF ID: nlx_res_20090105
has curation status: IAO_0000120
type: Class
definition: An information content entity that describes a service performed by a person or organization with the objective of performing a technique, providing training, providing storage of data or material entities, or providing access to resources for another person or organization
term editor: PERSON: Melissa Haendel
example of usage: A DNA sequencing service performed by a core lab.
definition source: PERSON: Melissa Haendel
editor preferred term: service
subclass of: Information Content Entity

Attendee Role
type: Class
subclass of: Role
definition: A role of attending an Event or EventSeries

News Release
type: Class
subclass of: Document
definition: A short written piece focused on an event or announcement of note, having a defined publication time and of less enduring interest than a news feature.

codeISO2
type: DatatypeProperty
source creator: ISO 3166-1
source identifier: http://www.iso.org/iso/country_codes/iso_3166_code_lists.htm
source: ISO 3166-1 http://www.iso.org/iso/country_codes/iso_3166_code_lists.htm

nameOfficialFR
source identifier: http://www.fao.org/termportal/en/
source modified: 2010-06-24
source identifier: http://www.fao.org/termportal/contr/es/
type: DatatypeProperty
source identifier: http://www.fao.org/termportal/contr/zh/
source: FAO terminology http://www.fao.org/termportal/en/
source creator: FAO terminology
source identifier: http://www.fao.org/termportal/contr/ar/
source identifier: http://www.fao.org/termportal/contr/en/
source identifier: http://www.fao.org/termportal/contr/fr/

Authorship
subclass of: Restriction
  on property: relates
  some values from: Agent
example of usage: Currently any abstract name is given to members of this class. This could change in the future.
subclass of: Restriction
  all values from: boolean
  on property: hide from display
subclass of: Relationship
type: Class
example of usage: Authorship of journal articles, books and other original works is a means by which academics communicate the results of their scholarly work, establish priority for their discoveries, and build their reputation among their peers. This class allows for linking an author to a publication while indicating information about that author's authorship.
subclass of: Restriction
  on property: relates
  some values from: Information Content Entity
definition: Contains the authors name, their rank in the publication, and whether or not they are a corresponding author on the publication.
subclass of: Restriction
  on property: relates
  some values from: Agent
subclass of: Restriction
  all values from: boolean
  on property: hide from display
subclass of: Restriction
  on property: relates
  some values from: Information Content Entity

Instrument
comment: See OBI listserv discussion for considerations in defining instrument. http://sourceforge.net/tracker/index.php?func=detail&aid=2894801&group_id=177891&atid=886178
editor preferred term: instrument
type: Class
definition: Material entity that is designed to have a function and play a role in scientific investigation.
example of usage: A flow cytometer.
term editor: PERSON: Melissa Haendel
subclass of: Restriction
  all values from: Technique
  on property: related technique
subclass of: Material Entity
has curation status: IAO_0000120
definition source: http://en.wikipedia.org/wiki/Scientific_instrument
subclass of: Restriction
  all values from: Technique
  on property: related technique

PubMed ID
type: DatatypeProperty
comment: PubMed Identifier
domain: Document
sub property of: identifier
example of usage: The PubMed ID (PMID) identifies a citation record (rather than full-text) in the PubMed database. It is not evidence of compliance with the NIH Public Access Policy, because it does not identify a full-text submission of any kind.
term status: stable

Periodical
type: Class
comment: A group of related documents issued at regular intervals.
subclass of: Collection
subclass of: Restriction
  all values from: Literal
  on property: Electronic International Standard Serial Number (EISSN)
subclass of: Restriction
  all values from: Organization
  on property: publisher
subclass of: Restriction
  all values from: Literal
  on property: International Standard Serial Number (ISSN)
term status: stable
subclass of: Restriction
  all values from: Literal
  on property: Electronic International Standard Serial Number (EISSN)
subclass of: Restriction
  all values from: Organization
  on property: publisher
subclass of: Restriction
  all values from: Literal
  on property: International Standard Serial Number (ISSN)

direct costs
type: FunctionalProperty
type: DatatypeProperty
domain: Grant
domain: Class
  union of: Contract
  union of: Grant
domain: Class
  union of: Contract
  union of: Grant

Continent
type: Class
subclass of: Geographic Region
example of usage: Short Definition take from http://en.wiktionary.org/wiki/continent.
example of usage: The seven commonly recognized continents are Africa; Antarctica; Asia; Australia; Europe; North America; South America
definition: A large contiguous landmass that is at least partially surrounded by water, together with any islands on its continental shelf.

nameOfficialRU
source identifier: http://www.fao.org/termportal/contr/zh/
source: FAO terminology http://www.fao.org/termportal/en/
source identifier: http://www.fao.org/termportal/en/
type: DatatypeProperty
source identifier: http://www.fao.org/termportal/contr/en/
source identifier: http://www.fao.org/termportal/contr/fr/
source identifier: http://www.fao.org/termportal/contr/es/
source identifier: http://www.fao.org/termportal/contr/ar/
source creator: FAO terminology
source modified: 2010-06-24

featured in
type: ObjectProperty
range: Information Content Entity
description annot: This is done through a restriction on the foaf:Person class.
inverse of: features

has currency
type: DatatypeProperty

Peer Reviewer Role
type: Class
subclass of: Reviewer Role
example of usage: is a generic term for a process of self-regulation by a profession or a process of evaluation involving qualified individuals within the relevant field. Peer review methods are employed to maintain standards, improve performance and provide credibility. In academia the term is often used to denote a prepublication review of academic papers; reviewing an academic paper is often called refereeing. Contents [hide]
definition: A role of peer reviewing

Extension Unit
type: Class
subclass of: Organization
example of usage: Alachua County Extension Office
definition: A unit devoted primarily to extension activities, whether for outreach or research
definition: A unit devoted primarily to extension activities, whether for outreach or research.
imported from: VIVO-ISF Ontology version 1.6

distributor
type: ObjectProperty
description annot: Public Description for bibo:distributor taken from here: http://bibotools.googlecode.com/svn/bibo-ontology/trunk/doc/index.html .

nameCurrencyRU
source identifier: http://www.fao.org/termportal/contr/es/
source identifier: http://www.fao.org/termportal/contr/zh/
source modified: 2010-06-24
source identifier: http://www.fao.org/termportal/contr/fr/
source identifier: http://www.fao.org/termportal/contr/ar/
source creator: FAO terminology
source: FAO terminology http://www.fao.org/termportal/en/
source identifier: http://www.fao.org/termportal/en/
source identifier: http://www.fao.org/termportal/contr/en/
type: DatatypeProperty

Child
type: Class
subclass of: Relation Type

affirmed by
type: ObjectProperty
comment: A legal decision that affirms a ruling.
example of usage: The public description was taken from here: http://bibotools.googlecode.com/svn/bibo-ontology/trunk/doc/index.html

Organizational
type: Class
comment: These properties are concerned with information associated with characteristics of the organization or organizational units of the object that the vCard represents
equivalent class: Class
  intersection of: Class
    intersection of: Restriction
      on property: geo
      some values from: anyURI
    intersection of: Restriction
      max cardinality: 1
      on property: geo
  intersection of: Class
    intersection of: Restriction
      on property: timezone
      some values from: string
    intersection of: Restriction
      max cardinality: 1
      on property: timezone
  intersection of: Class
    intersection of: Restriction
      all values from: string
      on property: has language
    intersection of: Restriction
      max cardinality: 1
      on property: has language
  intersection of: Class
    intersection of: Restriction
      all values from: string
      on property: sort as
    intersection of: Restriction
      max cardinality: 1
      on property: sort as
equivalent class: Class
  intersection of: Class
    intersection of: Restriction
      on property: geo
      some values from: anyURI
    intersection of: Restriction
      max cardinality: 1
      on property: geo
  intersection of: Class
    intersection of: Restriction
      on property: timezone
      some values from: string
    intersection of: Restriction
      max cardinality: 1
      on property: timezone
  intersection of: Class
    intersection of: Restriction
      all values from: string
      on property: has language
    intersection of: Restriction
      max cardinality: 1
      on property: has language
  intersection of: Class
    intersection of: Restriction
      all values from: string
      on property: sort as
    intersection of: Restriction
      max cardinality: 1
      on property: sort as

Service Providing Lab
type: Class
subclass of: Laboratory
example of usage: Ideally a defined class -- a Laboratory the provides some Service via the property
definition: A laboratory that provides services
imported from: VIVO-ISF Ontology version 1.6

assigned by
type: ObjectProperty
definition: Relates a Relationship (as a predicate or n-ary relation over one or more Thing) to an Agent that defined or instantiated the predicate instance.

VCard Kind
type: Class
comment: The parent class for all vCard Objects
subclass of: Contact
equivalent class: Class
  intersection of: Class
    intersection of: Restriction
      all values from: Address
      on property: has address
    intersection of: Restriction
      min cardinality: 0
      on property: has address
  intersection of: Class
    intersection of: Restriction
      all values from: Email
      on property: has email
    intersection of: Restriction
      min cardinality: 0
      on property: has email
  intersection of: Class
    intersection of: Restriction
      all values from: Formatted Name
      on property: has formatted name
    intersection of: Restriction
      cardinality: 1
      on property: has formatted name
  intersection of: Class
    intersection of: Restriction
      all values from: Nickname
      on property: has nickname
    intersection of: Restriction
      min cardinality: 0
      on property: has nickname
  intersection of: Class
    intersection of: Restriction
      all values from: Telephone
      on property: has telephone
    intersection of: Restriction
      min cardinality: 0
      on property: has telephone
  intersection of: Class
    intersection of: Restriction
      all values from: Title
      on property: has title
    intersection of: Restriction
      min cardinality: 0
      on property: has title
  intersection of: Class
    intersection of: Restriction
      all values from: URL
      on property: has URL
    intersection of: Restriction
      min cardinality: 0
      on property: has URL
equivalent class: Class
  intersection of: Class
    intersection of: Restriction
      all values from: Address
      on property: has address
    intersection of: Restriction
      min cardinality: 0
      on property: has address
  intersection of: Class
    intersection of: Restriction
      all values from: Email
      on property: has email
    intersection of: Restriction
      min cardinality: 0
      on property: has email
  intersection of: Class
    intersection of: Restriction
      all values from: Formatted Name
      on property: has formatted name
    intersection of: Restriction
      cardinality: 1
      on property: has formatted name
  intersection of: Class
    intersection of: Restriction
      all values from: Nickname
      on property: has nickname
    intersection of: Restriction
      min cardinality: 0
      on property: has nickname
  intersection of: Class
    intersection of: Restriction
      all values from: Telephone
      on property: has telephone
    intersection of: Restriction
      min cardinality: 0
      on property: has telephone
  intersection of: Class
    intersection of: Restriction
      all values from: Title
      on property: has title
    intersection of: Restriction
      min cardinality: 0
      on property: has title
  intersection of: Class
    intersection of: Restriction
      all values from: URL
      on property: has URL
    intersection of: Restriction
      min cardinality: 0
      on property: has URL

lab data format
editor preferred term: lab data format
has curation status: IAO_0000120
definition source: PERSON: Melissa Haendel
domain: Class
  union of: Center
  union of: Laboratory
type: DatatypeProperty
definition: Current method or software used to inventory a lab's resources. Examples include Excel, index cards, FileMaker, 3-ring binder, etc.
example of usage: Excel spreadsheet
term editor: PERSON: Melissa Haendel
range: string
domain: Class
  union of: Center
  union of: Laboratory

Conclusion Textual Entity
imported from: iao.owl
definition: A textual entity that expresses the results of reasoning about a problem, for instance as typically found towards the end of scientific papers.
term editor: Person:Alan Ruttenberg
editor note: 2009/09/28 Alan Ruttenberg. Fucoidan-use-case
editor preferred term: conclusion textual entity
type: Class
editor note: 2009/10/23 Alan Ruttenberg: We need to work on the definition still
has curation status: IAO_0000120
example of usage: that fucoidan has a small statistically significant effect on AT3 level but no useful clinical effect as in-vivo anticoagulant, a paraphrase of part of the last paragraph of the discussion section of the paper 'Pilot clinical study to evaluate the anticoagulant activity of fucoidan', by Lowenthal et. al.PMID:19696660
subclass of: Information Content Entity

has short name
type: DatatypeProperty

has title
type: ObjectProperty
range: Title

Populated Place
type: Class
subclass of: Geopolitical Entity
definition: Either city or town - a thickly populated area having fixed boundaries and certain local powers of government.

Equipment
type: Class
subclass of: Material Entity
example of usage: server; Bruker Vector-33 FT-IR
example of usage: A network server is one example. Medical schools and research laboratories can list professional equipment, such as microscopes.
definition: A physical object provided for specific purpose, task or occupation.

locator
type: DatatypeProperty
comment: A description (often numeric) that locates an item within a containing document or collection.
example of usage: definition from: http://bibotools.googlecode.com/svn/bibo-ontology/trunk/doc/index.html
term status: stable

GDPYear
type: DatatypeProperty

Issued Credential
subclass of: Restriction
  all values from: Geographic Location
  on property: valid in
subclass of: Relationship
subclass of: Restriction
  all values from: Date/Time Value
  on property: expiration date
type: Class
subclass of: Restriction
  all values from: Literal
  on property: description
subclass of: Restriction
  on property: relates
  some values from: Agent
subclass of: Restriction
  all values from: Date/Time Value
  on property: date issued
subclass of: Restriction
  on property: relates
  some values from: Credential
subclass of: Restriction
  all values from: Thing
  on property: has subject area
subclass of: Restriction
  all values from: Geographic Location
  on property: valid in
subclass of: Restriction
  all values from: Date/Time Value
  on property: expiration date
subclass of: Restriction
  all values from: Literal
  on property: description
subclass of: Restriction
  on property: relates
  some values from: Agent
subclass of: Restriction
  all values from: Date/Time Value
  on property: date issued
subclass of: Restriction
  on property: relates
  some values from: Credential
subclass of: Restriction
  all values from: Thing
  on property: has subject area

health care provider ID
type: DatatypeProperty
domain: Person
range: string
sub property of: identifier

presented at event
type: ObjectProperty
comment: Relates a document to an event; for example, a paper to a conference.
domain: Document
range: Event
description annot: Public Description from source: http://bibotools.googlecode.com/svn/bibo-ontology/trunk/doc/index.html . Bibo considers the bibo:presents and the bibo:presentedAt unstable terms. It also indicates that bibo:presents is a sub-property of event:product.
inverse of: related documents
term status: unstable

Home
type: Class
comment: This implies that the property is related to an individual's personal life
subclass of: Type

imported from
type: AnnotationProperty

URL
type: DatatypeProperty
range: anyURI

Geographical
type: Class
comment: These properties are concerned with information associated with geographical positions or regions associated with the object the vCard represents
equivalent class: Class
  intersection of: Restriction
    all values from: string
    on property: sort as
  intersection of: Restriction
    max cardinality: 1
    on property: sort as
equivalent class: Class
  intersection of: Restriction
    all values from: string
    on property: sort as
  intersection of: Restriction
    max cardinality: 1
    on property: sort as

Unknown
type: Class
subclass of: Gender

Rate Unit
type: Class
subclass of: Measurement Unit Label

Brief
type: Class
comment: A written argument submitted to a court.
subclass of: Legal Case Document
definition: A document stating the facts and points of law of a client's case
term status: unstable

Voice
type: Class
subclass of: Telephone Type

has list name
type: DatatypeProperty

Amazon Standard Identification Number (ASIN)
type: DatatypeProperty
comment: Amazon Standard Identification Number
sub property of: identifier
example of usage: Amazon standard identification number. Source: http://en.wikipedia.org/wiki/Amazon_Standard_Identification_Number.
example of usage: 020530902X
term status: stable

Librarian
type: Class
subclass of: Person
definition: A person working in a position of librarian or information professional, or academic or technical expert in support of providing information services or materials.

model number
type: DatatypeProperty
definition source: PERSON: Melissa Haendel
has curation status: IAO_0000120
range: string
example of usage: ABI 9000
term editor: PERSON: Melissa Haendel
domain: Instrument
definition: Instrument model number, which may be a name, number, or both.
editor preferred term: model number

American Board of Pediatrics

Email
type: Class
comment: To specify the electronic mail address for communication with the object the vCard represents
subclass of: Communication
equivalent class: Class
  intersection of: Restriction
    all values from: string
    on property: email
  intersection of: Restriction
    min cardinality: 1
    on property: email
equivalent class: Class
  intersection of: Restriction
    all values from: string
    on property: email
  intersection of: Restriction
    min cardinality: 1
    on property: email

short description
type: DatatypeProperty
comment: A short description of the resource.
term status: unstable
scope note: The idea here is that while dcterms:description may involve length descriptions, this for short (two or three word) descriptions that could go in a bibliographic entry.

abstract
type: DatatypeProperty
comment: A summary of the resource.
domain: Information Content Entity
example of usage: http://bibotools.googlecode.com/svn/bibo-ontology/trunk/doc/index.html
term status: stable

School
type: Class
subclass of: Organization
example of usage: Definition take from here: http://dictionary.reference.com/browse/school.
example of usage: School of Architecture; School of Music
definition: An institution for instruction in a particular skill or field.
imported from: VIVO-ISF Ontology version 1.6

Type
type: Class
comment: This is called TYPE in vCard but renamed here to Context for less confusion (with types/class)
subclass of: Code

codeFAOTERM
source identifier: http://www.fao.org/termportal/contr/ar/
source identifier: http://www.fao.org/termportal/contr/fr/
source identifier: http://www.fao.org/termportal/contr/zh/
source identifier: http://www.fao.org/termportal/contr/en/
source: FAO terminology http://www.fao.org/termportal/en/
source creator: FAO terminology
type: DatatypeProperty
source modified: 2010-06-24
source identifier: http://www.fao.org/termportal/en/
source identifier: http://www.fao.org/termportal/contr/es/

yearMonthDayPrecision
type: Date/Time Value Precision
type: NamedIndividual
label: year-month-day value

issue
type: DatatypeProperty
domain: Article
sub property of: locator
example of usage: Bibo has the domain of bibo:issue as the class Issue, but an example on their site uses it with Article, referring to the issue number "4"

located in
type: ObjectProperty

Location
type: Class
subclass of: Spatial Region
example of usage: Use subclasses of core:Location when classsifying items.
example of usage: It's anticipated that the subclasses will be used when classifying items. And, all locations can be viewable via this class.
definition: Top level of all location classes.

has statistics
type: DatatypeProperty

population unit
type: DatatypeProperty

American Board of Physical Medicine and Rehabilitation

rank
type: DatatypeProperty
range: int
example of usage: this number indicates a position in a list

draft
type: Document Status
type: NamedIndividual

Formatted Name
type: Class
comment: Specifies the formatted text corresponding to the name of the object the vCard represents
subclass of: Identification
equivalent class: Class
  intersection of: Restriction
    on property: has formatted name
    some values from: string
  intersection of: Restriction
    cardinality: 1
    on property: has formatted name
equivalent class: Class
  intersection of: Restriction
    on property: has formatted name
    some values from: string
  intersection of: Restriction
    cardinality: 1
    on property: has formatted name

Material Entity
type: Class
subclass of: Independent Continuant

supports
type: ObjectProperty
description annot: general relationship of support

Telephone Type
type: Class
subclass of: Code

Newspaper
type: Class
comment: A periodical of documents, usually issued daily or weekly, containing current news, editorials, feature articles, and usually advertising.
subclass of: Periodical
example of usage: USA Today
definition: Contains news articles, opinions, features, advertising, and is usually issued daily or weekly
term status: stable

source
type: DatatypeProperty
range: string

overview
type: FunctionalProperty
type: DatatypeProperty
domain: Agent

description
type: AnnotationProperty
type: DatatypeProperty

American Board of Preventive Medicine

has measurement unit label
type: FunctionalProperty
type: ObjectProperty
range: Measurement Unit Label
sub property of: has part

Award or Honor
type: Class
subclass of: Concept
example of usage: Wiley Prize in Biomedical Sciences
example of usage: An Award or Honor
definition: An Award or Honor

subcontracted through
type: ObjectProperty
domain: Grant
range: Organization

recipient
type: ObjectProperty
comment: An agent that receives a communication document.
term status: stable

has nickname
type: ObjectProperty
range: Nickname

has subject area
type: ObjectProperty
sub property of: associated concept
inverse of: subject area of

American Board of Plastic Surgery

keywords
type: DatatypeProperty
example of usage: conservation use one freetextKeyword assertion for each keyword or phrase.
example of usage: one keyword or phrase per freetextKeyword assertion

Independent Continuant
type: Class
subclass of: Continuant

American Board of Radiology

unpublished
type: Document Status
type: NamedIndividual

identifier
type: DatatypeProperty
sub property of: identifier

Credential
type: Class
subclass of: Concept
subclass of: Restriction
  all values from: Thing
  on property: has subject area
subclass of: Restriction
  all values from: Organization
  on property: governing authority
subclass of: Restriction
  all values from: Geographic Location
  on property: valid in
example of usage: An attestation of qualification, competence, or authority issued to an individual by a third party with a relevant or de facto authority or assumed competence to do so.
definition: An attestation of qualification, competence, or authority issued to an individual by a third party with a relevant or de facto authority or assumed competence to do so.
subclass of: Restriction
  all values from: Thing
  on property: has subject area
subclass of: Restriction
  all values from: Organization
  on property: governing authority
subclass of: Restriction
  all values from: Geographic Location
  on property: valid in

inventory number
editor preferred term: has inventory number
definition: Inventory identifier for the resource.
has curation status: IAO_0000120
range: string
type: DatatypeProperty
term editor: PERSON: Melissa Haendel
domain: Class
  union of: Instrument
  union of: Biological Specimen
  union of: Organism
definition source: PERSON: Melissa Haendel
example of usage: An example inventory number can be in the form: 12345
domain: Class
  union of: Instrument
  union of: Biological Specimen
  union of: Organism

Conference Paper
type: Class
subclass of: Article
subclass of: Restriction
  all values from: Conference
  on property: presented at event
definition: A paper presented at a conference; optionally collected into a Proceedings or a special Journal issue
subclass of: Restriction
  all values from: Conference
  on property: presented at event

Occurrent
type: Class
subclass of: Entity

Collected Document
type: Class
comment: A document that simultaneously contains other documents.
subclass of: Document
subclass of: Restriction
  all values from: Organization
  on property: publisher
example of usage: Short Definition is the Medical Subject Heading (MeSH) definition
definition: Work consisting of collections of previously published works
term status: stable
subclass of: Restriction
  all values from: Organization
  on property: publisher

American Board of Psychiatry and Neurology

Relationship
type: Class
subclass of: Specifically Dependent Continuant
example of usage: functions as an n-ary predicate
definition: a reified relationship

has restriction
definition source: PERSON: Melissa Haendel
range: string
term editor: PERSON: Melissa Haendel
example of usage: Resource is only available to researchers in the department.
definition: A restriction on service availability, such as university or consortium affiliation, geographical location, professional certification, or other factors.
has curation status: IAO_0000120
type: DatatypeProperty
editor preferred term: has restriction
domain: Class
  union of: Instrument
  union of: Service
  union of: Reagent
  union of: Human Study
  union of: Biological Specimen
  union of: Software
  union of: Research Opportunity
  union of: Database
  union of: Organism
  union of: Document
domain: Class
  union of: Instrument
  union of: Service
  union of: Reagent
  union of: Human Study
  union of: Biological Specimen
  union of: Software
  union of: Research Opportunity
  union of: Database
  union of: Organism
  union of: Document

Division
type: Class
subclass of: Organization
subclass of: Extension Unit
example of usage: Cardiovascular Medicine (division within medicine)
example of usage: Definition modified from http://www.thefreedictionary.com/division. It is difficult to tell the difference between a division and a department.
definition: A major unit or section within a larger organization.
imported from: VIVO-ISF Ontology version 1.6

Newsletter
type: Class
subclass of: Periodical
example of usage: The Ornithological Newsletter
definition: Usually issued periodically, prepared by or for a group or institution to present information to a specific audience, often also made available to the press and public

contributor
type: ObjectProperty
range: Role
inverse of: contributes to

Continuant
type: Class
subclass of: Entity

Clinical Organization
type: Class
subclass of: Organization
example of usage: In the future we may be able to make this a defined class that would not need to be directly asserted, but the consensus seems to be that some organizations "are" clinical and some "are" research organizations and that the distinction is important enough to warrant the additional class and class assertions
definition: Any organization that offers significant health services or routinely provides medical care to patients.
definition: Any organization with a significant clinical function as a matter of course and not just through occasional clinical roles
imported from: VIVO-ISF Ontology version 1.6

Team
type: Class
subclass of: Group
example of usage: VIVO Outreach Team; VIVO Ontology Team
definition: An informal organization brought together for the purposes of a project or event
definition: A group of people working together.
imported from: VIVO-ISF Ontology version 1.6

Thesis Degree
type: Class
comment: The academic degree of a Thesis
subclass of: Academic Degree
example of usage: Different from general academic degree, thesis degree is achieved through one's completed thesis. Thesis is a document submitted in support of candidature for a degree or professional qualification presenting the author's research and findings(http://en.wikipedia.org/wiki/Thesis_or_dissertation).
example of usage: Doctor of Philosophy (Ph.D.)
definition: The academic degree of a Thesis.
term status: stable

Center
type: Class
subclass of: Organization
example of usage: Alchohol Education Center; Center for Arts and Public Policy; Hearing Research Center
example of usage: Short Definition take from http://www.thefreedictionary.com/center.
definition: A place where a particular activity or service is concentrated.
definition: An organization where a specified activity is concentrated.
imported from: VIVO-ISF Ontology version 1.6

countryArea
source identifier: http://faostat.fao.org/DesktopDefault.aspx#ancor
source modified: 2011-07-21
description: Country area, area of the country including area under inland water bodies, but excluding offshore territorial waters. Possible variations in the data may be due to updating and revisions of the country data and not necessarily to any change of area. Data are expressed in 1000 hectares. http://faostat.fao.org/site/375/default.aspx
type: DatatypeProperty
source: FAOSTAT http://faostat.fao.org/DesktopDefault.aspx?PageID=377&lang=en#ancor
source creator: FAOSTAT

Date/Time Value Precision
type: Class
subclass of: Concept
definition: Indicates the precision of the value of a DateTimeValue instance.

has specified output
editor preferred term: has_specified_output
term editor: PERSON: Melanie Courtot
inverse of: is specified output of
domain: Planned Process
type: ObjectProperty
term editor: PERSON: Bjoern Peters
term editor: PERSON: Alan Ruttenberg
term editor: PERSON: Larry Hunter
sub property of: has output
definition: A relation between a planned process and a continuant participating in that process. The presence of the continuant at the end of the process is explicitly specified in the objective specification which the process realizes the concretization of.

proceedings of
type: ObjectProperty
domain: Proceedings
range: Conference
description annot: A possible working example: The conference proceeding of the SPIE was generated from the conference - International Society for Optical Engineering.
inverse of: proceedings

has geographic restriction
example of usage: Resource is only available to researchers in Boston area.
term editor: PERSON: Melissa Haendel
type: DatatypeProperty
range: string
definition: Any service limitation tied to geographically-defined areas such as metro areas, counties, states, or regions.
has curation status: IAO_0000120
editor preferred term: has geographic restriction
sub property of: has restriction
domain: Service
definition source: PERSON: Melissa Haendel

American Board of Thoracic Surgery

is successor of
type: ObjectProperty
domain: Area
range: Area
source creator: United Nations Statistics Division
source identifier: http://unstats.un.org/unsd/methods/m49/m49chgef.htm
source identifier: http://unstats.un.org/unsd/methods/m49/m49chang.htm
source modified: 2010-04-15
source: United Nations Statistics Division http://unstats.un.org/unsd/methods/m49/m49chang.htm

Entity
type: Class

date/time precision
type: ObjectProperty
domain: Date/Time Value
range: Date/Time Value Precision

American Board of Surgery

Database
type: Class
subclass of: Collected Document
subclass of: Restriction
  all values from: Organization
  on property: publisher
example of usage: PubMed
example of usage: Short Definition is the Medical Subject Heading (MeSH) definition
definition: A structured file of information or a set of logically related data stored and retrieved using computer-based means
subclass of: Restriction
  all values from: Organization
  on property: publisher

has prerequisite
type: ObjectProperty
domain: Course
range: Course
inverse of: prerequisite for

Presenting Process
type: Class
subclass of: Process

valid in
type: ObjectProperty
range: Geographic Location

is quality measurement of
term editor: Alan Ruttenberg
range: Quality
domain: Measurement Datum
editor note: This one is the one we are struggling with at the moment. The issue is what a measurement measures. On the one hand saying that it measures the quality would include it "measuring" the bearer = referring to the bearer in the measurement. However this makes comparisons of two different things not possible. On the other hand not having it inhere in the bearer, on the face of it, breaks the audit trail. Werner suggests a solution based on "Magnitudes" a proposal for which we are awaiting details.
editor note: From the second IAO workshop [Alan Ruttenberg 8/6/2009: not completely current, though bringing in comparison is probably important] This one is the one we are struggling with at the moment. The issue is what a measurement measures. On the one hand saying that it measures the quality would include it "measuring" the bearer = referring to the bearer in the measurement. However this makes comparisons of two different things not possible. On the other hand not having it inhere in the bearer, on the face of it, breaks the audit trail. Werner suggests a solution based on "Magnitudes" a proposal for which we are awaiting details. -- From the second IAO workshop, various comments, [commented on by Alan Ruttenberg 8/6/2009] unit of measure is a quality, e.g. the length of a ruler. [We decided to hedge on what units of measure are, instead talking about measurement unit labels, which are the information content entities that are about whatever measurement units are. For IAO we need that information entity in any case. See the term measurement unit label] [Some struggling with the various subflavors of is_about. We subsequently removed the relation represents, and describes until and only when we have a better theory] a represents b means either a denotes b or a describes describe: a describes b means a is about b and a allows an inference of at least one quality of b We have had a long discussion about denotes versus describes.
editor note: From the second meeting on IAO: An attempt at defining assay using Barry's "reliability" wording assay: process and has_input some material entity and has_output some information content entity and which is such that instances of this process type reliably generate outputs that describes the input.
editor note: From the second IAO workshop: An attempt at tieing the quality to the measurement datum more carefully. a is a magnitude means a is a determinate quality particular inhering in some bearer b existing at a time t that can be represented/denoted by an information content entity e that has parts denoting a unit of measure, a number, and b. The unit of measure is an instance of the determinable quality.
definition: m is a quality measurement of q at t when q is a quality there is a measurement process p that has specified output m, a measurement datum, that is about q
type: ObjectProperty
sub property of: is about
editor note: 8/6/2009 Alan Ruttenberg: The strategy is to be rather specific with this relationship. There are other kinds of measurements that are not of qualities, such as those that measure time. We will add these as separate properties for the moment and see about generalizing later

Conference
example of usage: 2010 International Congress on Autoimmunity; American Libraries Association 2009
example of usage: core:Seminar and bibo:Conference are very similar.
comment: A meeting for consultation or discussion.
subclass of: Event
type: Class
subclass of: Restriction
  all values from: Literal
  on property: abbreviation
term status: stable
definition: A meeting for consultation or discussion.
subclass of: Restriction
  all values from: Literal
  on property: abbreviation

Calendar
type: Class
equivalent class: Class
  intersection of: Class
    intersection of: Restriction
      on property: geo
      some values from: anyURI
    intersection of: Restriction
      max cardinality: 1
      on property: geo
  intersection of: Class
    intersection of: Restriction
      on property: timezone
      some values from: string
    intersection of: Restriction
      max cardinality: 1
      on property: timezone
equivalent class: Class
  intersection of: Class
    intersection of: Restriction
      on property: geo
      some values from: anyURI
    intersection of: Restriction
      max cardinality: 1
      on property: geo
  intersection of: Class
    intersection of: Restriction
      on property: timezone
      some values from: string
    intersection of: Restriction
      max cardinality: 1
      on property: timezone

Department
type: Class
subclass of: Organization
example of usage: Definition modified from the definition here: http://dictionary.reference.com/browse/department. It is difficult to tell the difference between and department and a division.
example of usage: Legal (department within a company); Use for any non-academic department
definition: A unit within a larger organization that addresses a specific subject or area of activity.
imported from: VIVO-ISF Ontology version 1.6

has output
type: ObjectProperty
sub property of: has participant
inverse of: output of

Document Status
type: Class
comment: The status of the publication of a document.
example of usage: submitted; accepted; in-press; published; invited; refereed.
example of usage: The status of a document with respect to its publication. The statuses are represented as individuals of this class. Use the "show all individuals of this class" button on the class control panel to see the currently defined statuses.
definition: The status of a document with respect to its publication.
term status: stable

Private Company
type: Class
subclass of: Company
example of usage: Publix Super Markets; Ernst & Young; PricewaterhouseCoopers
example of usage: Definition obtained here: http://answers.ask.com/Business/Finance/what_is_a_private_company. Examples of private companies found here: http://www.forbes.com/2008/11/03/largest-private-companies-biz-privates08-cx_sr_1103private_land.html
definition: A private company is one that is privately-owned, and thus, is not publicly-traded in the stock market. Members of the general public cannot purchase stock in a private company unless that company chooses to go public and become a public company.
imported from: VIVO-ISF Ontology version 1.6

performs human study
type: ObjectProperty
range: Human Study
definition: Human study performed by the organization.
editor preferred term: performs human study
term editor: PERSON: Melissa Haendel
inverse of: performed by organization
domain: Organization
definition source: PERSON: Melissa Haendel
has curation status: IAO_0000120
example of usage: The Jackson Heart Institute performs human studies on heart disease.

Academic Degree
type: Class
subclass of: Concept
subclass of: Restriction
  min cardinality: 1
  on property: abbreviation
subclass of: Restriction
  all values from: Literal
  on property: abbreviation
example of usage: B.A. Bachelor of Arts
example of usage: This list may have multiple abbreviations for some degrees.
definition: An academic degree at any level, both as reported by individuals for employment and as offered by academic degree programs.
subclass of: Restriction
  min cardinality: 1
  on property: abbreviation
subclass of: Restriction
  all values from: Literal
  on property: abbreviation

Scalar Measurement Datum
editor note: Would write this as: has_part some 'measurement unit label' and has_part some numeral and has_part exactly 2, except for the fact that this won't let us take advantage of OWL reasoning over the numbers. Instead use has measurment value property to represent the same. Use has measurement unit label (subproperty of has_part) so we can easily say that there is only one of them.
term editor: PERSON: Melanie Courtot
subclass of: Measurement Datum
type: Class
definition: a scalar measurement datum is a measurement datum that is composed of two parts, numerals and a unit label.
term editor: PERSON: Alan Ruttenberg
has curation status: IAO_0000120
example of usage: 10 feet. 3 ml.
editor note: 2009-03-16: we decided to keep datum singular in scalar measurement datum, as in this case we explicitly refer to the singular form

State or Province
type: Class
subclass of: Geopolitical Entity
example of usage: Minnesota; Michigan; Indiana; New York; Quebec; Manitoba; Ontario
example of usage: Source of the Short Definition: http://www.thefreedictionary.com/state.
definition: One of a number of areas or communities having their own governments and forming a federation under a sovereign government, as in the US.

end page
type: DatatypeProperty
comment: Ending page number within a continuous page range.
sub property of: locator
term status: stable

American Board of Urology

has input
type: ObjectProperty
sub property of: has participant

is predecessor of
source identifier: http://unstats.un.org/unsd/methods/m49/m49chgef.htm
source creator: United Nations Statistics Division
source modified: 2010-04-15
domain: Area
source: United Nations Statistics Division http://unstats.un.org/unsd/methods/m49/m49chang.htm
source identifier: http://unstats.un.org/unsd/methods/m49/m49chang.htm
range: Area
inverse of: is successor of
type: ObjectProperty

Date
type: Class
subclass of: Relation Type

Decision
type: Class
comment: A document containing an authoritative determination (as a decree or judgment) made after consideration of facts or law.
subclass of: Legal Case Document
definition: The written determination of a case, motion or claim by a court or tribunal
term status: unstable

Photo
type: Class
comment: Specifies an image or photograph information that annotates some aspect of the object the vCard represents
subclass of: Identification
equivalent class: Class
  intersection of: Restriction
    on property: photo
    some values from: anyURI
  intersection of: Restriction
    min cardinality: 1
    on property: photo
equivalent class: Class
  intersection of: Restriction
    on property: photo
    some values from: anyURI
  intersection of: Restriction
    min cardinality: 1
    on property: photo

has global citation frequency
type: ObjectProperty
range: Global Citation Count
definition: A property linking a publication entity to an instance of c40:GlobalCitationCount that specifies how many times a work has been cited by others, according to a particular information source on a particular date.
description annot: A property linking a publication entity to the property c40:GlobalCitationCount that specify how many times a work has been cited by others, according to a particular information source on a particular date.

honorific suffix
type: DatatypeProperty
domain: Name
range: string

Audio-Visual Document
type: Class
comment: An audio-visual document; film, video, and so forth.
subclass of: Document
subclass of: Restriction
  all values from: Organization
  on property: distributor
example of usage: film; video; Blu-ray
definition: Audiovisual recording in any format
term status: stable
subclass of: Restriction
  all values from: Organization
  on property: distributor

Geographic Region
type: Class
subclass of: Geographic Location
example of usage: Removed the word "stable" because disputed territories from geopolitical.owl are included. This could imply that the geographic coordinates could change. This definition was originally in core:Geographic Location. I simply copied the definition from there. I think core:Geographic Location and core:Geographic Region are both the same and only one is needed. There is also geopolitical.owl:geographical_region which further causes confusion.
example of usage: Use subclasses of core:Geographic Region subclasses instead of this class if possible.
definition: A location having coordinates in geographic space.

Directive Information Entity
subclass of: Information Content Entity
term editor: PERSON: Bjoern Peters
editor note: Werner pushed back on calling it realizable information entity as it isn't realizable. However this name isn't right either. An example would be a recipe. The realizable entity would be a plan, but the information entity isn't about the plan, it, once concretized, *is* the plan. -Alan
type: Class
definition: An information content entity whose concretizations indicate to their bearer how to realize them in a process.
imported from: iao.owl
has curation status: IAO_0000123
editor note: 8/6/2009 Alan Ruttenberg: Changed label from "information entity about a realizable" after discussions at ICBO
term editor: PERSON: Alan Ruttenberg

FileByteStream

has border with
type: ObjectProperty
source creator: United Nations cartographic maps
source identifier: http://www.un.org/Depts/Cartographic/map/profile/world00.pdf
source modified: 2010-05-01
source: United Nations cartographic maps http://www.un.org/Depts/Cartographic/map/profile/world00.pdf

Awarded Degree
type: Class
subclass of: Relationship
subclass of: Restriction
  on property: relates
  some values from: Person
subclass of: Restriction
  on property: relates
  some values from: Academic Degree
definition: The awarding of a degree by an agent to another agent. It is mostly for academic degrees.
subclass of: Restriction
  on property: relates
  some values from: Person
subclass of: Restriction
  on property: relates
  some values from: Academic Degree

Funding Organization
type: Class
subclass of: Organization
example of usage: National Institute of Health (NIH)
definition: A defined class of organizations that fund Grants
definition: An organization that provides financial support to individuals or organizations to carry out specified activities.
imported from: VIVO-ISF Ontology version 1.6
equivalent class: Restriction
  on property: assigns
  some values from: Grant
equivalent class: Restriction
  on property: assigns
  some values from: Grant

Information Content Entity
subclass of: Restriction
  all values from: Geographic Region
  on property: geographic focus
term editor: PERSON: Chris Stoeckert
definition source: OBI_0000142
subclass of: Generically Dependent Continuant
subclass of: Restriction
  all values from: Thing
  on property: has subject area
editor preferred term: information content entity
subclass of: Restriction
  all values from: Literal
  on property: keywords
definition: The most general classification of an information resource
subclass of: Restriction
  on property: is about
  some values from: Entity
type: Class
example of usage: Examples of information content entites include journal articles, data, graphical layouts, and graphs.
editor note: information_content_entity 'is_encoded_in' some digital_entity in obi before split (040907). information_content_entity 'is_encoded_in' some physical_document in obi before split (040907). Previous. An information content entity is a non-realizable information entity that 'is encoded in' some digital or physical entity.
subclass of: Restriction
  all values from: Date/Time Value
  on property: date/time value
has curation status: IAO_0000125
imported from: iao.owl
definition: an information content entity is an entity that is generically dependent on some artifact and stands in relation of aboutness to some entity
subclass of: Restriction
  all values from: Geographic Region
  on property: geographic focus
subclass of: Restriction
  all values from: Thing
  on property: has subject area
subclass of: Restriction
  all values from: Literal
  on property: keywords
subclass of: Restriction
  on property: is about
  some values from: Entity
subclass of: Restriction
  all values from: Date/Time Value
  on property: date/time value

Student Organization
type: Class
subclass of: Organization
example of usage: Definition take from here: http://en.wikipedia.org/wiki/Student_society
example of usage: Dancin' Gators
definition: A student organization is an organization, operated by students at a university, whose membership normally consists only of students.
imported from: VIVO-ISF Ontology version 1.6

is specified output of
type: ObjectProperty
range: Planned Process
sub property of: output of
editor preferred term: is_specified_output_of
definition: A relation between a planned process and a continuant participating in that process. The presence of the continuant at the end of the process is explicitly specified in the objective specification which the process realizes the concretization of.
term editor: PERSON:Bjoern Peters
term editor: Alan Ruttenberg

Electronic International Standard Serial Number (EISSN)
type: DatatypeProperty
comment: The electronic ISSN number of a periodical.
sub property of: identifier
example of usage: eissn stands for Electronic International Standard Serial Number. source: http://www.definition-of.com/EISSN
term status: stable

has specified input
domain: Planned Process
term editor: PERSON: Larry Hunter
definition: A relation between a planned process and a continuant participating in that process that is not created during the process. The presence of the continuant during the process is explicitly specified in the plan specification which the process realizes the concretization of.
editor preferred term: has_specified_input
term editor: PERSON: Bjoern Peters
term editor: PERSON: Alan Ruttenberg
example of usage: see is_input_of example_of_usage
type: ObjectProperty
term editor: PERSON: Melanie Coutot
sub property of: has input
editor note: 8/17/09: specified inputs of one process are not necessarily specified inputs of a larger process that it is part of. This is in contrast to how 'has participant' works.

Institute
type: Class
subclass of: Organization
example of usage: Institute for Fundamental Theory
definition: An organization founded to pursue or promote certain research, educational or public policy interests or activities.
definition: An Institute normally has a research focus but may also fulfill instructional or outreach roles
imported from: VIVO-ISF Ontology version 1.6

has address
type: ObjectProperty
range: Address

Funding Role
type: Class
subclass of: Role
example of usage: The NIH is a funding agency.
has curation status: IAO_0000120
definition: A role inhering in a person or organization that is realized when the bearer participates in providing funding to a person or an organization for academic or business purposes.
term editor: PERSON: Nicole Vasilevsky
definition source: PERSON: Nicole Vasilevsky

seating capacity
type: FunctionalProperty
type: DatatypeProperty
domain: Room
range: int
example of usage: 55
example of usage: definition modified from: source (http://en.wikipedia.org/wiki/Seating_capacity).

Sibling
type: Class
subclass of: Relation Type

Sweetheart
type: Class
subclass of: Relation Type

Conference Poster
type: Class
subclass of: Document
definition: The digital file (or physical equivalent), if available after the conference, vs. the act of attending/presenting: use ConferencePresentation for information about date/time/location/name of the event where the poster was presented

anniversary
type: DatatypeProperty
comment: The date of marriage, or equivalent, of the object the vCard represents
domain: Individual
range: dateTime

middle name or initial
type: DatatypeProperty

Educator Role
type: Class
subclass of: Role
example of usage: A teacher.
has curation status: IAO_0000120
definition: A role inhering in a person or organization that is realized when the bearer participates in providing education to a student or group of students.
term editor: PERSON: Nicole Vasilevsky
definition source: PERSON: Nicole Vasilevsky

agriculturalAreaTotal
type: DatatypeProperty

URL
type: Class
comment: To specify a uniform resource locator associated with the object to which the vCard refers. Examples for individuals include personal web sites, blogs, and social networking site identifiers.
subclass of: Explanatory
equivalent class: Class
  intersection of: Restriction
    all values from: anyURI
    on property: URL
  intersection of: Restriction
    min cardinality: 1
    on property: URL
equivalent class: Class
  intersection of: Restriction
    all values from: anyURI
    on property: URL
  intersection of: Restriction
    min cardinality: 1
    on property: URL

term type
type: DatatypeProperty

Image
type: Class
comment: A document that presents visual or diagrammatic information.
subclass of: Document
example of usage: photograph; diagram
definition: A visual representation such as a photograph or graph
term status: stable

Award or Honor Receipt
definition: The bestowal of an award, honor, or distinction to a person or person's at a particular time.
subclass of: Restriction
  all values from: Date/Time Interval
  on property: date/time interval
subclass of: Restriction
  on property: relates
  some values from: Agent
subclass of: Restriction
  all values from: Date/Time Value
  on property: date/time value
subclass of: Restriction
  all values from: Organization
  on property: assigned by
subclass of: Restriction
  all values from: Literal
  on property: description
type: Class
subclass of: Relationship
example of usage: The award bestowed may be represented with the Award class.
subclass of: Restriction
  on property: relates
  some values from: Award or Honor
subclass of: Restriction
  all values from: Date/Time Interval
  on property: date/time interval
subclass of: Restriction
  on property: relates
  some values from: Agent
subclass of: Restriction
  all values from: Date/Time Value
  on property: date/time value
subclass of: Restriction
  all values from: Organization
  on property: assigned by
subclass of: Restriction
  all values from: Literal
  on property: description
subclass of: Restriction
  on property: relates
  some values from: Award or Honor

Co-Principal Investigator Role
type: Class
subclass of: Investigator Role
definition: Role of co-principal investigator of an Agreement (for example, a grant), who devotes a specified percentage of time and is considered key personnel.

license number
type: DatatypeProperty
domain: Licensure

Logo
type: Class
comment: To specify a graphic image of a logo associated with the object the vCard represents
subclass of: Organizational
equivalent class: Class
  intersection of: Restriction
    on property: logo
    some values from: anyURI
  intersection of: Restriction
    min cardinality: 1
    on property: logo
equivalent class: Class
  intersection of: Restriction
    on property: logo
    some values from: anyURI
  intersection of: Restriction
    min cardinality: 1
    on property: logo

used to study
type: ObjectProperty
editor preferred term: used to study
example of usage: A study of hibernation in bears.
has curation status: IAO_0000120
definition: Biological process studied in the organism.
term editor: PERSON: Melissa Haendel
definition source: PERSON: Melissa Haendel

Global Trade Item Number (GTIN-14)
type: DatatypeProperty
comment: Global Trade Item Number 14
sub property of: identifier
example of usage: http://en.wikipedia.org/wiki/Global_Trade_Item_Number.
term status: stable

Advising Relationship
type: Class
subclass of: Relationship
subclass of: Restriction
  all values from: Thing
  on property: has subject area
subclass of: Restriction
  on property: relates
  some values from: Advisee Role
subclass of: Restriction
  all values from: Date/Time Interval
  on property: date/time interval
subclass of: Restriction
  on property: relates
  some values from: Person
subclass of: Restriction
  on property: relates
  some values from: Advisor Role
definition: A dual relationship of one person being advised or mentored by another person, typically including start and end dates
subclass of: Restriction
  all values from: Thing
  on property: has subject area
subclass of: Restriction
  on property: relates
  some values from: Advisee Role
subclass of: Restriction
  all values from: Date/Time Interval
  on property: date/time interval
subclass of: Restriction
  on property: relates
  some values from: Person
subclass of: Restriction
  on property: relates
  some values from: Advisor Role

entry term
type: DatatypeProperty

Fax
type: Class
subclass of: Telephone Type

performed by organization
sub property of: has agent
definition source: PERSON: Melissa Haendel
domain: Human Study
term editor: PERSON: Melissa Haendel
editor preferred term: human study performed by
example of usage: Jackson State University performs human studies on heart disease.
type: ObjectProperty
definition: Organization that performs the human study.
has curation status: IAO_0000120
range: Organization

populationYear
type: DatatypeProperty

Category
type: Class
comment: To specify application category information about the vCard, also known as tags. This was called CATEGORIES in vCard.
subclass of: Explanatory
equivalent class: Class
  intersection of: Restriction
    all values from: string
    on property: category
  intersection of: Restriction
    min cardinality: 1
    on property: category
equivalent class: Class
  intersection of: Restriction
    all values from: string
    on property: category
  intersection of: Restriction
    min cardinality: 1
    on property: category

interviewer
type: ObjectProperty
comment: An agent that interview another agent.
term status: stable

None
type: Class
subclass of: Gender

codeUNDP
type: DatatypeProperty

Site
type: Class
subclass of: Immaterial Entity

FOAF (Friend of a Friend)

has maximum latitude
type: DatatypeProperty

Date/Time Interval
type: Class
subclass of: One-Dimensional Temporal Region
definition: a specific period or duration, defined by (optional) start and end date/times.

photo
type: DatatypeProperty
domain: Photo
range: anyURI

Study Design
type: Class
subclass of: Plan Specification
editor preferred term: study design
definition: A study design is a plan specification comprised of protocols (which may specify how and what kinds of data will be gathered) that are executed as part of an investigation and is realized during a study design execution.
imported from: obi.owl

Abstract
type: Class
subclass of: Document
definition: An abstract that is published as a standalone document or in a journal of abstracts

Organizing Process
type: Class
subclass of: Process

Screenplay
type: Class
subclass of: Document
definition: Written script for a film production, including dialogue and descriptions of gestures, actions, shooting directions

valid since
type: DatatypeProperty
comment: The value of the datatype property *validSince* associated to a particular area (territory or group) indicates the area's first year of validity. The geopolitical ontology traces back historic changes only until 1985, therefore, if an area has a validSince = 1985, this indicates that the area is/was valid since 1985 or before.

Editorial Article
type: Class
subclass of: Article
definition: An article of opinion, typically published in a newspaper. For academics, most commonly Op Ed pieces

Neighbor
type: Class
subclass of: Relation Type

Phase 4 Clinical Trial
type: Class
subclass of: Clinical Trial
definition: In Phase 4 trials, post marketing studies delineate additional information including the drug's or treatment's risks, benefits, and optimal use.
definition: Phase 4 Clinical Trial

ORCID iD
type: ObjectProperty
domain: Person
example of usage: This is now an object property where the object value is a resource of the form <http://orcid.org/NNNN-NNNN-NNNN-NNNN>. This is to support connecting VIVO and ORCID in the linked data web. Note: a person can have multiple ORCID iDs.

has facility
range: Facility

Immaterial Entity
type: Class
subclass of: Independent Continuant

nameListFR
source: FAO terminology http://www.fao.org/termportal/en/
source identifier: http://www.fao.org/termportal/en/
source identifier: http://www.fao.org/termportal/contr/ar/
source modified: 2010-06-24
source identifier: http://www.fao.org/termportal/contr/fr/
source creator: FAO terminology
source identifier: http://www.fao.org/termportal/contr/es/
source identifier: http://www.fao.org/termportal/contr/en/
type: DatatypeProperty
source identifier: http://www.fao.org/termportal/contr/zh/

Slideshow
type: Class
comment: A presentation of a series of slides, usually presented in front of an audience with written text and images.
subclass of: Document
example of usage: Short Definition from the bibo ontology
definition: A presentation of a series of slides, usually presented in front of an audience with written text and images
term status: stable

equipment for
type: ObjectProperty
domain: Equipment
range: Organization
sub property of: deprecated op

geographic focus
type: ObjectProperty
range: Geographic Region

codeGAUL
type: DatatypeProperty
source creator: Global Administrative Unit Layers
source identifier: http://www.fao.org/geonetwork/srv/en/metadata.show
source modified: 2008-12-10
source: Global Administrative Unit Layers http://www.fao.org/geonetwork/srv/en/metadata.show?id=12691

Bibliographic Information Source
type: Class
subclass of: Database
definition: A source of information about bibliographic citations, such as Google Scholar, Web of Science or Scopus.
description annot: A source of information about bibliographic citations, such as Google Scholar, Web of Science or Scopus.

Spouse
type: Class
subclass of: Relation Type

Academic Department
type: Class
subclass of: Department
example of usage: Endodontics (department within a College of Dentistry); English (department within a College of Liberal Arts)
definition: A distinct, usually specialized educational unit within an educational organization.
imported from: VIVO-ISF Ontology version 1.6

published in
type: ObjectProperty
inverse of: publication venue for

example of usage
type: AnnotationProperty

Grant
subclass of: Relationship
subclass of: Restriction
  on property: relates
  some values from: Agent
example of usage: An intramural or extramural award to support scholarly work, such as UF09179 (VIVO)
subclass of: Restriction
  all values from: Date/Time Interval
  on property: date/time interval
subclass of: Restriction
  all values from: Literal
  on property: abstract
type: Class
definition: Financial assistance mechanism providing money, property, or both to an eligible entity to carry out an approved project or activity
subclass of: Restriction
  on property: relates
  some values from: Role
subclass of: Restriction
  all values from: Information Content Entity
  on property: supported publications or other works
subclass of: Restriction
  all values from: Organization
  on property: assigned by
example of usage: Short definition is from the Glossary of NIH Terms.
subclass of: Restriction
  on property: relates
  some values from: Agent
subclass of: Restriction
  all values from: Date/Time Interval
  on property: date/time interval
subclass of: Restriction
  all values from: Literal
  on property: abstract
subclass of: Restriction
  on property: relates
  some values from: Role
subclass of: Restriction
  all values from: Information Content Entity
  on property: supported publications or other works
subclass of: Restriction
  all values from: Organization
  on property: assigned by

Score
type: Class
subclass of: Document
definition: Written musical composition for voice or instruments or both

nameOfficialZH
source modified: 2010-06-24
source identifier: http://www.fao.org/termportal/contr/ar/
source creator: FAO terminology
type: DatatypeProperty
source identifier: http://www.fao.org/termportal/contr/fr/
source identifier: http://www.fao.org/termportal/contr/es/
source identifier: http://www.fao.org/termportal/contr/zh/
source: FAO terminology http://www.fao.org/termportal/en/
source identifier: http://www.fao.org/termportal/en/
source identifier: http://www.fao.org/termportal/contr/en/

major field of degree
type: DatatypeProperty
domain: Educational Process
example of usage: Information Science; Computer Science; Anthropology

FOAF Profile
type: Class
subclass of: Contact

Universal Product Code (UPC)
type: DatatypeProperty
comment: Universal Product Code
sub property of: identifier
example of usage: source for public description: http://en.wikipedia.org/wiki/Universal_Product_Code.
term status: stable

realizes protocol
comment: placeholder: need to be modeled for the proper kind of service (production services)
has curation status: IAO_0000120
range: Protocol
editor preferred term: realizes protocol
example of usage: A sequencing protocol used for next generation sequencing.
term editor: PERSON: Melissa Haendel
type: ObjectProperty
definition source: PERSON: Melissa Haendel
definition: Protocol used to perform the service.
domain: Class
  union of: Service
  union of: Research Project
domain: Class
  union of: Service
  union of: Research Project

editor preferred term
type: AnnotationProperty

Clinical Trial
type: Class
subclass of: Interventional study
example of usage: A clinical trial to evaluate the efficacy of a new drug.
has curation status: IAO_0000120
definition: An interventional study that contains a set of procedures in medical research and drug development that are conducted to allow safety (or more specifically, information about adverse drug reactions and adverse effects of other treatments) and efficacy data to be collected for health interventions (e.g., drugs, diagnostics, devices, therapy protocols) that is performed over phases.
term editor: PERSON: Nicole Vasilevsky
definition source: http://en.wikipedia.org/wiki/Clinical_trial
equivalent class: Class
  intersection of: Interventional study
  intersection of: Restriction
    on property: has phase
    some values from: Phase
equivalent class: Class
  intersection of: Interventional study
  intersection of: Restriction
    on property: has phase
    some values from: Phase

sort as
type: DatatypeProperty
range: string

Competition
type: Class
subclass of: Event
example of usage: Not the same as an award or distinction.
example of usage: Intel Talent Search; poetry contest
definition: An occasion on which a winner is selected from among two or more contestants.

count per year
type: Rate Unit
type: NamedIndividual

has phase
type: ObjectProperty
range: Phase
term editor: PERSON: Melissa Haendel
definition: Phase of a clinical trial to evaluate risk and to clinically evaluate the efficacy of drugs or biologicals.
definition source: PERSON: Melissa Haendel
domain: Clinical Trial
has curation status: IAO_0000120
editor preferred term: has phase
example of usage: Phase 1 clinical trial.

Contact Qualifier
type: Class
subclass of: Concept

has URL
type: ObjectProperty
range: URL

uses software
term editor: PERSON: Melissa Haendel
sub property of: deprecated property
example of usage: Sequence analysis software.
definition source: PERSON: Melissa Haendel
domain: Service
deprecated: true
type: ObjectProperty
definition: Software used to perform the service.
editor preferred term: uses software
comment: Placeholder needs to be redesign
has curation status: IAO_0000120
range: Software

has curation status
type: AnnotationProperty

Vitro internals

Contact
type: Class
subclass of: Information Content Entity

Internship
type: Class
subclass of: Educational Process
definition: Typically a student or a recent graduate undergoing supervised practical training.

Relation Type
type: Class
subclass of: Code

Library of Congress Control Number (LCCN)
type: DatatypeProperty
comment: Library of Congress Control Number
sub property of: identifier
example of usage: Source: http://en.wikipedia.org/wiki/Library_of_Congress_Control_Number.
term status: stable

VCard

Standard
type: Class
comment: A document describing a standard
subclass of: Document
example of usage: Short Definition from OCLC Input Standards, EntW
definition: A specification giving a precise statement of a process or a service requirement, often sanctioned by a nation or industry
term status: stable

Core Laboratory
type: Class
subclass of: Service Providing Lab
definition: A lab providing services such as training, protocols, or access to instruments or software

broader concept
type: ObjectProperty
domain: Concept
range: Concept
definition: Public description modified from the information on this page: http://www.w3.org/TR/2005/WD-swbp-skos-core-guide-20050510/#sechierarchy .
description annot: Public description modified from the information on this page: http://www.w3.org/TR/2005/WD-swbp-skos-core-guide-20050510/#sechierarchy .
inverse of: narrower concept

Leader Role
type: Class
subclass of: Role
example of usage: A broad-ranging leader concept, from leading a small temporary committee to head of a large international organization.
definition: A leadership role

Advising Process
type: Class
subclass of: Process

Investigator Role
type: Class
subclass of: Researcher Role
definition: A role in an Agreement (for example, a grant) as a named investigator or key personnel.

Webpage
type: Class
comment: A web page is an online document available (at least initially) on the world wide web. A web page is written first and foremost to appear on the web, as distinct from other online resources such as books, manuscripts or audio documents which use the web primarily as a distribution mechanism alongside other more traditional methods such as print.
subclass of: Document
definition: One section of a website that appears at a unique address within the parent site's address or URL on the World Wide Web
term status: unstable

country area notes
type: DatatypeProperty

Service Provider Role
definition: A role inhering in a person or organization that is realized when the bearer participates in providing a service to meet the need of another person or thing.
type: Class
example of usage: A technician in a core laboratory.
has curation status: IAO_0000120
term editor: PERSON: Nicole Vasilevsky
definition: An role of an individual within his or her profession or institution; use outreach provider role for community service or other activities outside the profession.
subclass of: Role
example of usage: Member of the International Conference on Complex Systems Organizing Committee
definition source: PERSON: Nicole Vasilevsky

has global count date
type: ObjectProperty
domain: Global Citation Count
range: Date/Time Value
sub property of: date/time value
definition: The date on which the global citation count of the cited entity was recorded from a named bibliographic information source.

associated concept
type: ObjectProperty
inverse of: concept for

role
type: DatatypeProperty
domain: Role
range: string

nameCurrencyEN
source: FAO terminology http://www.fao.org/termportal/en/
source identifier: http://www.fao.org/termportal/contr/es/
source identifier: http://www.fao.org/termportal/contr/en/
type: DatatypeProperty
source identifier: http://www.fao.org/termportal/contr/zh/
source identifier: http://www.fao.org/termportal/contr/ar/
source identifier: http://www.fao.org/termportal/en/
source creator: FAO terminology
source modified: 2010-06-24
source identifier: http://www.fao.org/termportal/contr/fr/

translator
type: ObjectProperty
domain: Document
domain: Information Content Entity
range: Agent
sub property of: contributor
inverse of: translator of

Human Study
definition: Research project that uses or collects measurements or assessments about humans.
editor preferred term: human study
definition source: OCRe
example of usage: A clinical trial.
term editor: PERSON: Melissa Haendel
type: Class
has curation status: IAO_0000120
comment: This should be imported from OCRE- but they currently have no generic human study type. Def is modified.
subclass of: Research Project

distributes funding from
type: ObjectProperty
domain: Funding Organization
range: Funding Organization
description annot: For example, National Science Foundation providesFundingThrough Graduate Research Fellowship Program; National Institutes of Health providesFundingThrough National Center for Research Resources.
inverse of: provides funding through

cited by
type: ObjectProperty
domain: Document
range: Document
inverse of: cites

Manual
type: Class
comment: A small reference book, especially one giving instructions.
subclass of: Document
example of usage: SDB User Manual
definition: A book of instructions or guide to a specific topic
term status: unstable

Phase 3 Clinical Trial
type: Class
subclass of: Clinical Trial
definition: In Phase 3 trials, an experimental study drug or treatment is given to large groups of people (1,000-3,000) to confirm its effectiveness, monitor side effects, compare it to commonly used treatments, and collect information that will allow the experimental drug or treatment to be used safely.
definition: Phase 3 Clinical Trial

Zero-Dimensional Temporal Region
type: Class
subclass of: Temporal Region

abbreviation
type: FunctionalProperty
type: DatatypeProperty
example of usage: A short form for an longer title or name.
example of usage: B.A.

postal code
type: DatatypeProperty
domain: Address
range: string

Research Project
term editor: PERSON: Melissa Haendel
type: Class
comment: Maybe SameAs "Investigation" but is the subject of funding
subclass of: Project
example of usage: A project to study the role of a specific protein in cell signaling.
definition: A funded collection of investigations as described in a research proposal.
subclass of: Planned Process
has curation status: IAO_0000120
definition source: PERSON: Melissa Haendel

Undergraduate Advising Relationship
type: Class
subclass of: Advising Relationship
definition: An advisory relationship in which a professor advises an undergraduate student.

Non-Academic
type: Class
subclass of: Person
definition: A person holding a position that is not considered to be an academic appointment.

Telephone
type: Class
subclass of: Communication
equivalent class: Class
  intersection of: Restriction
    all values from: anyURI
    on property: Telephone
  intersection of: Restriction
    min cardinality: 1
    on property: Telephone
equivalent class: Class
  intersection of: Restriction
    all values from: anyURI
    on property: Telephone
  intersection of: Restriction
    min cardinality: 1
    on property: Telephone

agriculturalAreaYear
type: DatatypeProperty

Rate Measurement Datum
type: Class
subclass of: Scalar Measurement Datum

Topic Weight Measurement Process
type: Class
subclass of: Planned Process

nameCurrencyAR
source modified: 2010-06-24
source identifier: http://www.fao.org/termportal/contr/fr/
source identifier: http://www.fao.org/termportal/contr/es/
source identifier: http://www.fao.org/termportal/contr/zh/
source identifier: http://www.fao.org/termportal/en/
source identifier: http://www.fao.org/termportal/contr/en/
source identifier: http://www.fao.org/termportal/contr/ar/
source: FAO terminology http://www.fao.org/termportal/en/
type: DatatypeProperty
source creator: FAO terminology

interviewee
type: ObjectProperty
comment: An agent that is interviewed by another agent.
term status: stable

service provided by
inverse of: contact or provider for service
domain: Service
editor preferred term: service provided by
definition: Organization or laboratory performing the service.
range: Class
  union of: Organization
  union of: Person
has curation status: IAO_0000120
term editor: PERSON: Melissa Haendel
type: ObjectProperty
example of usage: A core laboratory provides a service.
definition source: PERSON: Melissa Haendel
range: Class
  union of: Organization
  union of: Person

Researcher Role
type: Class
subclass of: Role
example of usage: Examples of research can be seen at: http://www.ufl.edu/research/products/index.html. Note these may have been funded, but the research doesn't have to be funded. Also, the research may be linked to an Agreement (for example, a Grant), but does not need to be.
definition: A role of conducting funded or unfunded research, sometimes linked to an Agreement.

Single Group Study
type: Class
subclass of: Interventional study
definition: A single group study is an interventional study that has only a single allocation group and no contemporaneuos comparison group. A study in which an individual acts has his/her own comparison does not fall into this category, since an individual is not a group.
curator: Simona
develop comment: Simona: to be reviewed

start
type: ObjectProperty
domain: Date/Time Interval
range: Date/Time Value
sub property of: date/time value

Research Opportunity
subclass of: Restriction
  all values from: Grant
  on property: funding provided via
subclass of: Restriction
  all values from: Date/Time Interval
  on property: date/time interval
has curation status: IAO_0000120
definition: A planned process carried out by a person or organization with the objective of performing research.
subclass of: Restriction
  all values from: Literal
  on property: contact information
definition source: PERSON: Nicole Vasilevsky
subclass of: Restriction
  all values from: Literal
  on property: description
example of usage: Training grant to perform post-doctoral research.
subclass of: Realizable Entity
definition: An offering through an ongoing program or single request of research support: internships, positions, financial awards or other forms of tangible or intangible support
type: Class
term editor: PERSON: Nicole Vasilevsky
editor preferred term: student research opportunity
subclass of: Restriction
  all values from: Grant
  on property: funding provided via
subclass of: Restriction
  all values from: Date/Time Interval
  on property: date/time interval
subclass of: Restriction
  all values from: Literal
  on property: contact information
subclass of: Restriction
  all values from: Literal
  on property: description

Vitro Public Ontology

Group
type: Class
subclass of: Area

Online Computer Library Center (OCLC) number
type: DatatypeProperty
comment: OCLC Identifier
sub property of: identifier
example of usage: http://info-uri.info/registry/OAIHandler?verb=GetRecord&metadataPrefix=reg&identifier=info:oclcnum/. bibo has the domain of this property set to the union of Collection and Document.
term status: stable

has global count source
type: ObjectProperty
domain: Global Citation Count
range: Bibliographic Information Source
definition: A property linking an instance of c40:GlobalCitationCount to the bibliographic information source providing the global citation count information for a particular publication on a particular date.
description annot: A property linking the property c40:GlobalCitationCount to the bibliographic information source providing the global citation count information for a particular publication on a particular date.

nameCurrencyIT
source: FAO terminology http://www.fao.org/termportal/en/
type: DatatypeProperty
source modified: 2010-06-24
source identifier: http://www.fao.org/termportal/contr/es/
source identifier: http://www.fao.org/termportal/contr/fr/
source creator: FAO terminology
source identifier: http://www.fao.org/termportal/contr/zh/
source identifier: http://www.fao.org/termportal/contr/en/
source identifier: http://www.fao.org/termportal/en/
source identifier: http://www.fao.org/termportal/contr/ar/

Access Service
type: Class
comment: Coordinate with NIF
subclass of: Service
example of usage: Allowing access to a microscope in a core lab.
has curation status: IAO_0000120
definition: A service offering that describes a service in which the consumer receives the right to use a resource (instrument, database, software, etc) that is owned or managed by a service provider. Ownership of the accessed resource remains with the service provider during and after provision of service.
term editor: PERSON: Matt Brush
definition source: PERSON: Matthew Brush

subject area of
type: ObjectProperty
sub property of: concept for

Member Role
type: Class
subclass of: Role
definition: A role of being a member in a Process or an Organization

Work
type: Class
comment: This implies that the property is related to an individual's work place
subclass of: Type

Measurement Label
type: DatatypeProperty

Special Group
type: Class
subclass of: Group

country area unit
type: DatatypeProperty

geo
type: DatatypeProperty
comment: Must use the geo URI scheme RFC5870
domain: Geo
range: anyURI

successor organization
type: ObjectProperty
domain: Organization
range: Organization

has nationality
type: DatatypeProperty

Storage Service
type: Class
comment: coordinate with NIF. NIF ID:nlx_res_20090419
subclass of: Service
example of usage: A computer server.
has curation status: IAO_0000120
definition: A service offering that describes a service in which the consumer provides some material or data as input which a service provider stores and returns as output.
term editor: PERSON: Matt Brush
definition source: PERSON: Matthew Brush

translator of
type: ObjectProperty
domain: Agent
range: Document

Material Processing Service
type: Class
comment: Coordinate with NIF: NIF ID: nlx_res_20090416
subclass of: Service
example of usage: Biopsy service.
has curation status: IAO_0000120
definition: A service offering that describes a service in which the provider makes physical changes to a specified input material entity with the objective of producing a new material entity form input materials, or modifying the input material entity, and returning this as output to the service consumer
term editor: PERSON: Nicole Vasilevsky
definition source: http://neurolex.org/wiki/Category:Production_service_resource

nameCurrencyES
source modified: 2010-06-24
source identifier: http://www.fao.org/termportal/contr/fr/
source identifier: http://www.fao.org/termportal/contr/en/
type: DatatypeProperty
source: FAO terminology http://www.fao.org/termportal/en/
source identifier: http://www.fao.org/termportal/contr/es/
source identifier: http://www.fao.org/termportal/en/
source identifier: http://www.fao.org/termportal/contr/zh/
source creator: FAO terminology
source identifier: http://www.fao.org/termportal/contr/ar/

Expertise Measurement Process
type: Class
subclass of: Topic Weight Measurement Process

EAN International-Uniform Code Council (EAN-UCC) 13
type: DatatypeProperty
comment: European Article Number/Uniform Commercier Code 13
sub property of: identifier
example of usage: Definition source: http://en.wikipedia.org/wiki/European_Article_Numbering-Uniform_Code_Council. The Uniform Code Council (UCC) was the Numbering Organization in the USA to administer and manage the EAN.UCC System. In 2005 the UCC changed its name to GS1 US.
term status: stable

calendar link
type: DatatypeProperty
domain: Calendar Link
range: anyURI

Geopolitical Entity
type: Class
subclass of: Geographic Region
example of usage: Short definition obtained here: http://en.wiktionary.org/wiki/geopolitical_entity.
example of usage: Use subclasses of core:GeopoliticalEntity subclasses instead of this class if possible.
definition: A geographical area which is associated with some sort of political structure.

Training Service
type: Class
comment: Coordinate with NIF. NIF ID: nlx_res_20090444
subclass of: Service
example of usage: Training a researcher to use a microscope.
has curation status: IAO_0000120
definition: A service offering that describes a service in which the provider offers educational materials or events, such as courses, workshops or graduate programs, to the service consumer
term editor: PERSON: Matt Brush
definition source: PERSON: Matthew Brush

sponsors award or honor
type: ObjectProperty
domain: Organization
range: Award or Honor
inverse of: award sponsored by

Muse
type: Class
subclass of: Relation Type

Area
subclass of: Restriction
  max cardinality: 1
  on property: nameShortFR
subclass of: Restriction
  max cardinality: 1
  on property: nameListFR
subclass of: Restriction
  max cardinality: 1
  on property: codeFAOSTAT
subclass of: Restriction
  max cardinality: 1
  on property: nameOfficialES
subclass of: Restriction
  max cardinality: 1
  on property: nameShortES
subclass of: Restriction
  max cardinality: 1
  on property: codeISO3
subclass of: Restriction
  max cardinality: 1
  on property: codeDBPediaID
subclass of: Restriction
  max cardinality: 1
  on property: nameOfficialRU
subclass of: Thing
subclass of: Restriction
  max cardinality: 1
  on property: nameListES
subclass of: Restriction
  max cardinality: 1
  on property: nameOfficialEN
subclass of: Restriction
  max cardinality: 1
  on property: nameListAR
subclass of: Restriction
  max cardinality: 1
  on property: valid until
subclass of: Restriction
  max cardinality: 1
  on property: codeFAOTERM
subclass of: Restriction
  max cardinality: 1
  on property: codeUN
subclass of: Restriction
  max cardinality: 1
  on property: nameShortAR
subclass of: Restriction
  max cardinality: 1
  on property: codeGAUL
subclass of: Restriction
  max cardinality: 1
  on property: nameOfficialIT
subclass of: Restriction
  max cardinality: 1
  on property: codeUNDP
subclass of: Restriction
  max cardinality: 1
  on property: valid since
subclass of: Restriction
  max cardinality: 1
  on property: nameListRU
subclass of: Restriction
  max cardinality: 1
  on property: nameOfficialFR
type: Class
subclass of: Restriction
  max cardinality: 1
  on property: nameListZH
subclass of: Restriction
  max cardinality: 1
  on property: nameShortRU
subclass of: Restriction
  max cardinality: 1
  on property: nameShortIT
subclass of: Restriction
  max cardinality: 1
  on property: nameListEN
subclass of: Restriction
  max cardinality: 1
  on property: codeISO2
subclass of: Restriction
  max cardinality: 1
  on property: nameOfficialZH
subclass of: Restriction
  max cardinality: 1
  on property: nameShortEN
subclass of: Restriction
  max cardinality: 1
  on property: nameShortZH
subclass of: Restriction
  max cardinality: 1
  on property: nameOfficialAR
subclass of: Restriction
  max cardinality: 1
  on property: nameListIT
subclass of: Restriction
  max cardinality: 1
  on property: codeAGROVOC
subclass of: Restriction
  max cardinality: 1
  on property: nameShortFR
subclass of: Restriction
  max cardinality: 1
  on property: nameListFR
subclass of: Restriction
  max cardinality: 1
  on property: codeFAOSTAT
subclass of: Restriction
  max cardinality: 1
  on property: nameOfficialES
subclass of: Restriction
  max cardinality: 1
  on property: nameShortES
subclass of: Restriction
  max cardinality: 1
  on property: codeISO3
subclass of: Restriction
  max cardinality: 1
  on property: codeDBPediaID
subclass of: Restriction
  max cardinality: 1
  on property: nameOfficialRU
subclass of: Restriction
  max cardinality: 1
  on property: nameListES
subclass of: Restriction
  max cardinality: 1
  on property: nameOfficialEN
subclass of: Restriction
  max cardinality: 1
  on property: nameListAR
subclass of: Restriction
  max cardinality: 1
  on property: valid until
subclass of: Restriction
  max cardinality: 1
  on property: codeFAOTERM
subclass of: Restriction
  max cardinality: 1
  on property: codeUN
subclass of: Restriction
  max cardinality: 1
  on property: nameShortAR
subclass of: Restriction
  max cardinality: 1
  on property: codeGAUL
subclass of: Restriction
  max cardinality: 1
  on property: nameOfficialIT
subclass of: Restriction
  max cardinality: 1
  on property: codeUNDP
subclass of: Restriction
  max cardinality: 1
  on property: valid since
subclass of: Restriction
  max cardinality: 1
  on property: nameListRU
subclass of: Restriction
  max cardinality: 1
  on property: nameOfficialFR
subclass of: Restriction
  max cardinality: 1
  on property: nameListZH
subclass of: Restriction
  max cardinality: 1
  on property: nameShortRU
subclass of: Restriction
  max cardinality: 1
  on property: nameShortIT
subclass of: Restriction
  max cardinality: 1
  on property: nameListEN
subclass of: Restriction
  max cardinality: 1
  on property: codeISO2
subclass of: Restriction
  max cardinality: 1
  on property: nameOfficialZH
subclass of: Restriction
  max cardinality: 1
  on property: nameShortEN
subclass of: Restriction
  max cardinality: 1
  on property: nameShortZH
subclass of: Restriction
  max cardinality: 1
  on property: nameOfficialAR
subclass of: Restriction
  max cardinality: 1
  on property: nameListIT
subclass of: Restriction
  max cardinality: 1
  on property: codeAGROVOC

product ID
type: DatatypeProperty
range: string

Phase 2
type: Class
subclass of: Phase
definition: A Phase ll trial assesses therapeutic benefit (usually involving a few hundred people, usually with controls, but not always) [Glossary of Terms in The Cochrane Collaboration]
curator: Simona

Coresident
type: Class
subclass of: Relation Type

has translation
type: ObjectProperty
domain: Document
range: Document
example of usage: Examples shows a book has French language version. Public description source: http://bibotools.googlecode.com/svn/bibo-ontology/trunk/doc/index.html .
inverse of: translation of

OCRe research

Phase 3
type: Class
subclass of: Phase
definition: A Phase III trial compares the new treatment against standard (or placebo) treatment (usually a full randomised controlled trial). At this point, a drug can be approved for community use. [Glossary of Terms in The Cochrane Collaboration]
curator: Simona

date issued
type: ObjectProperty
range: Date/Time Value
sub property of: date/time value

region
type: DatatypeProperty
domain: Address
range: string

Name
type: Class
comment: Specifies the components of the name of the object the vCard represents
subclass of: Identification
equivalent class: Class
  intersection of: Class
    intersection of: Restriction
      on property: additional name
      some values from: string
    intersection of: Restriction
      min cardinality: 0
      on property: additional name
  intersection of: Class
    intersection of: Restriction
      on property: has last name
      some values from: string
    intersection of: Restriction
      max cardinality: 1
      on property: has last name
  intersection of: Class
    intersection of: Restriction
      on property: first name
      some values from: string
    intersection of: Restriction
      max cardinality: 1
      on property: first name
  intersection of: Class
    intersection of: Restriction
      on property: honorific prefix
      some values from: string
    intersection of: Restriction
      min cardinality: 0
      on property: honorific prefix
  intersection of: Class
    intersection of: Restriction
      on property: honorific suffix
      some values from: string
    intersection of: Restriction
      min cardinality: 0
      on property: honorific suffix
equivalent class: Class
  intersection of: Class
    intersection of: Restriction
      on property: additional name
      some values from: string
    intersection of: Restriction
      min cardinality: 0
      on property: additional name
  intersection of: Class
    intersection of: Restriction
      on property: has last name
      some values from: string
    intersection of: Restriction
      max cardinality: 1
      on property: has last name
  intersection of: Class
    intersection of: Restriction
      on property: first name
      some values from: string
    intersection of: Restriction
      max cardinality: 1
      on property: first name
  intersection of: Class
    intersection of: Restriction
      on property: honorific prefix
      some values from: string
    intersection of: Restriction
      min cardinality: 0
      on property: honorific prefix
  intersection of: Class
    intersection of: Restriction
      on property: honorific suffix
      some values from: string
    intersection of: Restriction
      min cardinality: 0
      on property: honorific suffix

Presenter Role
type: Class
subclass of: Role
example of usage: Are we assuming that a PresenterRole is in a Presentation? Or could you have a PresenterRole in, say, a committee?
definition: A role of presenting information

Phase 4
type: Class
subclass of: Phase
definition: A Phase IV study monitors a new treatment in the community, often to evaluate longterm safety and effectiveness. [Glossary of Terms in The Cochrane Collaboration]
curator: Simona

has organization name
type: ObjectProperty
range: Organization Name

Addressing
type: Class
comment: These types are concerned with information related to the delivery addressing or label for the vCard object
equivalent class: Class
  intersection of: Class
    intersection of: Restriction
      on property: geo
      some values from: anyURI
    intersection of: Restriction
      max cardinality: 1
      on property: geo
  intersection of: Class
    intersection of: Restriction
      on property: timezone
      some values from: string
    intersection of: Restriction
      max cardinality: 1
      on property: timezone
  intersection of: Class
    intersection of: Restriction
      all values from: string
      on property: has language
    intersection of: Restriction
      max cardinality: 1
      on property: has language
  intersection of: Class
    intersection of: Restriction
      all values from: string
      on property: sort as
    intersection of: Restriction
      max cardinality: 1
      on property: sort as
equivalent class: Class
  intersection of: Class
    intersection of: Restriction
      on property: geo
      some values from: anyURI
    intersection of: Restriction
      max cardinality: 1
      on property: geo
  intersection of: Class
    intersection of: Restriction
      on property: timezone
      some values from: string
    intersection of: Restriction
      max cardinality: 1
      on property: timezone
  intersection of: Class
    intersection of: Restriction
      all values from: string
      on property: has language
    intersection of: Restriction
      max cardinality: 1
      on property: has language
  intersection of: Class
    intersection of: Restriction
      all values from: string
      on property: sort as
    intersection of: Restriction
      max cardinality: 1
      on property: sort as

peer reviewed
type: Document Status
type: NamedIndividual
definition: Peer review is the process by which articles are chosen to be included in a refereed journal. An editorial board consisting of experts in the same field as the author review the article and decide if it is authoritative enough for publication.
description: Peer review is the process by which articles are chosen to be included in a refereed journal. An editorial board consisting of experts in the same field as the author review the article and decide if it is authoritative enough for publication.

Campus
type: Class
subclass of: Geographic Location
example of usage: Cornell Ithaca; Cornell Geneva; Cornell New York City; Cornell Qatar
example of usage: Definition taken from dictionary.com (http://dictionary.reference.com/browse/campus).
definition: The grounds of a school, college, university, or hospital. Or, a large, usually suburban, landscaped business or industrial site.

Slide
type: Class
comment: A slide in a slideshow
subclass of: Document Part
example of usage: Short Definition from the bibo ontology
definition: A slide in a slideshow
term status: unstable

Performance
type: Class
comment: A public performance.
subclass of: Event
definition: Something carried out, acted or rendered.
term status: unstable

has related
type: ObjectProperty
range: Related

has study population
type: DatatypeProperty
example of usage: African american study population.
term editor: PERSON: Melissa Haendel
definition: Characteristics of the human population being studied. May include number, demographic or geographic information, inclusion or exclusion criteria, or other descriptive information.
editor preferred term: study population
range: string
domain: Human Study
definition source: PERSON: Melissa Haendel
has curation status: IAO_0000120

nameCurrencyZH
source identifier: http://www.fao.org/termportal/contr/ar/
source identifier: http://www.fao.org/termportal/contr/fr/
source: FAO terminology http://www.fao.org/termportal/en/
source modified: 2010-06-24
source identifier: http://www.fao.org/termportal/contr/es/
source identifier: http://www.fao.org/termportal/contr/zh/
source identifier: http://www.fao.org/termportal/contr/en/
source creator: FAO terminology
type: DatatypeProperty
source identifier: http://www.fao.org/termportal/en/

distributes
type: ObjectProperty
description annot: Public Description for bibo:distributor taken from here: http://bibotools.googlecode.com/svn/bibo-ontology/trunk/doc/index.html .
inverse of: distributor

manufactured by
alternative term: has_manufacturer
domain: Material Entity
editor preferred term: is_manufactured_by
range: Organization
term editor: Alan Ruttenberg
term editor: Liju Fan
definition: c is_manufactured_by o means that there was a process p in which c was built in which a person, or set of people or machines did the work(bore the "Manufacturer Role", and those people/and or machines were members or of directed by the organization to do this.
type: ObjectProperty
alternative term: has_make
example of usage: http://www.affymetrix.com/products/arrays/specific/hgu133.affx is_manufactered_by http://www.affymetrix.com/ (if we decide to use these URIs for the actual entities)

has formatted name
type: ObjectProperty
range: Formatted Name

Erratum
type: Class
subclass of: Document
definition: A formal correction to an error introduced by the publisher into a previously published document.

Individual
type: Class
comment: Defines all the properties required to be an Individual
subclass of: VCard Kind
equivalent class: Class
  intersection of: Class
    intersection of: Restriction
      on property: has name
      some values from: Name
    intersection of: Restriction
      min cardinality: 0
      on property: has name
  intersection of: Class
    intersection of: Restriction
      on property: anniversary
      some values from: dateTime
    intersection of: Restriction
      max cardinality: 1
      on property: anniversary
  intersection of: Class
    intersection of: Restriction
      on property: birthdate
      some values from: dateTime
    intersection of: Restriction
      max cardinality: 1
      on property: birthdate
  intersection of: Class
    intersection of: Restriction
      on property: gender
      some values from: anyURI
    intersection of: Restriction
      max cardinality: 1
      on property: gender
equivalent class: Class
  intersection of: Class
    intersection of: Restriction
      on property: has name
      some values from: Name
    intersection of: Restriction
      min cardinality: 0
      on property: has name
  intersection of: Class
    intersection of: Restriction
      on property: anniversary
      some values from: dateTime
    intersection of: Restriction
      max cardinality: 1
      on property: anniversary
  intersection of: Class
    intersection of: Restriction
      on property: birthdate
      some values from: dateTime
    intersection of: Restriction
      max cardinality: 1
      on property: birthdate
  intersection of: Class
    intersection of: Restriction
      on property: gender
      some values from: anyURI
    intersection of: Restriction
      max cardinality: 1
      on property: gender

Friend
type: Class
subclass of: Relation Type

Topic Weight Measurement
type: Class
subclass of: Scalar Measurement Datum

Generically Dependent Continuant
type: Class
subclass of: Continuant

publication venue for
type: ObjectProperty

Phase 0
type: Class
subclass of: Phase
definition: A Phase 0 trial is an exploratory trial involving very limited human exposure, with no therapeutic or diagnostic intent (e.g., screening study, microdose study). [http://prsinfo.clinicaltrials.gov/definitions.html]
curator: Simona

codeAGROVOC
type: DatatypeProperty
source creator: AGROVOC
source identifier: http://aims.fao.org/ar/website/Search-AGROVOC/sub
source identifier: http://aims.fao.org/website/Search-AGROVOC/sub
source identifier: http://aims.fao.org/fr/website/Search-AGROVOC/sub
source identifier: http://aims.fao.org/zh-hans/website/Search-AGROVOC/sub
source identifier: http://aims.fao.org/es/website/Search-AGROVOC/sub
source: AGROVOC http://aims.fao.org/website/Search-AGROVOC/sub

Phase 2 Clinical Trial
type: Class
subclass of: Clinical Trial
definition: In Phase 2 trials, an experimental study drug or treatment is given to a larger group of people (100-300) to see if it is effective and to further evaluate its safety.
definition: Phase 2 Clinical Trial

Telephone
type: DatatypeProperty
range: anyURI

Organism
editor preferred term: organism
type: Class
example of usage: fungus
has curation status: IAO_0000121
definition source: WEB: http://en.wikipedia.org/wiki/Organism
term editor: GROUP: OBI Biomaterial Branch
subclass of: Material Entity
example of usage: animal
example of usage: virus
example of usage: plant
definition: A material entity that is an individual living system, such as animal, plant, bacteria or virus, that is capable of replicating or reproducing, growth and maintenance in the right environment. An organism may be unicellular or made up, like humans, of many billions of cells divided into specialized tissues and organs.
imported from: obi.owl

Expertise Measurement
type: Class
subclass of: Topic Weight Measurement

Research Organization
type: Class
subclass of: Organization
definition: Any organization (likely also asserted as another class of Organization) with a primary, ongoing research function, not just through occasional roles
imported from: VIVO-ISF Ontology version 1.6

honorific prefix
type: DatatypeProperty
comment: Called Honorific Prefix in vCard
domain: Name
range: string

Phase 0 Clinical Trial
type: Class
subclass of: Clinical Trial
definition: Phase 0 is a recent designation for exploratory, first-in-human trials conducted in accordance with the United States Food and Drug Administration's (FDA) 2006 Guidance on Exploratory Investigational New Drug (IND) Studies. Phase 0 trials are also known as human microdosing studies and are designed to speed up the development of promising drugs or imaging agents by establishing very early on whether the drug or agent behaves in human subjects as was expected from preclinical studies.
definition: Phase 0 Clinical Trial

HR job title
type: DatatypeProperty
domain: Position
description annot: Definition http://en.wikipedia.org/wiki/Job_title#Job_title.
example annot: administrative secretary

Phase 1
type: Class
subclass of: Phase
definition: A Phase I trial assesses toxic effects on humans (not many people participate, and usually without controls) [Glossary of Terms in The Cochrane Collaboration]
curator: Simona

research areas
type: ObjectProperty
sub property of: associated concept
inverse of: research area of

Post-Graduate Student Trainee Role
type: Class
subclass of: Student Role
example of usage: A post-doctoral fellow.
has curation status: IAO_0000120
definition: A student role inhering in a person that is realized when the bearer participates in a post-graduate training program in pursuit of new or additional training in a particular field, such as a post-doctoral fellowship.
term editor: PERSON: Nicole Vasilevsky
definition source: PERSON: Nicole Vasilevsky

agricultural area notes
type: DatatypeProperty

nameListZH
source: FAO terminology http://www.fao.org/termportal/en/
source identifier: http://www.fao.org/termportal/contr/ar/
type: DatatypeProperty
source identifier: http://www.fao.org/termportal/en/
source creator: FAO terminology
source identifier: http://www.fao.org/termportal/contr/fr/
source identifier: http://www.fao.org/termportal/contr/en/
source identifier: http://www.fao.org/termportal/contr/zh/
source modified: 2010-06-24
source identifier: http://www.fao.org/termportal/contr/es/

Measurement Unit Label
example of usage: Examples of measurement unit labels are liters, inches, weight per volume.
definition: A measurement unit label is as a label that is part of a scalar measurement datum and denotes a unit of measure.
imported from: iao.owl
editor preferred term: measurement unit label
editor note: 2009-03-16: review of this term done during during the OBI workshop winter 2009 and the current definition was considered acceptable for use in OBI. If there is a need to modify this definition please notify OBI.
editor note: 2009-03-16: provenance: a term measurement unit was proposed for OBI (OBI_0000176) , edited by Chris Stoeckert and Cristian Cocos, and subsequently moved to IAO where the objective for which the original term was defined was satisfied with the definition of this, different, term.
term editor: PERSON: Alan Ruttenberg
subclass of: Datum Label
term editor: PERSON: Melanie Courtot
has curation status: IAO_0000125
type: Class

date/time interval
type: ObjectProperty
range: Date/Time Interval

VIVO Scientific Research Ontology

has formatted name
type: DatatypeProperty
domain: Formatted Name
range: string

is defined by
type: AnnotationProperty

Administrator Role
type: Class
subclass of: Role

Function
type: Class
subclass of: Disposition

yearMonthPrecision
type: Date/Time Value Precision
type: NamedIndividual
label: year-month value

Professor Emeritus
type: Class
subclass of: Faculty Member Emeritus
subclass of: Person
definition: A retired professor who has retained their rank, title and privileges.

Undergraduate Student
type: Class
subclass of: Student
definition: A person registered in an undergraduate program leading to a bachelor's degree or an undergraduate diploma or certificate.

Plan Specification
editor note: 2009-03-16: provenance: a term a plan was proposed for OBI (OBI_0000344) , edited by the PlanAndPlannedProcess branch. Original definition was " a plan is a specification of a process that is realized by an actor to achieve the objective specified as part of the plan". It has been subsequently moved to IAO where the objective for which the original term was defined was satisfied with the definitionof this, different, term.
editor preferred term: plan specification
definition source: OBI_0000344
definition: a directive information entity that when concretized it is realized in a process in which the bearer tries to achieve the objectives, in part by taking the actions specified. Plan specifications includes parts such as objective specification, action specifications and conditional specifications.
term editor: Alan Ruttenberg
imported from: iao.owl
definition source: OBI Plan and Planned Process branch
example of usage: PMID: 18323827.Nat Med. 2008 Mar;14(3):226.New plan proposed to help resolve conflicting medical advice.
subclass of: Directive Information Entity
editor note: Alternative previous definition: a plan is a set of instructions that specify how an objective should be achieved
type: Class
has curation status: IAO_0000120

land area unit
type: DatatypeProperty

date filed
type: ObjectProperty
domain: Patent
range: Date/Time Value
sub property of: date/time value

first name
type: DatatypeProperty
comment: called Given Name invCard
domain: Name
range: string

Objective Specification
term editor: PERSON: Bjoern Peters
term editor: PERSON: Jennifer Fostel
type: Class
editor note: Answers the question, why did you do this experiment?
term editor: PERSON: Barry Smith
editor preferred term: objective specification
subclass of: Directive Information Entity
definition: a directive information entity that describes an intended process endpoint. When part of a plan specification the concretization is realized in a planned process in which the bearer tries to effect the world so that the process endpoint is achieved.
definition source: OBI Plan and Planned Process/Roles Branch
example of usage: purpose of a study; support of hypothesis, discovery of new information
term editor: PERSON: Alan Ruttenberg
definition source: OBI_0000217
has curation status: IAO_0000125
imported from: iao.owl

Series
example of usage: Methods in Molecular Biology
subclass of: Restriction
  all values from: Literal
  on property: Electronic International Standard Serial Number (EISSN)
subclass of: Collection
subclass of: Restriction
  all values from: Literal
  on property: International Standard Serial Number (ISSN)
definition: A thematic collection of documents, usually books, issued at regular or irregular intervals
type: Class
comment: A loose, thematic, collection of Documents, often Books.
term status: stable
subclass of: Restriction
  all values from: Literal
  on property: Electronic International Standard Serial Number (EISSN)
subclass of: Restriction
  all values from: Literal
  on property: International Standard Serial Number (ISSN)

coden
type: DatatypeProperty
comment: An identifier of serials, still in use by libraries, but replaced by ISSN for any new work
sub property of: identifier
example of usage: CODEN became particularly common in the scientific community as a citation system for periodicals cited in technical- as well in chemistry-related publications and as a search tool in many bibliographic catalogues. Definition and description came from Wikipedia here: http://en.wikipedia.org/wiki/CODEN
term status: stable

Language
type: Class
comment: To specify the language(s) that may be used for contacting the entity associated with the vCard.
subclass of: Communication
equivalent class: Class
  intersection of: Restriction
    all values from: string
    on property: has language
  intersection of: Restriction
    cardinality: 1
    on property: has language
equivalent class: Class
  intersection of: Restriction
    all values from: string
    on property: has language
  intersection of: Restriction
    cardinality: 1
    on property: has language

Organizer Role
type: Class
subclass of: Role
definition: A role of organizing

Gender
type: Class
subclass of: Code

Exhibit
type: Class
subclass of: Event
definition: The showing of an object or a collection of objects, in an organized manner.

has minimum latitude
type: DatatypeProperty

County
type: Class
subclass of: Geopolitical Entity
example of usage: Short Definition modified from the one found here: http://www.thefreedictionary.com/county.
example of usage: Alachua; Baker; Bradford; Kenora; Ottawa; Waterloo
definition: The largest administrative division of most states or provinces.

Certificate
type: Class
subclass of: Credential
example of usage: A document confirming certain characteristics of a person or organization, usually provided by some form of external review, education, or assessment.
definition: A document confirming certain characteristics of a person or organization, usually provided by some form of external review, education, or assessment.

Sound
type: Class
comment: To specify a digital sound content information that annotates some aspect of the vCard. This property is often used to specify the proper pronunciation of the name property value of the vCard
subclass of: Explanatory
equivalent class: Class
  intersection of: Restriction
    all values from: anyURI
    on property: sound
  intersection of: Restriction
    min cardinality: 1
    on property: sound
equivalent class: Class
  intersection of: Restriction
    all values from: anyURI
    on property: sound
  intersection of: Restriction
    min cardinality: 1
    on property: sound

provides funding for
type: ObjectProperty
domain: Grant
sub property of: supports
inverse of: funding provided via

nickname
type: DatatypeProperty
domain: Nickname
range: string

Key
type: Class
subclass of: Security
equivalent class: Class
  intersection of: Restriction
    on property: key
    some values from: anyURI
  intersection of: Restriction
    min cardinality: 1
    on property: key
equivalent class: Class
  intersection of: Restriction
    on property: key
    some values from: anyURI
  intersection of: Restriction
    min cardinality: 1
    on property: key

adjacent to
type: ObjectProperty

Document Part
definition: A distinct part of a larger document or collected document
subclass of: Restriction
  all values from: Organization
  on property: publisher
subclass of: Document
comment: a distinct part of a larger document or collected document.
subclass of: Restriction
  all values from: Document
  on property: part of
term status: unstable
subclass of: Restriction
  all values from: Literal
  on property: place of publication
type: Class
example of usage: Short Definition from the bibo ontology
subclass of: Restriction
  all values from: Organization
  on property: publisher
subclass of: Restriction
  all values from: Document
  on property: part of
subclass of: Restriction
  all values from: Literal
  on property: place of publication

Book
subclass of: Restriction
  all values from: Literal
  on property: Library of Congress Control Number (LCCN)
type: Class
subclass of: Restriction
  all values from: Literal
  on property: place of publication
subclass of: Document
subclass of: Restriction
  all values from: Organization
  on property: publisher
definition: A written or printed work of fiction or nonfiction, usually on sheets of paper fastened or bound together within covers
example of usage: Short Definition copied from bibo ontology
comment: A written or printed work of fiction or nonfiction, usually on sheets of paper fastened or bound together within covers.
subclass of: Restriction
  all values from: Literal
  on property: edition
term status: stable
subclass of: Restriction
  all values from: Literal
  on property: Library of Congress Control Number (LCCN)
subclass of: Restriction
  all values from: Literal
  on property: place of publication
subclass of: Restriction
  all values from: Organization
  on property: publisher
subclass of: Restriction
  all values from: Literal
  on property: edition

Postdoctoral Training
type: Class
subclass of: Educational Process
definition: Postdoctoral research is academic or scholarly research conducted by a person who has completed his or her doctoral studies, normally within the following five years. It is intended to further deepen expertise in a specialist subject.

related research project
example of usage: A research project studying breast cancer.
type: ObjectProperty
inverse of: related biological specimen
range: Research Project
definition: Research project during which the biological specimen was collected.
has curation status: IAO_0000120
editor preferred term: related research project
term editor: PERSON: Melissa Haendel
definition source: PERSON: Melissa Haendel
domain: Biological Specimen

achieves planned objective
type: ObjectProperty
domain: Planned Process
range: Objective Specification
example of usage: A cell sorting process achieves the objective specification 'material separation objective'
definition: This relation obtains between a planned process and a objective specification when the criteria specified in the objective specification are met at the end of the planned process.
term editor: BP, AR, PPPB branch
definition source: PPPB branch derived
curator note: modified according to email thread from 1/23/09 in accordince with DT and PPPB branch

has note
type: ObjectProperty
range: Note

has equipment
type: ObjectProperty
domain: Organization
range: Equipment
inverse of: equipment for

has name
type: ObjectProperty
range: Name

sponsor award ID
type: FunctionalProperty
type: DatatypeProperty
domain: Class
  union of: Contract
  union of: Grant
sub property of: identifier
example of usage: Has a domain of Grant. There is not a strong reason have this be publically visible, since most users would care more about the name of the sponsoring agency than its identifier, but it does no harm to be public. See also core:localAwardId.
domain: Class
  union of: Contract
  union of: Grant

Measurement Datum
example of usage: Examples of measurement data are the recoding of the weight of a mouse as {40,mass,"grams"}, the recording of an observation of the behavior of the mouse {,process,"agitated"}, the recording of the expression level of a gene as measured through the process of microarray experiment {3.4,luminosity,}.
has curation status: IAO_0000120
type: Class
term editor: person:Chris Stoeckert
editor note: 2/2/2009 is_specified_output of some assay?
subclass of: Data Item
editor preferred term: measurement datum
definition source: OBI_0000305
definition source: group:OBI
definition: A measurement datum is an information content entity that is a recording of the output of a measurement such as produced by a device.

sound
type: DatatypeProperty
domain: Sound
range: anyURI

related technique
type: ObjectProperty
range: Technique
editor preferred term: related technique
example of usage: Flow cytometry is a related technique for a flow cytometer instrument.
has curation status: IAO_0000120
definition: Method in which the resource can be used.
term editor: PERSON: Melissa Haendel
definition source: PERSON: Melissa Haendel

number of pages
type: DatatypeProperty
sub property of: locator

has last name
type: DatatypeProperty
comment: Called Family Name in vCard
domain: Name
range: string

Postdoctoral Position
type: Class
subclass of: Non-Faculty Academic Position
definition: A postdoctoral training appointment (job)

title
type: DatatypeProperty
domain: Title
range: string

One-Dimensional Temporal Region
type: Class
subclass of: Temporal Region

Regulatory Role
definition: a role which inheres in material entities and is realized in the processes of making, enforcing or being defined by legislation or orders issued by a governmental body.
type: Class
definition source: OBI, CDISC
term editor: GROUP: Role branch
editor preferred term: regulatory role
imported from: obi.owl
subclass of: Role
has curation status: IAO_0000120
example of usage: Regulatory agency, Ethics committee, Approval letter; example: Browse these EPA Regulatory Role subtopics http://www.epa.gov/ebtpages/enviregulatoryrole.html Feb 29, 2008

degree candidacy
type: ObjectProperty
domain: Advising Relationship
range: Academic Degree

land area notes
type: DatatypeProperty

email
type: DatatypeProperty
domain: Email
range: string

Calendar Link
type: Class
comment: To specify the URI for a calendar associated with the object represented by the vCard. Was called CALURI in vCard.
subclass of: Calendar
equivalent class: Class
  intersection of: Restriction
    on property: calendar link
    some values from: anyURI
  intersection of: Restriction
    min cardinality: 1
    on property: calendar link
equivalent class: Class
  intersection of: Restriction
    on property: calendar link
    some values from: anyURI
  intersection of: Restriction
    min cardinality: 1
    on property: calendar link

Group
type: Class
comment: Defines all the properties required to be a Group of Individuals or Organizations
subclass of: VCard Kind
equivalent class: Class
  intersection of: Restriction
    on property: member
    some values from: VCard Kind
  intersection of: Restriction
    min cardinality: 1
    on property: member
equivalent class: Class
  intersection of: Restriction
    on property: member
    some values from: VCard Kind
  intersection of: Restriction
    min cardinality: 1
    on property: member

GDP unit
type: DatatypeProperty

Citation Counting and Context Characterization Ontology

nameShortZH
source identifier: http://www.fao.org/termportal/contr/zh/
source identifier: http://www.fao.org/termportal/contr/es/
source identifier: http://www.fao.org/termportal/contr/fr/
source identifier: http://www.fao.org/termportal/contr/ar/
source creator: FAO terminology
source identifier: http://www.fao.org/termportal/contr/en/
type: DatatypeProperty
source: FAO terminology http://www.fao.org/termportal/en/
source identifier: http://www.fao.org/termportal/en/
source modified: 2010-06-24

Location
type: Class
comment: Defines all the properties required to be a Location
subclass of: VCard Kind

Organizational Unit Name
type: Class
subclass of: Organization Name
equivalent class: Class
  intersection of: Restriction
    on property: organizational unit name
    some values from: string
  intersection of: Restriction
    min cardinality: 1
    on property: organizational unit name
equivalent class: Class
  intersection of: Restriction
    on property: organizational unit name
    some values from: string
  intersection of: Restriction
    min cardinality: 1
    on property: organizational unit name

date/time
type: ObjectProperty
domain: Date/Time Value
range: Date/Time Value
sub property of: date/time value

codeUN
type: DatatypeProperty
source creator: United Nations Statistics Division
source identifier: http://unstats.un.org/unsd/methods/m49/m49alpha.htm
source identifier: http://unstats.un.org/unsd/methods/m49/m49alphaf.htm
source modified: 2010-04-01
source: United Nations Statistics Division http://unstats.un.org/unsd/methods/m49/m49alpha.htm

related biological specimen
range: Biological Specimen
type: ObjectProperty
editor preferred term: related biological specimen
definition source: PERSON: Melissa Haendel
definition: Biological specimen collected as part of the research project.
example of usage: A breast cancer specimen.
term editor: PERSON: Melissa Haendel
domain: Research Project
has curation status: IAO_0000120

status
type: ObjectProperty
domain: Document
range: Document Status
example of usage: paraphrased editorial note from the bibo ontology: We are not defining, using an enumeration, the range of the bibo:status to be a defined list of bibo:DocumentStatus. This is because we want people to be able to define new statuses if needed; and creating such an enumeration would prevent this.

has messaging
type: ObjectProperty
range: Messaging

PubMed Central ID
type: DatatypeProperty
domain: Article
sub property of: identifier
example of usage: A PMCID is a unique PubMed Central reference number, which is assigned to each full-text record made available A PMCID is a unique PubMed Central reference number, which is assigned to each full-text record made available in PubMed Central. The PMCID is issued shortly after the PI or author approves the PubMed Central formatted web version of the submission.

Software
subclass of: Material Entity
editor preferred term: software
definition: A general term primarily used for digitally stored data such as computer programs and other kinds of information read and written by computers.
comment: IAO is a planned specification, in SWO is an Information artifact. In eagle-i, we have a need to collect material instances and is it thus currently classified as a material entity.
term editor: PERSON: Melissa Haendel
has curation status: IAO_0000120
example of usage: Microsoft Word is commonly used word processing software.
type: Class
definition source: http://en.wikipedia.org/wiki/Computer_software

Is this person a corresponding author?
type: FunctionalProperty
type: DatatypeProperty
domain: Authorship
range: boolean
example annot: True; False

patient ID
type: DatatypeProperty
domain: Person
range: string
sub property of: identifier

Geo
type: Class
comment: Used to indicate global positioning information that is specific to an address
subclass of: Geographical
equivalent class: Class
  intersection of: Restriction
    on property: geo
    some values from: anyURI
  intersection of: Restriction
    min cardinality: 1
    on property: geo
equivalent class: Class
  intersection of: Restriction
    on property: geo
    some values from: anyURI
  intersection of: Restriction
    min cardinality: 1
    on property: geo

chapter number
type: DatatypeProperty
comment: An chapter number
domain: Book Section
sub property of: locator
term status: unstable

yearMonthDayTimePrecision
type: Date/Time Value Precision
type: NamedIndividual
label: year-month-day-time value

Student
type: Class
subclass of: Person
example of usage: Use only if no specific subclasses of core:Student describe the person.
definition: A person who is enrolled in an educational institution.

version
type: DatatypeProperty
domain: Class
  union of: Software
  union of: Database
range: string
example of usage: v 1.0
has curation status: IAO_0000120
definition: Software edition, typically a numeral followed by a decimal and another numeral, such as 2.1.
term editor: PERSON: Melissa Haendel
definition source: PERSON: Melissa Haendel
domain: Class
  union of: Software
  union of: Database

Non Self Governing
type: Class
subclass of: Territory
subclass of: Restriction
  max cardinality: 1
  on property: is administered by
subclass of: Restriction
  all values from: Self Governing
  on property: is administered by
subclass of: Restriction
  min cardinality: 1
  on property: is administered by
source: UN Cartographic Section, Department of Field Support http://www.un.org/Depts/Cartographic/map/profile/world00.pdf
subclass of: Restriction
  max cardinality: 1
  on property: is administered by
subclass of: Restriction
  all values from: Self Governing
  on property: is administered by
subclass of: Restriction
  min cardinality: 1
  on property: is administered by

year value
type: Date/Time Value Precision
type: NamedIndividual
label: yearPrecision

GDP total in current prices
type: DatatypeProperty

Non-Academic Position
type: Class
subclass of: Position
example of usage: Staff, support, and other non-academic positions.
example of usage: Accounting & Research Services Assistant; Director of Information Technology
definition: A position classified as professional, staff, support, or any other non-academic role

place of publication
type: FunctionalProperty
type: DatatypeProperty

has collaborator
type: ObjectProperty
domain: Agent
range: Agent

narrower concept
type: ObjectProperty
domain: Concept
range: Concept
definition: Public description modified from the information on this page: http://www.w3.org/TR/2005/WD-swbp-skos-core-guide-20050510/#sechierarchy .
description annot: Public description modified from the information on this page: http://www.w3.org/TR/2005/WD-swbp-skos-core-guide-20050510/#sechierarchy .

has affiliated organization
type: ObjectProperty
domain: Organization
range: Organization

SKOS (Simple Knowledge Organization System)

License
type: Class
subclass of: Credential
example of usage: Licenses are usually issued in order to regulate some activity that is deemed to be dangerous or a threat to the person or the public or which involves a high level of specialized skill. See also core:Licensure.
definition: Official or legal permission to do something

has monetary amount
type: DatatypeProperty

countryAreaYear
type: DatatypeProperty

report identifier
type: FunctionalProperty
type: DatatypeProperty
domain: Report
sub property of: identifier

Security
type: Class
comment: Contains all the Security related Classes
equivalent class: Class
  intersection of: Class
    intersection of: Restriction
      on property: geo
      some values from: anyURI
    intersection of: Restriction
      max cardinality: 1
      on property: geo
  intersection of: Class
    intersection of: Restriction
      on property: timezone
      some values from: string
    intersection of: Restriction
      max cardinality: 1
      on property: timezone
  intersection of: Class
    intersection of: Restriction
      all values from: string
      on property: sort as
    intersection of: Restriction
      max cardinality: 1
      on property: sort as
equivalent class: Class
  intersection of: Class
    intersection of: Restriction
      on property: geo
      some values from: anyURI
    intersection of: Restriction
      max cardinality: 1
      on property: geo
  intersection of: Class
    intersection of: Restriction
      on property: timezone
      some values from: string
    intersection of: Restriction
      max cardinality: 1
      on property: timezone
  intersection of: Class
    intersection of: Restriction
      all values from: string
      on property: sort as
    intersection of: Restriction
      max cardinality: 1
      on property: sort as

has calendar request
type: ObjectProperty
range: Calendar Request

has minimum longitude
type: DatatypeProperty

same as
label: mismo que @es

Other
type: Class
subclass of: Gender

has calendar link
type: ObjectProperty
range: Calendar Link

Subnational Region
type: Class
comment: For example, the Midwest, northeast U.S.
subclass of: Geographic Region
example of usage: Short definition was partially taken from http://en.wikipedia.org/wiki/Subnational_entity.
example of usage: Boroughs; townships; districts; the Midwest
definition: Smaller administrative division into which a country may be divided.

nameOfficialIT
source modified: 2010-06-24
type: DatatypeProperty
source identifier: http://www.fao.org/termportal/en/
source identifier: http://www.fao.org/termportal/contr/en/
source identifier: http://www.fao.org/termportal/contr/fr/
source identifier: http://www.fao.org/termportal/contr/zh/
source creator: FAO terminology
source: FAO terminology http://www.fao.org/termportal/en/
source identifier: http://www.fao.org/termportal/contr/es/
source identifier: http://www.fao.org/termportal/contr/ar/

calendar request
type: DatatypeProperty
domain: Calendar Request
range: anyURI

organizational unit name
type: DatatypeProperty
domain: Organizational Unit Name
range: string

related
type: DatatypeProperty
domain: Related
range: anyURI

nameShortRU
source modified: 2010-06-24
source creator: FAO terminology
source identifier: http://www.fao.org/termportal/contr/zh/
type: DatatypeProperty
source identifier: http://www.fao.org/termportal/contr/fr/
source identifier: http://www.fao.org/termportal/contr/en/
source identifier: http://www.fao.org/termportal/en/
source identifier: http://www.fao.org/termportal/contr/ar/
source: FAO terminology http://www.fao.org/termportal/en/
source identifier: http://www.fao.org/termportal/contr/es/

implements
type: ObjectProperty

moniker (deprecated)

codeFAOSTAT
type: DatatypeProperty
source creator: FAOSTAT
source identifier: http://faostat.fao.org
source identifier: http://faostat.fao.org/default.aspx
source: FAOSTAT http://faostat.fao.org

access provided by
type: ObjectProperty
range: Access Service
inverse of: provides access to

invited
type: Document Status
type: NamedIndividual

is encoded in
type: ObjectProperty
domain: Class
  union of: Software
  union of: Database
domain: Class
  union of: Software
  union of: Database

Workshop
type: Class
comment: A seminar, discussion group, or the like, that emphasizes zxchange of ideas and the demonstration and application of techniques, skills, etc.
subclass of: Event
definition: Bibo Definition: A seminar, discussion group, or the like, that emphasizes exchange of ideas and the demonstration and application of techniques, skills, etc.
term status: stable

contributes to
type: ObjectProperty
domain: Role
inverse of: contributor

gender
type: DatatypeProperty
comment: To specify the components of the sex and gender identity of the object the vCard represents. To enable other Gender/Sex codes to be used, this dataproperty has range URI. The vCard gender code classes are defined under Code/Gender
domain: Individual
range: anyURI

Film
type: Class
comment: aka movie.
subclass of: Audio-Visual Document
definition: Audiovisual recording in film format
term status: stable

Consortium
type: Class
subclass of: Organization
example of usage: Committee on Institutional Cooperation (CIC); The Five Colleges of Ohio
definition: A group of independent organizations working together toward a common goal, under an expressed agreement.
imported from: VIVO-ISF Ontology version 1.6

Disputed
type: Class
subclass of: Territory

nameListES
source identifier: http://www.fao.org/termportal/contr/ar/
type: DatatypeProperty
source identifier: http://www.fao.org/termportal/contr/es/
source: FAO terminology http://www.fao.org/termportal/en/
source identifier: http://www.fao.org/termportal/contr/zh/
source identifier: http://www.fao.org/termportal/contr/en/
source creator: FAO terminology
source identifier: http://www.fao.org/termportal/en/
source identifier: http://www.fao.org/termportal/contr/fr/
source modified: 2010-06-24

Support Service
type: Class
subclass of: Service
example of usage: Technical support.
has curation status: IAO_0000120
definition: A service offering that describes a service in which the provider assists the consumer in activities directly or indirectly associated with the production and analysis or experimental research data.
term editor: PERSON: Matt Brush
definition source: PERSON: Matthew Brush

features
type: ObjectProperty
domain: Information Content Entity
range: Agent
example of usage: This is done through a restriction on the foaf:Person class.

is cited as data source by
type: ObjectProperty
comment: The cited entity is cited as a data source by the citing entity.
inverse of: cites as data source

Certification
type: Class
subclass of: Issued Credential
example of usage: see also core:Certificate
definition: An issued certificate

Clinical Role
type: Class
subclass of: Role
definition: A role of observing or treating patients

Datum Label
type: Class
subclass of: Information Content Entity
editor preferred term: datum label
has curation status: IAO_0000123
definition: A label is a symbol that is part of some other datum and is used to either partially define the denotation of that datum or to provide a means for identifying the datum as a member of the set of data with the same label
editor note: http://www.golovchenko.org/cgi-bin/wnsearch#4n
term editor: GROUP: IAO
imported from: iao.owl

land area
source creator: FAOSTAT
source modified: 2011-07-21
source: FAOSTAT http://faostat.fao.org/DesktopDefault.aspx?PageID=377&lang=en#ancor
source identifier: http://faostat.fao.org/DesktopDefault.aspx#ancor
type: DatatypeProperty
description: Land area is the total area of the country excluding area under inland water bodies. Possible variations in the data may be due to updating and revisions of the country data and not necessarily to any change of area. Data are expressed in 1 000 hectares. http://faostat.fao.org/site/375/default.aspx

credential eligibility attained
type: ObjectProperty
range: Credential

Transport Service
type: Class
subclass of: Service
example of usage: Transport of a patient within a hospital.
has curation status: IAO_0000120
definition: A service offering that describes a service in which the provider facilitates the transport of some material entity to a specified destination for the service consumer.
term editor: PERSON: Matt Brush
definition source: PERSON: Matthew Brush

has eligibility requirement
domain: Research Opportunity
definition source: PERSON: Melissa Haendel
definition: Requirements for research opportunity eligibility. Requirements include: coursework, minimum gradepoint average, state residency, under-represented group status, field of study, or matriculation status.
range: string
example of usage: A grade point average above 3.5 is an eligibility requirement.
has curation status: IAO_0000120
term editor: PERSON: Melissa Haendel
type: DatatypeProperty
editor preferred term: has eligibility requirement

Facility
type: Class
subclass of: Site
subclass of: Restriction
  all values from: Facility
  on property: has part
subclass of: Restriction
  all values from: Site
  on property: part of
example of usage: Use subclasses of core:Facility subclasses instead of this class if possible
example of usage: Distinct from the organization that runs it; e.g., a laboratory may be an organization but may be run by another organization and only consist of facilities housing equipment or services. Can be a building or place that provides a particular service or is used for a particular activity. Use the specific Building or Room whenever possible. Short definition from http://dictionary.reference.com/browse/facility.
definition: Something designed, built, installed, etc., to serve a specific function or activity affording a convenience or service.
subclass of: Restriction
  all values from: Facility
  on property: has part
subclass of: Restriction
  all values from: Site
  on property: part of

Action Specification
type: Class
subclass of: Directive Information Entity
example of usage: Pour the contents of flask 1 into flask 2
has curation status: IAO_0000123
definition: a directive information entity that describes an action the bearer will take
term editor: Alan Ruttenberg
definition source: OBI Plan and Planned Process branch
imported from: iao.owl

expiration date
type: ObjectProperty
sub property of: date/time value

Meeting
type: Class
subclass of: Event
definition: A gathering of people for a defined purpose, not necessarily public or announced

Video
type: Class
subclass of: Telephone Type

assignee
type: ObjectProperty
domain: Patent
range: Agent

specialty
type: Class
subclass of: Quality

Blog
type: Class
subclass of: Website
example of usage: Library of Congress Blog
example of usage: Blog is short for weblog.
definition: Regularly updated online journal or newsletter by one or more writers, called bloggers, containing articles and commentary of interest to the blogger

Data Storage Service
type: Class
subclass of: Storage Service
example of usage: Storing data on a server.
has curation status: IAO_0000120
definition: A storage service offering that describes a service in which the consumer provides data as input, which a service provider stores and returns as output in its original form.
term editor: PERSON: Matt Brush
definition source: PERSON: Matthew Brush

related documents
type: ObjectProperty
comment: Relates an event to associated documents; for example, conference to a paper.
example of usage: Public Description from source: http://bibotools.googlecode.com/svn/bibo-ontology/trunk/doc/index.html . Bibo considers the bibo:presents and the bibo:presentedAt unstable terms. It also indicates that bibo:presents is a sub-property of event:product.
term status: unstable

Faculty Administrative Position
type: Class
subclass of: Position
example of usage: Associate Dean
example of usage: That is a position held by an academic faculty member who works for administration.
definition: An academic administrative position (associate dean, etc.) as distinct from a professional administrative position (non-academic)

Experience
type: Class
subclass of: Quality

Position
subclass of: Restriction
  all values from: Date/Time Interval
  on property: date/time interval
subclass of: Restriction
  all values from: int
  on property: rank
subclass of: Restriction
  on property: relates
  some values from: Organization
type: Class
definition: Particular position in an organization, commonly identified by job title, and normally associated with a job description that details the tasks and responsibilities that go with the position.
example of usage: Director of Admissions and Placement; Associate University Librarian
subclass of: Relationship
example of usage: An employment activity, whether compensated or not. Short definition comes from http://en.wikipedia.org/wiki/Position, and has been modified.
subclass of: Restriction
  on property: relates
  some values from: Person
subclass of: Restriction
  all values from: Date/Time Interval
  on property: date/time interval
subclass of: Restriction
  all values from: int
  on property: rank
subclass of: Restriction
  on property: relates
  some values from: Organization
subclass of: Restriction
  on property: relates
  some values from: Person

Article
subclass of: Document
example of usage: Short Definition modified from the bibo ontology.
type: Class
definition: A written composition in prose, usually nonfiction, on a specific topic, forming an independent part of a periodical or book
example of usage: A specific journal article
subclass of: Restriction
  all values from: Literal
  on property: start page
subclass of: Restriction
  all values from: Literal
  on property: end page
comment: A written composition in prose, usually nonfiction, on a specific topic, forming an independent part of a book or other publication, as a newspaper or magazine.
subclass of: Restriction
  all values from: Literal
  on property: Digital Object Identifier (DOI)
term status: stable
subclass of: Restriction
  all values from: Literal
  on property: start page
subclass of: Restriction
  all values from: Literal
  on property: end page
subclass of: Restriction
  all values from: Literal
  on property: Digital Object Identifier (DOI)

Material Storage Service
type: Class
subclass of: Storage Service
example of usage: Cryopreservation service.
has curation status: IAO_0000120
definition: A storage service offering that describes a service in which the consumer provides some material as input which a service provider stores and returns as output
term editor: PERSON: Matt Brush
definition source: PERSON: Matthew Brush

related degree
type: ObjectProperty
comment: The thesis degree.
range: Thesis Degree
example of usage: The source of the public description and this info is found here: http://bibotools.googlecode.com/svn/bibo-ontology/trunk/doc/index.html. Bibo considers this term "unstable". The bibo editorial note is: "We are not defining, using an enumeration, the range of the bibo:degree to the defined list of bibo:ThesisDegree. We won't do it because we want people to be able to define new degress if needed by some special usecases. Creating such an enumeration would restrict this to happen."
term status: unstable
editorial note: We are not defining, using an enumeration, the range of the bibo:degree to the defined list of bibo:ThesisDegree. We won't do it because we want people to be able to define new degress if needed by some special usecases. Creating such an enumeration would restrict this to happen.

Laboratory
type: Class
subclass of: Organization
definition: An organizational unit (as opposed to the physical facility) that performs research, provides services, or processes materials
definition: An organization unit that facilitates or conduits observation, testing, experimentation, or research in a field of study or practice.
imported from: VIVO-ISF Ontology version 1.6

local award ID
type: DatatypeProperty
domain: Class
  union of: Contract
  union of: Grant
sub property of: identifier
example of usage: core:localAwardId has a domain of core:Grant, and should be public since that's its public identifier for local use by OSP, accounting, department admins, and the PI
domain: Class
  union of: Contract
  union of: Grant

has telephone
type: ObjectProperty
range: Telephone

International Classification (ICL) code
type: DatatypeProperty
domain: Patent
example of usage: The International classification(s) to which the published application has been assigned.

agricultural area
source identifier: http://faostat.fao.org/DesktopDefault.aspx#ancor
source creator: FAOSTAT
source: FAOSTAT http://faostat.fao.org/DesktopDefault.aspx?PageID=377&lang=en#ancor
type: DatatypeProperty
source modified: 2010-07-21
description: Agricultural area, this category is the sum of areas under a) arable land - land under temporary agricultural crops (multiple-cropped areas are counted only once), temporary meadows for mowing or pasture, land under market and kitchen gardens and land temporarily fallow (less than five years). The abandoned land resulting from shifting cultivation is not included in this category. Data for “Arable land” are not meant to indicate the amount of land that is potentially cultivable; (b) permanent crops - land cultivated with long-term crops which do not have to be replanted for several years (such as cocoa and coffee); land under trees and shrubs producing flowers, such as roses and jasmine; and nurseries (except those for forest trees, which should be classified under "forest"); and (c) permanent meadows and pastures - land used permanently (five years or more) to grow herbaceous forage crops, either cultivated or growing wild (wild prairie or grazing land). Data are expressed in 1000 hectares. http://faostat.fao.org/site/375/default.aspx

publisher of
type: ObjectProperty
domain: Organization
range: Information Content Entity
example of usage: Public Definition source (http://www.answers.com/topic/publisher).

Material Maintenance Service
type: Class
subclass of: Maintenance Service
example of usage: Maintaining an animal coloy.
has curation status: IAO_0000120
definition: A maintenance service offering that describes a service in which the provider actively maintains a material resource (e.g. a model organism colony) for the service consumer. A material maintenance service may or may not include storage of the material input.
term editor: PERSON: Matt Brush
definition source: PERSON: Matthew Brush

Teacher Role
type: Class
subclass of: Role
definition: A role of serving as an educator

has geo
type: ObjectProperty
range: Geo

Quality
type: Class
subclass of: Specifically Dependent Continuant

population
source identifier: http://faostat.fao.org/DesktopDefault.aspx#ancor
source modified: 2009-09-21
description: The total population usually refers to the present-in-area (de facto) population which includes all persons physically present within the present geographical boundaries of countries at the mid-point of the reference period. http://faostat.fao.org/site/375/default.aspx
source creator: FAOSTAT
type: DatatypeProperty
source: FAOSTAT http://faostat.fao.org/site/550/default.aspx

Dataset
type: Class
subclass of: Document
subclass of: Restriction
  all values from: Document
  on property: is cited as data source by
example of usage: US Patent Data; US Job Data
definition: A named collection of data, usually containing only one type of data
subclass of: Restriction
  all values from: Document
  on property: is cited as data source by

Pager
type: Class
subclass of: Telephone Type

Contract
definition: An agreement involving specific deliverables and payment
subclass of: Restriction
  all values from: Literal
  on property: abstract
subclass of: Restriction
  all values from: Information Content Entity
  on property: supported publications or other works
subclass of: Restriction
  on property: relates
  some values from: Role
subclass of: Restriction
  on property: relates
  some values from: Agent
subclass of: Restriction
  all values from: Organization
  on property: assigned by
subclass of: Restriction
  all values from: Date/Time Interval
  on property: date/time interval
subclass of: Relationship
type: Class
subclass of: Restriction
  all values from: Literal
  on property: abstract
subclass of: Restriction
  all values from: Information Content Entity
  on property: supported publications or other works
subclass of: Restriction
  on property: relates
  some values from: Role
subclass of: Restriction
  on property: relates
  some values from: Agent
subclass of: Restriction
  all values from: Organization
  on property: assigned by
subclass of: Restriction
  all values from: Date/Time Interval
  on property: date/time interval

Hearing
type: Class
comment: An instance or a session in which testimony and arguments are presented, esp. before an official, as a judge in a lawsuit.
subclass of: Event
example of usage: Definiton from Bibo here: http://bibotools.googlecode.com/svn/bibo-ontology/trunk/doc/index.html
definition: An instance or a session in which testimony and arguments are presented, esp. before an official, as a judge in a lawsuit.
term status: stable

Maintenance Service
type: Class
subclass of: Service
has curation status: IAO_0000123
definition: A service offering that describes a service in which the provider actively maintains a material or data resource (e.g. a model organism colony or database) for the service consumer. This may involved making physical alterations to the material or data with the goal of maintaining its integrity or features.
term editor: PERSON: Matt Brush
definition source: PERSON: Matthew Brush

Date/Time Value
type: Class
subclass of: Zero-Dimensional Temporal Region
definition: A date and/or time

reproduced in
type: ObjectProperty
domain: Document
range: Document
sub property of: part of

Emergency
type: Class
subclass of: Relation Type

outreach overview
type: FunctionalProperty
type: DatatypeProperty
domain: Person
example of usage: Used for a single narrative summary of outreach, typically covering a wide range of activities and time periods; use Outreach Provider Role for information on individual activities
example of usage: My extension program consists of developing and reporting disease management strategies that are both economically and environmentally sound for fresh market vegetable production. We hope that some of this testing will result in practices adaptable for organic production.

Address
type: Class
comment: To specify the components of the delivery address for the vCard object
subclass of: Addressing
equivalent class: Class
  intersection of: Class
    intersection of: Restriction
      on property: country
      some values from: string
    intersection of: Restriction
      max cardinality: 1
      on property: country
  intersection of: Class
    intersection of: Restriction
      on property: locality
      some values from: string
    intersection of: Restriction
      max cardinality: 1
      on property: locality
  intersection of: Class
    intersection of: Restriction
      on property: postal code
      some values from: string
    intersection of: Restriction
      max cardinality: 1
      on property: postal code
  intersection of: Class
    intersection of: Restriction
      on property: region
      some values from: string
    intersection of: Restriction
      max cardinality: 1
      on property: region
  intersection of: Class
    intersection of: Restriction
      on property: street address
      some values from: string
    intersection of: Restriction
      max cardinality: 1
      on property: street address
equivalent class: Class
  intersection of: Class
    intersection of: Restriction
      on property: country
      some values from: string
    intersection of: Restriction
      max cardinality: 1
      on property: country
  intersection of: Class
    intersection of: Restriction
      on property: locality
      some values from: string
    intersection of: Restriction
      max cardinality: 1
      on property: locality
  intersection of: Class
    intersection of: Restriction
      on property: postal code
      some values from: string
    intersection of: Restriction
      max cardinality: 1
      on property: postal code
  intersection of: Class
    intersection of: Restriction
      on property: region
      some values from: string
    intersection of: Restriction
      max cardinality: 1
      on property: region
  intersection of: Class
    intersection of: Restriction
      on property: street address
      some values from: string
    intersection of: Restriction
      max cardinality: 1
      on property: street address

uses
type: ObjectProperty
has curation status: IAO_0000120
comment: Here there are things to be fixed (for instance a service can use a technique...)
definition source: PERSON: Melissa Haendel
term editor: PERSON: Melissa Haendel
range: Class
  union of: Software
  union of: Database
  union of: Protocol
domain: Organization
inverse of: used by
editor preferred term: uses
definition: Software or protocol used by the laboratory.
example of usage: Microsoft powerpoint is commonly used in research laboratories to prepare presentations.
range: Class
  union of: Software
  union of: Database
  union of: Protocol

nameCurrencyFR
source identifier: http://www.fao.org/termportal/contr/zh/
type: DatatypeProperty
source identifier: http://www.fao.org/termportal/contr/es/
source identifier: http://www.fao.org/termportal/contr/ar/
source identifier: http://www.fao.org/termportal/en/
source identifier: http://www.fao.org/termportal/contr/fr/
source creator: FAO terminology
source identifier: http://www.fao.org/termportal/contr/en/
source: FAO terminology http://www.fao.org/termportal/en/
source modified: 2010-06-24

Realizable Entity
example of usage: the disposition of this piece of metal to conduct electricity.
example of usage: the role of this boundary to delineate where Utah and Colorado meet
example of usage: the disposition of your blood to coagulate
disjoint with: Quality
BFO_0000180: RealizableEntity
BFO_0000179: realizable
IAO_0000602: (forall (x) (if (RealizableEntity x) (and (SpecificallyDependentContinuant x) (exists (y) (and (IndependentContinuant y) (not (SpatialRegion y)) (inheresIn x y)))))) // axiom label in BFO2 CLIF: [058-002]
IAO_0000600: To say that b is a realizable entity is to say that b is a specifically dependent continuant that inheres in some independent continuant which is not a spatial region and is of a type instances of which are realized in processes of a correlated type. (axiom label in BFO2 Reference: [058-002])
example of usage: the role of being a doctor
IAO_0000601: All realizable dependent continuants have independent continuants that are not spatial regions as their bearers. (axiom label in BFO2 Reference: [060-002])
type: Class
IAO_0000602: (forall (x t) (if (RealizableEntity x) (exists (y) (and (IndependentContinuant y) (not (SpatialRegion y)) (bearerOfAt y x t))))) // axiom label in BFO2 CLIF: [060-002]
subclass of: Specifically Dependent Continuant
example of usage: the function of your reproductive organs

governing authority
range: Organization

additional name
type: DatatypeProperty
domain: Name
range: string

Academic Article
example of usage: A specific academic journal article
type: Class
subclass of: Restriction
  all values from: Journal
  on property: published in
definition: Written by scholars for other scholars, typically published in an academic journal with an abstract and bibliography
comment: A scholarly academic article, typically published in a journal.
subclass of: Article
term status: stable
subclass of: Restriction
  all values from: Literal
  on property: EAN International-Uniform Code Council (EAN-UCC) 13
subclass of: Restriction
  all values from: Journal
  on property: published in
subclass of: Restriction
  all values from: Literal
  on property: EAN International-Uniform Code Council (EAN-UCC) 13

curator note
type: AnnotationProperty

Transnational Region
type: Class
subclass of: Geographic Region
subclass of: Group
source: United Nations statistics department http://unstats.un.org/unsd/methods/m49/m49regin.htm

Digital Object Identifier (DOI)
type: DatatypeProperty
comment: Digital Object Identifier
domain: Information Content Entity
sub property of: identifier
term status: stable

accepted
type: Document Status
type: NamedIndividual
definition: Accepted for publication after peer reviewing
description: Accepted for publication after peer reviewing

used by
range: Organization
example of usage: A laboratory uses Microsoft Word.
definition source: PERSON: Melissa Haendel
domain: Class
  union of: Software
  union of: Database
  union of: Protocol
type: ObjectProperty
has curation status: IAO_0000120
definition: Laboratory that uses the protocol or software.
editor preferred term: used by
term editor: PERSON: Melissa Haendel
domain: Class
  union of: Software
  union of: Database
  union of: Protocol

is administered by
type: ObjectProperty
source creator: United Nations cartographic maps
source identifier: http://www.un.org/Depts/Cartographic/map/profile/world00.pdf
source modified: 2010-05-01
source: United Nations cartographic maps http://www.un.org/Depts/Cartographic/map/profile/world00.pdf

has logo
type: ObjectProperty
range: Logo

Cell
type: Class
comment: Also called mobile telephone
subclass of: Telephone Type

volume
type: DatatypeProperty
domain: Document
sub property of: locator

key
type: DatatypeProperty
domain: Key
range: anyURI

Principal Investigator Role
type: Class
subclass of: Investigator Role
definition: Role of a person to direct a project or activity being supported by an Agreement (for example, a grant), and who is accountable to the grantee for the proper conduct of the project or activity. Also known as Program Director or Project Director.

Biological Specimen
definition source: http://en.wikipedia.org/wiki/Specimen
definition: Material entity that is a portion or quantity of a biological material for use in testing, examination, or study. A biological specimen can be an individual animal, a population of organisms, or is a part of or derived from an animal, plant, part of a plant, or microorganism. When a taxon is described, it is typically based on a single specimen and is referred to as the holotype.
type: Class
alternative term: biospecimen
subclass of: Restriction
  on property: derives from
  some values from: Organism
editor preferred term: biological specimen
term editor: PERSON: Melissa Haendel
has curation status: IAO_0000120
comment: Should have relationship to Organism
example of usage: Heart tissue obtained from an organism.
subclass of: Material Entity
subclass of: Restriction
  on property: derives from
  some values from: Organism

nameShortFR
source identifier: http://www.fao.org/termportal/contr/fr/
source identifier: http://www.fao.org/termportal/contr/es/
source identifier: http://www.fao.org/termportal/contr/ar/
source identifier: http://www.fao.org/termportal/contr/en/
source creator: FAO terminology
source identifier: http://www.fao.org/termportal/contr/zh/
source modified: 2010-06-24
type: DatatypeProperty
source: FAO terminology http://www.fao.org/termportal/en/
source identifier: http://www.fao.org/termportal/en/

Review
type: Class
subclass of: Article
definition: An article reviewing one or more other information resources (a book, one or more other articles, movies, etc)

award sponsored by
type: ObjectProperty
domain: Award or Honor
range: Organization

Global Citation Count
type: Class
subclass of: Scalar Measurement Datum
definition: The number of times a work has been cited globally, as determined from a particular bibliographic information source on a particular date.
description annot: The number of times a work has been cited globally, as determined from a particular bibliographic information source on a particular date.

credits
type: FunctionalProperty
type: DatatypeProperty

note
type: DatatypeProperty
domain: Note
range: string

American Board of Emergency Medicine

Permanent Resident Role
type: Class
subclass of: Non-US Citizen
has curation status: IAO_0000123
definition: An role that inheres in an individual who is not a citizen but who legally resides in another nation on a permanent or extended basis.
term editor: PERSON: Nicole Vasilevsky
definition source: http://connection.ebscohost.com/us/immigration-restrictions/overview-legal-and-illegal-immigration

University
type: Class
subclass of: Organization
example of usage: University of Florida; Washington University in St. Louis
example of usage: Definition taken from: http://en.wikipedia.org/wiki/University
definition: An institution of higher education and research, which grants academic degrees in a variety of subjects, and provides both undergraduate education and postgraduate education.
imported from: VIVO-ISF Ontology version 1.6

number
type: DatatypeProperty
example of usage: Definition from here: http://bibotools.googlecode.com/svn/bibo-ontology/trunk/doc/index.html

Working Paper
type: Class
subclass of: Document
subclass of: Restriction
  all values from: Literal
  on property: place of publication
definition: A document created as a basis for discussion or a very early draft of a formal paper
subclass of: Restriction
  all values from: Literal
  on property: place of publication

Journal Article
imported from: iao.owl
has curation status: IAO_0000120
editor preferred term: journal article
example of usage: Examples are articles published in the journals, Nature and Science. The content can often be cited by reference to a paper based encoding, e.g. Authors, Title of article, Journal name, date or year of publication, volume and page number.
definition source: OBI_0000159
definition: a report that is published in a journal
term editor: person:Chris Stoeckert
type: Class
definition source: group:OBI
subclass of: Academic Article
term editor: person:Alan Ruttenberg

teaching overview
type: FunctionalProperty
type: DatatypeProperty
domain: Person
example of usage: Used for a single narrative summary of teaching, typically covering a wide range of courses including for credit and non-credit teaching over multiple semesters; the "teaches" property links a person directly with an instance of a Semester Class, typically from an institutional database of record; then use Teacher Role for information about a person's role in non-credit teaching or their specific contribution to individual courses

terms merged

International Standard Serial Number (ISSN)
type: DatatypeProperty
comment: International Standard Serial Number
sub property of: identifier
example of usage: source: http://en.wikipedia.org/wiki/Issn
term status: stable

patent number
type: FunctionalProperty
type: DatatypeProperty
domain: Patent
sub property of: identifier
example of usage: source of definition: http://www.uspto.gov/main/glossary/#p . The following site has patent number formats: http://www.uspto.gov/patents/ebc/kindcodesum.jsp .

has participant
type: ObjectProperty
domain: Occurrent
range: Continuant
inverse of: participates in

Journal
subclass of: Restriction
  all values from: string
  on property: abbreviation
example of usage: Journal of Information Science; IEEE Intelligent System; Scientometrics
definition: Contains original scholarly research or review articles by experts in the field
comment: A periodical of scholarly journal Articles.
term status: stable
example of usage: Articles usually contain abstracts and bibliographies. Includes peer-reviewed, non-peer-reviewed, and open access journals. Journals are usually indexed in the major academic databases such as PubMed and Web of Science.
subclass of: Periodical
type: Class
subclass of: Restriction
  all values from: string
  on property: abbreviation

nameListEN
source identifier: http://www.fao.org/termportal/contr/es/
source identifier: http://www.fao.org/termportal/contr/zh/
source creator: FAO terminology
source modified: 2010-06-24
source identifier: http://www.fao.org/termportal/contr/en/
type: DatatypeProperty
source: FAO terminology http://www.fao.org/termportal/en/
source identifier: http://www.fao.org/termportal/contr/ar/
source identifier: http://www.fao.org/termportal/en/
source identifier: http://www.fao.org/termportal/contr/fr/

timezone
type: DatatypeProperty
domain: Time Zone
range: string

has code
type: DatatypeProperty

participates in
type: ObjectProperty
domain: Continuant
range: Occurrent

has global count value
type: DatatypeProperty
domain: Global Citation Count
range: int
definition: An integer defining the value of the global citation count of a cited entity recorded from a named bibliographic information source on a particular date.
description annot: An integer defining the value of the global citation count of a cited entity recorded from a named bibliographic information source on a particular date.

HDI
source identifier: http://hdrstats.undp.org/en/indicators/49806.html
source identifier: http://hdrstats.undp.org/fr/indicateurs/49806.html
source modified: 2010-11-04
source creator: UNDP - HDRO
type: DatatypeProperty
description: composite index measuring average achievement in three basic dimensions of human development-a long and healthy life, knowledge and a decent standard of living. Source: Calculated based on data from UNDESA (2009d), Barro and Lee (2010), UNESCO Institute for Statistics (2010b), World Bank (2010b) and IMF(2010a) . http://hdrstats.undp.org/en/indicators/49806.html
source: UNDP - HDRO http://hdrstats.undp.org/en/indicators/49806.html
description: composite index measuring average achievement in three basic dimensions of human development—a long and healthy life, knowledge and a decent standard of living. Source: Calculated based on data from UNDESA (2009d), Barro and Lee (2010), UNESCO Institute for Statistics (2010b), World Bank (2010b) and IMF(2010a) . http://hdrstats.undp.org/en/indicators/49806.html
source identifier: http://hdrstats.undp.org/es/indicadores/49806.html

Data Maintenance Service
type: Class
subclass of: Maintenance Service
example of usage: Maintaining a database.
has curation status: IAO_0000120
definition: A maintenance service offering that describes a service in which the provider actively manages or maintains data or a database for the service consumer. Maintenance of the data is performed to maintain its integrity or enhance its quality or utility for the consumer, but new data is not generated as a result of the maintenance.
term editor: PERSON: Matt Brush
definition source: PERSON: Matthew Brush

Event Series
subclass of: Restriction
  all values from: Literal
  on property: description
example of usage: A generic class which may include a conference series, a course section, a seminar series, or a workshop series. When possible, use one of these more specific classes.
subclass of: Process
subclass of: Restriction
  all values from: Date/Time Interval
  on property: date/time interval
subclass of: Restriction
  all values from: Literal
  on property: contact information
example of usage: Only use if no specific subclasses of core:EventSeries desribe the activity.
definition: Two or more events that occur at different times and are connected to each other.
type: Class
subclass of: Restriction
  all values from: Thing
  on property: has subject area
subclass of: Restriction
  all values from: Literal
  on property: description
subclass of: Restriction
  all values from: Date/Time Interval
  on property: date/time interval
subclass of: Restriction
  all values from: Literal
  on property: contact information
subclass of: Restriction
  all values from: Thing
  on property: has subject area

Building
type: Class
subclass of: Facility
subclass of: Restriction
  all values from: Room
  on property: has part
subclass of: Restriction
  all values from: Facility
  on property: part of
example of usage: Martha Van Rensselaer Hall (VR); Caldwell Hall (CD); University Auditorium
example of usage: Enter building name. If the building's name is a number (as in many governmental organizations such as national laboratories and military bases), then enter it. Do not confuse with the number that appears in a postal address.
definition: Building that provides a particular service or is used for a particular activity.
subclass of: Restriction
  all values from: Room
  on property: has part
subclass of: Restriction
  all values from: Facility
  on property: part of

is performed by
range: Class
  union of: Laboratory
  union of: Person
domain: Technique
inverse of: performs technique
term editor: PERSON: Melissa Haendel
has curation status: IAO_0000120
editor preferred term: is performed by
definition source: PERSON: Melissa Haendel
type: ObjectProperty
definition: Person or laboratory that performs the service or technique.
example of usage: Confocal microscopy is performed by a confocal core laboratory.
range: Class
  union of: Laboratory
  union of: Person

has calendar busy
type: ObjectProperty
range: Calendar Busy

geographic focus of
type: ObjectProperty
domain: Geographic Region
inverse of: geographic focus

has category
type: ObjectProperty
range: Category

has contact agent
type: ObjectProperty

Analysis Service
type: Class
subclass of: Service
example of usage: Flow cytometry analysis service.
has curation status: IAO_0000120
definition: A service offering that describes a service in which the consumer provides some input material or data and a service provider returns data about the input material or data.
term editor: PERSON: Matt Brush
definition source: PERSON: Matthew Brush

American Board of Allergy and Immunology

has residency requirement
definition: US residency status of applicants that may apply for the student research opportunity.
range: US Resident Role
has curation status: IAO_0000120
term editor: PERSON: Melissa Haendel
example of usage: A research opportunity requires applicants to be US citizens.
editor preferred term: has residency requirement
type: ObjectProperty
domain: Research Opportunity
definition source: PERSON: Melissa Haendel

review of
type: ObjectProperty
example of usage: The bibo:reviewOf public description was found here: http://bibotools.googlecode.com/svn/bibo-ontology/trunk/doc/index.html . As of 26 May 2010, bibo:reviewOf is used with the class Review, but core:reviewIn doesn't seem to be being used.
inverse of: reviewed in

Material Modification Service
type: Class
subclass of: Material Processing Service
example of usage: Histology service.
has curation status: IAO_0000120
definition: A material processing service offering that describes a service in which the provider makes physical modifications to a specified input material, such that at least one of the specified outputs of this process is a modified version of a specified input material.
term editor: PERSON: Matt Brush
definition source: PERSON: Matthew Brush

supported by
type: ObjectProperty
domain: Information Content Entity
sub property of: supported by
description annot: an information resource (typically a publication) supported by (typically via funding) an agreement (such as a grant)

performs technique
type: ObjectProperty
domain: Class
  union of: Laboratory
  union of: Person
range: Technique
example of usage: A cancer researcher performs apoptosis assays.
has curation status: IAO_0000120
definition: Technique carried out by the person or laboratory.
term editor: PERSON: Melissa Haendel
definition source: PERSON: Melissa Haendel
domain: Class
  union of: Laboratory
  union of: Person

landAreaYear
type: DatatypeProperty

Website
type: Class
comment: A group of Webpages accessible on the Web.
subclass of: Collection
subclass of: Restriction
  all values from: Agent
  on property: publisher
example of usage: Facebook; VIVOweb.org; Flickr
definition: A group of webpages available within a specific parent address or URL on the World Wide Web
term status: unstable
subclass of: Restriction
  all values from: Agent
  on property: publisher

nationalityIT
source creator: FAO terminology
source modified: 2010-06-24
type: DatatypeProperty
source identifier: http://www.fao.org/termportal/contr/es/
source identifier: http://www.fao.org/termportal/en/
source identifier: http://www.fao.org/termportal/contr/en/
source: FAO terminology http://www.fao.org/termportal/en/
source identifier: http://www.fao.org/termportal/contr/fr/
source identifier: http://www.fao.org/termportal/contr/ar/
source identifier: http://www.fao.org/termportal/contr/zh/

Educational Process
type: Class
subclass of: Process
subclass of: Restriction
  all values from: string
  on property: supplemental information
subclass of: Restriction
  all values from: Date/Time Interval
  on property: date/time interval
example of usage: Currently any abstract name is given to individuals of this class. This could change in the future.
definition: Represents educational training that has been received.
description annot: This connects person to their academic degree through this educational training, but can also be used when the training does not result in a degree.
subclass of: Restriction
  all values from: string
  on property: supplemental information
subclass of: Restriction
  all values from: Date/Time Interval
  on property: date/time interval

US Resident Role
type: Class
subclass of: Role
has curation status: IAO_0000123
definition: A role that inheres in a person who maintains residency in the United states.
term editor: PERSON: Nicole Vasilevsky
definition source: PERSON: Nicole Vasilevsky

American Board of Anesthesiology

is template
type: DatatypeProperty
domain: Document
range: boolean
definition: The document can be used as a template for the creation of other documents.

bearer of
type: ObjectProperty
domain: Independent Continuant
range: Specifically Dependent Continuant

Role
type: Class
subclass of: Realizable Entity
subclass of: Restriction
  all values from: Literal
  on property: description
subclass of: Restriction
  all values from: Date/Time Interval
  on property: date/time interval
subclass of: Restriction
  all values from: boolean
  on property: hide from display
example of usage: Only use if no specific subclasses of core:Role describe the role.
definition: A person's, group's or organization's role in an endeavor
description annot: Only use this broad role class if no subclasses of role describe the item being classified.
subclass of: Restriction
  all values from: Literal
  on property: description
subclass of: Restriction
  all values from: Date/Time Interval
  on property: date/time interval
subclass of: Restriction
  all values from: boolean
  on property: hide from display

Data Analysis Service
subclass of: Analysis Service
example of usage: Sequence data analysis.
has curation status: IAO_0000120
term editor: PERSON: Matt Brush
type: Class
alternative term: data processing service
definition source: PERSON: Matthew Brush
alternative term: data transformation service
definition: An analysis service offering that describes a service in which the consumer provides some input data and a service provider transforms, models, or interprets the input data and returns this generated data as output

has key
type: ObjectProperty
range: Key

Time Zone
type: Class
comment: Used to indicate time zone information that is specific to a location or address
subclass of: Geographical
equivalent class: Class
  intersection of: Restriction
    on property: timezone
    some values from: string
  intersection of: Restriction
    min cardinality: 1
    on property: timezone
equivalent class: Class
  intersection of: Restriction
    on property: timezone
    some values from: string
  intersection of: Restriction
    min cardinality: 1
    on property: timezone

Material Production Service
type: Class
comment: Coordinate with NIF. NIF ID: nlx_res_20090418
subclass of: Material Processing Service
example of usage: Production of monoclonal antibodies from a hybridoma.
has curation status: IAO_0000120
definition: A material processing service offering that describes a service in which the provider makes physical changes to a specified input material that produce a new entity as specified output that is returned the service consumer. The specified output of a material production service can be contained within, derived from, or synthesized from specified input materials, but it represents a material entity that is of a distinct type from any of the specified input materials.
term editor: PERSON: Matthew Brush
definition source: http://neurolex.org/wiki/Category:Material_service_resource

reviewed in
type: ObjectProperty
range: Review
description annot: The bibo:reviewOf public description was found here: http://bibotools.googlecode.com/svn/bibo-ontology/trunk/doc/index.html . As of 26 May 2010, bibo:reviewOf is used with the class Review, but core:reviewIn doesn't seem to be being used.

Program
type: Class
subclass of: Organization
example of usage: A Cornell graduate field (http://vivo.cornell.edu/index.jsp?home=65535&collection=820)
definition: An ongoing academic initiative not formalized with department or division status.
imported from: VIVO-ISF Ontology version 1.6

Hospital
type: Class
subclass of: Organization
example of usage: Shands at the University of Florida
example of usage: Definition take from: http://dictionary.reference.com/browse/hospital.
definition: An institution that provides medical, surgical, psychiatric or nursing care.
imported from: VIVO-ISF Ontology version 1.6

cites as data source
type: ObjectProperty
comment: The citing entity cites the cited entity as source of data.

Graduate Advising Relationship
type: Class
subclass of: Advising Relationship
definition: An advisory relationship in which a professor advises a graduate student.

inheres in
type: FunctionalProperty
type: ObjectProperty
domain: Specifically Dependent Continuant
range: Independent Continuant
editor note: This clarifies that only specifically dependent continuants inhere in (specifically) one independent continuant over all time. For GDCs, there in implicitly inherence to all the independent continuants in which the concretizations inhere. Should add a 'cardinality 1' restriction to the definition of specifically dependent continuant.
editor note: This relation belongs in BFO/RO, and will be in BFO 2
inverse of: bearer of

American Board of Colon and Rectal Surgery

US Citizen Role
type: Class
subclass of: US Resident Role
has curation status: IAO_0000123
definition: A US resident role that inheres in an individual that is a legally recognized as a member of a state, with associated rights and obligations.
term editor: PERSON: Nicole Vasilevsky
definition source: http://en.wiktionary.org/wiki/citizen

Thesis
subclass of: Restriction
  all values from: Literal
  on property: abbreviation
type: Class
subclass of: Restriction
  all values from: Literal
  on property: place of publication
definition: Works created to satisfy the requirements for an academic certification or degree; also called dissertation
term status: stable
comment: A document created to summarize research findings associated with the completion of an academic degree.
example of usage: Short Definition from OCLC Input Standards, EntW
subclass of: Document
subclass of: Restriction
  all values from: Literal
  on property: abbreviation
subclass of: Restriction
  all values from: Literal
  on property: place of publication

Material Analysis Service
type: Class
comment: Coordinate with NIF: NIF ID: nlx_res_20090420
subclass of: Analysis Service
example of usage: Flow cytometry analysis of T cells.
has curation status: IAO_0000120
definition: An analysis service offering that describes a service in which the consumer provides some input material and a service provider performs some analysis of this material to generate data that is returned to the service consumer.
term editor: PERSON: Nicole Vasilevsky
definition source: http://neurolex.org/wiki/Category:Analysis_service_resource

agricultural area unit
type: DatatypeProperty

Advisor Role
type: Class
subclass of: Role

Map
type: Class
comment: A graphical depiction of geographic features.
subclass of: Image
example of usage: The Short Definition is how the bibo ontology defines Map. It has been extended to include more broader concept of map which includes science maps, social network maps.
definition: A graphical depiction of geographic features, scientific discipline, scientific data analytical results
term status: unstable

Self Governing
type: Class
subclass of: Geopolitical Entity
subclass of: Territory
source: United Nations Map Library http://www.un.org/depts/dhl/maplib/countinfo.htm
equivalent class: Country

Non-US Citizen
type: Class
subclass of: US Resident Role
has curation status: IAO_0000123
definition: A US resident role that inheres in an individual who is not a legally recognized subject or national of the United States.
term editor: PERSON: Nicole Vasilevsky
definition source: https://www.google.com/search?q=residency+status&ie=utf-8&oe=utf-8&aq=t&rls=org.mozilla:en-US:official&client=firefox-a#hl=en&client=firefox-a&hs=Bcx&rls=org.mozilla:en-US:official&q=citizen&tbs=dfn:1&tbo=u&sa=X&ei=micXT_DwMIjUiAK15tDUDw&ved=0CCgQkQ4&bav=on.2,or.r_gc.r_pw.,cf.osb&fp=7b67128a22f602af&biw=1609&bih=794

American Board of Dermatology

Specifically Dependent Continuant
type: Class
subclass of: Continuant

F1000 Link
type: Class
subclass of: URL
example of usage: F1000 is a place where faculty go to critique papers published in PubMed. Any given record in F1000 might have anywhere from one to dozens of reviews.

Blog Posting
type: Class
subclass of: Article
subclass of: Restriction
  all values from: Blog
  on property: published in
example of usage: A specific blog posting
definition: An online article or commentary appearing on a blog
subclass of: Restriction
  all values from: Blog
  on property: published in

Collection
type: Class
comment: A collection of Documents or Collections
example of usage: Collection of information resources that have a unified identity. Archives, museums and libraries often acquire collections on specific subjects and from distinguished authors or researchers. Also includes collections of resources bundled into a license.
subclass of: Information Content Entity
example of usage: Hill Ornithology Collection; Wiley Interscience Online Books Biochemisty Collection
subclass of: Restriction
  all values from: Literal
  on property: Online Computer Library Center (OCLC) number
definition: Collection of information resources that have a unified identity
term status: stable
subclass of: Restriction
  all values from: Literal
  on property: Online Computer Library Center (OCLC) number

Legislation
type: Class
comment: A legal document proposing or enacting a law or a group of laws.
subclass of: Legal Document
example of usage: From OCLC Input Standards, EntW
definition: Enactments of legislative bodies, published in either statute or code form
term status: unstable

Reviewer Role
type: Class
subclass of: Role
example of usage: A role that encompasses both ongoing reviewer responsibility for a bibo:Collection, such as a Journal or Series, and also a review performed for a bibo:Document, such as a book, academic article or conference paper.
definition: A role that encompasses both ongoing reviewer responsibility for a bibo:Collection, such as a Journal or Series, and also a review performed for a bibo:Document, such as a book, academic article or conference paper.

Audio Document
type: Class
comment: An audio document; aka record.
subclass of: Document
subclass of: Restriction
  all values from: Organization
  on property: distributor
example of usage: phonograph record; tape; CD; DVD; DAT
definition: Recorded audio in any format
term status: stable
subclass of: Restriction
  all values from: Organization
  on property: distributor

Librarian Emeritus
type: Class
subclass of: Person
definition: A retired librarian who has retained their rank, title and privileges.

provides access to
range: Class
  union of: Instrument
  union of: Reagent
  union of: Software
  union of: Database
comment: change the domain tye to access service
definition: Instruments, reagents, organisms, or software for which the service provides access.
definition source: PERSON: Melissa Haendel
type: ObjectProperty
term editor: PERSON: Melissa Haendel
domain: Service
has curation status: IAO_0000120
example of usage: An access service that provides access to a flow cytometer.
range: Class
  union of: Instrument
  union of: Reagent
  union of: Software
  union of: Database

nameListIT
source identifier: http://www.fao.org/termportal/en/
source: FAO terminology http://www.fao.org/termportal/en/
source identifier: http://www.fao.org/termportal/contr/fr/
source identifier: http://www.fao.org/termportal/contr/es/
type: DatatypeProperty
source identifier: http://www.fao.org/termportal/contr/ar/
source identifier: http://www.fao.org/termportal/contr/en/
source identifier: http://www.fao.org/termportal/contr/zh/
source creator: FAO terminology
source modified: 2010-06-24

Parent
type: Class
subclass of: Relation Type

cites
type: ObjectProperty
domain: Document
range: Document

Explanatory
type: Class
comment: These properties are concerned with additional explanations, such as that related to informational notes or revisions specific to the vCard
equivalent class: Class
  intersection of: Class
    intersection of: Restriction
      on property: geo
      some values from: anyURI
    intersection of: Restriction
      max cardinality: 1
      on property: geo
  intersection of: Class
    intersection of: Restriction
      on property: timezone
      some values from: string
    intersection of: Restriction
      max cardinality: 1
      on property: timezone
  intersection of: Class
    intersection of: Restriction
      all values from: string
      on property: has language
    intersection of: Restriction
      max cardinality: 1
      on property: has language
  intersection of: Class
    intersection of: Restriction
      all values from: string
      on property: sort as
    intersection of: Restriction
      max cardinality: 1
      on property: sort as
equivalent class: Class
  intersection of: Class
    intersection of: Restriction
      on property: geo
      some values from: anyURI
    intersection of: Restriction
      max cardinality: 1
      on property: geo
  intersection of: Class
    intersection of: Restriction
      on property: timezone
      some values from: string
    intersection of: Restriction
      max cardinality: 1
      on property: timezone
  intersection of: Class
    intersection of: Restriction
      all values from: string
      on property: has language
    intersection of: Restriction
      max cardinality: 1
      on property: has language
  intersection of: Class
    intersection of: Restriction
      all values from: string
      on property: sort as
    intersection of: Restriction
      max cardinality: 1
      on property: sort as

Country
type: Class
subclass of: Geopolitical Entity
example of usage: Afghanistan; Antigua and Barbuda; Cameroon; Iceland; Jamaica; Nigeria; United States of America
example of usage: Source of the Short Definition: http://www.thefreedictionary.com/country. This is also the same as geopolitical.owl:self_governing.
definition: An area of land distinguished by its political autonomy. Politically independent territories.

has email
type: ObjectProperty
range: Email

Speech
type: Class
subclass of: Document
definition: Text of a speech written in preparation for delivery of the speech.

translation of
type: ObjectProperty
comment: Relates a translated document to the original document.
domain: Document
range: Document
example of usage: Examples shows a book has French language version. Public description source: http://bibotools.googlecode.com/svn/bibo-ontology/trunk/doc/index.html .
term status: stable

Messaging
type: Class
comment: To specify the URI for instant messaging and presence protocol communications with the object the vCard represents. Was called IMPP in vCard.
subclass of: Communication
equivalent class: Class
  intersection of: Restriction
    all values from: anyURI
    on property: instant message
  intersection of: Restriction
    min cardinality: 1
    on property: instant message
equivalent class: Class
  intersection of: Restriction
    all values from: anyURI
    on property: instant message
  intersection of: Restriction
    min cardinality: 1
    on property: instant message

calendar busy
type: DatatypeProperty
domain: Calendar Busy
range: anyURI

performer
type: ObjectProperty
sub property of: contributor
term status: stable

Personal Communication Document
type: Class
subclass of: Document
example of usage: A personal communication manifested in some document.
definition: A personal communication manifested in some document.

Publisher
type: Class
subclass of: Organization
example of usage: Elsevier; Harper & Row; Indiana University Press
example of usage: Definition found here: http://dictionary.reference.com/browse/publisher
definition: A person or company whose business is the publishing of books, periodicals, engravings, computer software, etc.
imported from: VIVO-ISF Ontology version 1.6

supported publications or other works
type: ObjectProperty
range: Information Content Entity
sub property of: supports
description annot: an information resource (typically a publication) supported by (typically via funding) an agreement (such as a grant)
inverse of: supported by

nameListRU
type: DatatypeProperty
source modified: 2010-06-24
source identifier: http://www.fao.org/termportal/en/
source identifier: http://www.fao.org/termportal/contr/ar/
source creator: FAO terminology
source identifier: http://www.fao.org/termportal/contr/en/
source identifier: http://www.fao.org/termportal/contr/es/
source: FAO terminology http://www.fao.org/termportal/en/
source identifier: http://www.fao.org/termportal/contr/zh/
source identifier: http://www.fao.org/termportal/contr/fr/

has member country or territory
type: ObjectProperty
domain: Group
range: Territory
inverse of: in geographic grouping

valid until
type: DatatypeProperty
comment: The value of the datatype property *validUntil* associated to a particular area (territory or group) indicates the area's last year of validity. In case the area is currently valid, this value is set by default to 9999.

term editor
type: AnnotationProperty

nameOfficialEN
source identifier: http://www.fao.org/termportal/contr/ar/
source identifier: http://www.fao.org/termportal/en/
source identifier: http://www.fao.org/termportal/contr/en/
source: FAO terminology http://www.fao.org/termportal/en/
source identifier: http://www.fao.org/termportal/contr/es/
source modified: 2010-06-24
source creator: FAO terminology
type: DatatypeProperty
source identifier: http://www.fao.org/termportal/contr/fr/
source identifier: http://www.fao.org/termportal/contr/zh/

Proceedings
type: Class
comment: A compilation of documents published from an event, such as a conference.
subclass of: Book
example of usage: Short Definition copied from bibo ontology
definition: A compilation of documents published from an event, such as a conference
term status: unstable

publisher
type: ObjectProperty
range: Organization
example of usage: Public Definition source (http://www.answers.com/topic/publisher).
inverse of: publisher of

has context
type: ObjectProperty

Organization
example of usage: This class will display all the instances in the subclasses below it, as well as any organizations that were added as part of this generic class because there wasn't a specific class available.
definition: A kind of Agent corresponding to social instititutions such as companies, societies etc.
subclass of: Restriction
  all values from: Organization
  on property: has part
example of usage: Only use if no specific subclasses of foaf:organization desribe the organization.
term editor: PERSON: Scott Hoffmann
subclass of: Restriction
  all values from: Geographic Location
  on property: located in
definition: A generic class encompassing several types of organizations.
subclass of: Restriction
  all values from: Literal
  on property: abbreviation
subclass of: Agent
scope note: Ued to describe an organization related to bibliographic items such as a publishing company, etc.
subclass of: Restriction
  all values from: Date/Time Interval
  on property: date/time interval
type: Class
editor preferred term: organization
comment: An organization
subclass of: Restriction
  all values from: Organization
  on property: has part
subclass of: Restriction
  all values from: Geographic Location
  on property: located in
subclass of: Restriction
  all values from: Literal
  on property: abbreviation
subclass of: Restriction
  all values from: Date/Time Interval
  on property: date/time interval

nationalityZH
source identifier: http://www.fao.org/termportal/contr/fr/
source identifier: http://www.fao.org/termportal/contr/es/
source identifier: http://www.fao.org/termportal/contr/en/
source identifier: http://www.fao.org/termportal/en/
source creator: FAO terminology
type: DatatypeProperty
source modified: 2010-06-24
source identifier: http://www.fao.org/termportal/contr/ar/
source: FAO terminology http://www.fao.org/termportal/en/
source identifier: http://www.fao.org/termportal/contr/zh/

Code
type: Class
comment: Contains all the Code related Classes that are used to indicate vCard Types

alternative term
type: AnnotationProperty

Postdoc
type: Class
subclass of: Non-Faculty Academic
definition: A Person holding an academic employment appointment focused on research rather than teaching; temporary (or for some defined term)

context for
type: ObjectProperty
inverse of: has context

Workshop Series
type: Class
subclass of: Event Series
example of usage: Use workshop for individual events.
definition: An organized series of workshop events, whether repetitions of the same workshop or multiple different workshops.

definition source
type: AnnotationProperty

Event
type: Class
subclass of: Restriction
  all values from: Literal
  on property: contact information
subclass of: Restriction
  all values from: Geographic Region
  on property: geographic focus
subclass of: Restriction
  all values from: Geographic Location
  on property: located in
example of usage: Only use if no specific subclasses of event:Event are appropriate.
subclass of: Restriction
  all values from: Thing
  on property: has subject area
subclass of: Restriction
  all values from: Document
  on property: related documents
example of usage: This class will also display instances of subclasses under Event, e.g. Philosophy Department Discussion Club; 2009 Racker Lecture; screening of a documentary. In addition to a location in space and time, an event may have any or all the following qualities: actively participating agents, passive factors, work products. Also, it may be in a virtual space or part of a series such as a lecture series. The previous short definition was: "An arbitrary classification of a space/time region, by a cognitive agent."
subclass of: Process
definition: Something that happens at a given place and time.
subclass of: Restriction
  all values from: Date/Time Interval
  on property: date/time interval
subclass of: Restriction
  all values from: Literal
  on property: description
subclass of: Restriction
  all values from: Literal
  on property: contact information
subclass of: Restriction
  all values from: Geographic Region
  on property: geographic focus
subclass of: Restriction
  all values from: Geographic Location
  on property: located in
subclass of: Restriction
  all values from: Thing
  on property: has subject area
subclass of: Restriction
  all values from: Document
  on property: related documents
subclass of: Restriction
  all values from: Date/Time Interval
  on property: date/time interval
subclass of: Restriction
  all values from: Literal
  on property: description

rejected
type: Document Status
type: NamedIndividual

definition
type: AnnotationProperty

has maximum longitude
type: DatatypeProperty

nationalityEN
source: FAO terminology http://www.fao.org/termportal/en/
source identifier: http://www.fao.org/termportal/en/
type: DatatypeProperty
source identifier: http://www.fao.org/termportal/contr/fr/
source identifier: http://www.fao.org/termportal/contr/en/
source identifier: http://www.fao.org/termportal/contr/zh/
source identifier: http://www.fao.org/termportal/contr/ar/
source creator: FAO terminology
source modified: 2010-06-24
source identifier: http://www.fao.org/termportal/contr/es/

predecessor organization
type: ObjectProperty
domain: Organization
range: Organization
inverse of: successor organization

Kin
type: Class
subclass of: Relation Type

Faculty Mentoring Relationship
type: Class
subclass of: Advising Relationship
definition: An advisory relationship in which one faculty member mentors another faculty member.

Bill
type: Class
comment: Draft legislation presented for discussion to a legal body.
subclass of: Legislation
example of usage: Short Definition from the bibo ontology
definition: Draft legislation presented for discussion to a legal body
term status: stable

birthdate
type: DatatypeProperty
comment: To specify the birth date of the object the vCard represents
domain: Individual
range: dateTime

editor note
type: AnnotationProperty

Faculty Position
type: Class
subclass of: Position
example of usage: Professor, associate professor and assistant professor are common positions for academic faculty.
example of usage: Professor; Associate Professor; Assistant Professor
definition: Academic position in a university or institution

FaBiO (FRBR-Aligned Bibliographic Ontology)

derives from
type: ObjectProperty

Clinical Guideline
type: Class
subclass of: Document
definition: A recommendation on the appropriate treatment and care of people with a specific disease or condition, based on the best available evidence, designed to help healthcare professionals in their work.

NIH Manuscript Submission System ID
type: DatatypeProperty
domain: Article
sub property of: identifier

Academic Term
type: Class
subclass of: Date/Time Interval
definition: An explicit individual academic term, quarter, or semester rather than the generic fall, spring or summer semester.

Case Study
type: Class
subclass of: Document
example of usage: A form of qualitative descriptive research that is used to study individuals, a small group of participants, or a group as a whole. Medical usage (from MeSH): clinical presentations that may be followed by evaluative studies that eventually lead to a diagnosis.
definition: A qualitative descriptive research study of individuals or a group

section
type: DatatypeProperty
comment: An section number
sub property of: locator
example of usage: Di Rado, Alicia. 1995. Trekking through college: Classes explore modern society using the world of Star trek. Los Angeles Times, March 15, sec. A, p. 3.
term status: unstable

is about
type: ObjectProperty
domain: Information Content Entity
example of usage: This document is about information artifacts and their representations
has curation status: IAO_0000125
definition: is_about is a (currently) primitive relation that relates an information artifact to an entity.
editor note: 7/6/2009 Alan Ruttenberg. Following discussion with Jonathan Rees, and introduction of "mentions" relation. Weaken the is_about relationship to be primitive. We will try to build it back up by elaborating the various subproperties that are more precisely defined. Some currently missing phenomena that should be considered "about" are predications - "The only person who knows the answer is sitting beside me" , Allegory, Satire, and other literary forms that can be topical without explicitly mentioning the topic.
term editor: person:Alan Ruttenberg
definition source: Smith, Ceusters, Ruttenberg, 2000 years of philosophy

nationalityES
source identifier: http://www.fao.org/termportal/contr/en/
source: FAO terminology http://www.fao.org/termportal/en/
source identifier: http://www.fao.org/termportal/contr/es/
type: DatatypeProperty
source creator: FAO terminology
source identifier: http://www.fao.org/termportal/contr/fr/
source identifier: http://www.fao.org/termportal/contr/ar/
source identifier: http://www.fao.org/termportal/contr/zh/
source identifier: http://www.fao.org/termportal/en/
source modified: 2010-06-24

Note
type: Class
comment: To specify supplemental information or a comment that is associated with the vCard
subclass of: Explanatory
equivalent class: Class
  intersection of: Restriction
    all values from: string
    on property: note
  intersection of: Restriction
    min cardinality: 1
    on property: note
equivalent class: Class
  intersection of: Restriction
    all values from: string
    on property: note
  intersection of: Restriction
    min cardinality: 1
    on property: note

Patent
subclass of: Document
example of usage: A patent is an exclusive right granted for an invention, which is a product or a process that provides, in general, a new way of doing something, or offers a new technical solution to a problem. In order to be patentable, the invention must fulfill certain conditions. (http://www.wipo.int/patentscope/en/)
comment: A document describing the exclusive right granted by a government to an inventor to manufacture, use, or sell an invention for a certain number of years.
subclass of: Restriction
  all values from: Organization
  on property: publisher
term status: stable
type: Class
subclass of: Restriction
  all values from: Date/Time Value
  on property: date issued
definition: (from BIBO) A document describing the exclusive right granted by a government to an inventor to manufacture, use, or sell an invention for a certain number of years
subclass of: Restriction
  all values from: Organization
  on property: publisher
subclass of: Restriction
  all values from: Date/Time Value
  on property: date issued

has photo
type: ObjectProperty
range: Photo

nameOfficialAR
source identifier: http://www.fao.org/termportal/contr/fr/
source creator: FAO terminology
source identifier: http://www.fao.org/termportal/contr/es/
source identifier: http://www.fao.org/termportal/contr/ar/
type: DatatypeProperty
source: FAO terminology http://www.fao.org/termportal/en/
source identifier: http://www.fao.org/termportal/en/
source identifier: http://www.fao.org/termportal/contr/en/
source modified: 2010-06-24
source identifier: http://www.fao.org/termportal/contr/zh/

in geographic grouping
type: ObjectProperty
domain: Territory
range: Group

Protocol
subclass of: Document
type: Class
editor preferred term: protocol
definition source: OBI branch derived + wikipedia (http://en.wikipedia.org/wiki/Protocol_%28natural_sciences%29)
imported from: obi.owl
example of usage: PMID: 18388943.Nat Protoc. 2008;3(4):612-8.Protocol for the induction of arthritis in C57BL/6 mice.
editor preferred term: Protocol
definition: a protocol is a plan specification which has sufficient level of detail and quantitative information to communicate it between domain experts, so that different domain experts will reliably be able to independently reproduce the process.
has curation status: IAO_0000122
term editor: PlanAndPlannedProcess Branch

Text
type: Class
comment: Also called sms telephone
subclass of: Telephone Type

National Clinical Trials (NCT) number
type: DatatypeProperty
definition: ClinicalTrials.gov is an ICMJE-acceptable public registry, offering up-to-date information for locating clinical trials for a wide range of diseases and conditions. The U.S. National Institutes of Health (NIH), through its National Library of Medicine (NLM), developed this site in collaboration with the Food and Drug Administration (FDA), as a result of the FDA Modernization Act, which was passed into law in November 1997. This property should be publically visible since it is one of the principal identifiers in a national registry of clinical trials
example annot: NCT00000419

Organization
type: Class
subclass of: Group

name prefix
type: DatatypeProperty
comment: The prefix of a name
example of usage: Mr; Ms; Mrs
example of usage: http://dictionary.reference.com/browse/prefix
term status: stable

Met
type: Class
subclass of: Relation Type

nameShortAR
source identifier: http://www.fao.org/termportal/contr/es/
source: FAO terminology http://www.fao.org/termportal/en/
source identifier: http://www.fao.org/termportal/contr/ar/
source identifier: http://www.fao.org/termportal/contr/en/
source identifier: http://www.fao.org/termportal/en/
source identifier: http://www.fao.org/termportal/contr/zh/
source identifier: http://www.fao.org/termportal/contr/fr/
type: DatatypeProperty
source creator: FAO terminology
source modified: 2010-06-24

Advisee Role
type: Class
subclass of: Role

published
type: Document Status
type: NamedIndividual
definition: Published document
description: Published document

ISI Researcher ID
type: DatatypeProperty
domain: Person
sub property of: identifier
example of usage: RearcherID is a Thomson Reuters project where researchers have a place to manage and share their professional information. It will allow them to solve author identity issues while simultaneously adding dynamic citation metrics and collaboration networks to your personal profile. Definition source: http://isiwebofknowledge.com/researcherid/

Non-Faculty Academic
type: Class
subclass of: Person
definition: A person not considered a faculty member but holding an academic appointment.

Excerpt
type: Class
comment: A passage selected from a larger work.
subclass of: Document Part
example of usage: Short Definition from the bibo ontology
definition: A passage selected from a larger work
term status: stable

annotates
type: ObjectProperty
comment: Critical or explanatory note for a Document.
example of usage: The public description source is: http://bibotools.googlecode.com/svn/bibo-ontology/trunk/doc/index.html.
term status: stable

reversed by
type: ObjectProperty
comment: A legal decision that reverses a ruling.
example of usage: The first sentence of the public description was taken from here: http://bibotools.googlecode.com/svn/bibo-ontology/trunk/doc/index.html

Editorship
type: Class
subclass of: Relationship
subclass of: Restriction
  on property: relates
  some values from: Agent
subclass of: Restriction
  on property: relates
  some values from: Information Content Entity
definition: A relationship that represents the recognition of an agent as an editor.
subclass of: Restriction
  on property: relates
  some values from: Agent
subclass of: Restriction
  on property: relates
  some values from: Information Content Entity

GDP notes
type: DatatypeProperty

nameOfficialES
source identifier: http://www.fao.org/termportal/contr/es/
source identifier: http://www.fao.org/termportal/contr/fr/
source identifier: http://www.fao.org/termportal/contr/en/
type: DatatypeProperty
source identifier: http://www.fao.org/termportal/contr/ar/
source creator: FAO terminology
source identifier: http://www.fao.org/termportal/contr/zh/
source: FAO terminology http://www.fao.org/termportal/en/
source modified: 2010-06-24
source identifier: http://www.fao.org/termportal/en/

Faculty Member
type: Class
subclass of: Person
definition: A person with at least one academic appointment to a specific faculty of a university or institution of higher learning.
description annot: Definition from here: http://research.carleton.ca/htr/defs.php.

hide from display
type: FunctionalProperty
type: DatatypeProperty
range: boolean

Institutional Review Board (IRB) number
type: DatatypeProperty
definition: Every clinical trial in the United States must be approved and monitored by an Institutional Review Board (IRB). An IRB is an independent committee of physicians, statisticians, community advocates and others whose objective is to ensure that a clinical trial is ethical and the rights of study participants are protected.

OCRe study design

Attending Process
type: Class
subclass of: Process

has language
type: ObjectProperty
range: Language

Research Proposal
type: Class
subclass of: Document
definition: A proposal for a research grant that has been submitted but not approved; does not represent an existing activity

director
type: ObjectProperty
comment: A Film director.
example of usage: Definition take from this site: http://bibotools.googlecode.com/svn/bibo-ontology/trunk/doc/index.html .
term status: stable

Course
type: Class
subclass of: Event
subclass of: Restriction
  all values from: Literal
  on property: credits
example of usage: A course as taught in one time period (such as a semester; although note that a course could consist of only one meeting (teaching session)) by one or more instructors, normally but not always for credit. Does not represent either each meeting of the course or the course offering such as Biology 101 taught every semester from 1980 to 2010
definition: A course as taught in one time period by one or more instructors, normally but not always for credit. Does not represent either each meeting of the course or the course offering such as Biology 101 taught every semester from 1980 to 2010
subclass of: Restriction
  all values from: Literal
  on property: credits

Magazine
type: Class
comment: A periodical of magazine Articles. A magazine is a publication that is issued periodically, usually bound in a paper cover, and typically contains essays, stories, poems, etc., by many writers, and often photographs and drawings, frequently specializing in a particular subject or area, as hobbies, news, or sports.
subclass of: Periodical
example of usage: Abstracts and bibliographies are usually not included in magazines.
example of usage: New Yorker
definition: Contains articles of current events or general interest, geared to the reading public as being informative or recreational
term status: stable

Librarian Position
type: Class
subclass of: Position
example of usage: It is the common position in libraries.
example of usage: Librarian; Library Systems Analyst; Music Bibliographer
definition: A position held by library and information science professionals, or academic or technical experts, in support of providing information services or materials

nameShortIT
source identifier: http://www.fao.org/termportal/contr/zh/
source creator: FAO terminology
type: DatatypeProperty
source identifier: http://www.fao.org/termportal/en/
source identifier: http://www.fao.org/termportal/contr/ar/
source modified: 2010-06-24
source: FAO terminology http://www.fao.org/termportal/en/
source identifier: http://www.fao.org/termportal/contr/en/
source identifier: http://www.fao.org/termportal/contr/fr/
source identifier: http://www.fao.org/termportal/contr/es/

has documentation
has curation status: IAO_0000120
definition: Document that contains relevant resource information.
type: ObjectProperty
domain: Class
  union of: Instrument
  union of: Service
  union of: Reagent
  union of: Research Project
  union of: Biological Specimen
  union of: Software
  union of: Database
  union of: Protocol
editor preferred term: has documentation
term editor: PERSON: Melissa Haendel
example of usage: An antibody has documentation describing attributes of the antibody.
definition source: PERSON: Melissa Haendel
range: Document
domain: Class
  union of: Instrument
  union of: Service
  union of: Reagent
  union of: Research Project
  union of: Biological Specimen
  union of: Software
  union of: Database
  union of: Protocol

Editor Role
type: Class
subclass of: Role
example of usage: An ongoing editorial responsibility for a bibo:Collection, such as a Journal or Series
definition: An ongoing editorial responsibility for a bibo:Collection, such as a Journal or Series

street address
type: DatatypeProperty
domain: Address
range: string

Group
type: Class
comment: A group
subclass of: Agent
editor preferred term: group
example of usage: A group can also be an organization but need not be; typically used for looser associations of people or organizations acting together in some fashion, not necessarily through formal agreement or on a long-term basis. Added to the VIVO ontology to be able to support informal and perhaps even private groups of people around an idea, funding opportunity, or event. see: http://xmlns.com/foaf/spec/#term_Group
definition: A collection of individual agents.
definition: A collection of individual agents (and may itself play the role of a Agent, ie. something that can perform actions).
term editor: PERSON: Scott Hoffmann

Chapter
type: Class
comment: A chapter of a book.
subclass of: Book Section
definition: A main division of a book
term status: unstable

Committee
type: Class
subclass of: Group
example of usage: Curriculum Steering Committee; PhD Advisory Committee
example of usage: There could be many subclasses such as thesis committee or tenure committee, but these may typically be differentiated via the moniker unless distinct properties become important.
definition: A group of people organized for a specific purpose (e.g., a reporting or advisory role), often with a charge and for a specific duration
definition: A group of people organized for a specific purpose, whose members are often selected from a larger group to serve for designated periods of time.
imported from: VIVO-ISF Ontology version 1.6

High School Student Role
type: Class
subclass of: Student Role
example of usage: A freshman in high school.
has curation status: IAO_0000120
definition: A student role inhering in a person that is realized when the bearer participates in a course of study at a secondary learning institution.
term editor: PERSON: Nicole Vasilevsky
definition source: http://www.thefreedictionary.com/student

Legal Document
type: Class
comment: A legal document; for example, a court decision, a brief, and so forth.
subclass of: Document
definition: a document that states some contractual relationship or grants some right
term status: stable

supported by
type: ObjectProperty
description annot: general relationship of support
inverse of: supports

Licensing
type: Class
subclass of: Planned Process
example of usage: Licensing of a new technology.
has curation status: IAO_0000120
definition: A technique that authorizes a use (such as copying software or using a (patented) invention) to a licensee, sparing the licensee from a claim of infringement brought by the licensor.
term editor: PERSON: Nicole Vasilevsky
definition source: http://en.wikipedia.org/wiki/License

relation

Book Section
subclass of: Restriction
  all values from: Literal
  on property: start page
definition: A section of a book
subclass of: Restriction
  all values from: Literal
  on property: edition
type: Class
term status: unstable
subclass of: Restriction
  all values from: Literal
  on property: end page
subclass of: Document Part
comment: A section of a book.
example of usage: Short Definition from the bibo ontology
subclass of: Restriction
  all values from: Literal
  on property: start page
subclass of: Restriction
  all values from: Literal
  on property: edition
subclass of: Restriction
  all values from: Literal
  on property: end page

department or school name within institution
type: DatatypeProperty
domain: Educational Process
description annot: Not intended to be an institution name.

Graduate Student Role
type: Class
subclass of: Student Role
example of usage: A PhD student at a university.
has curation status: IAO_0000120
definition: A student role inhering in a person that is realized when the bearer participates a course of study at a university or institution in pursuit of an graduate or professional degree.
term editor: PERSON: Nicole Vasilevsky
definition source: http://www.thefreedictionary.com/student

Court
type: ObjectProperty
comment: A court associated with a legal document; for example, that which issues a decision.
example of usage: Public description take from: http://bibotools.googlecode.com/svn/bibo-ontology/trunk/doc/index.html. Bibo considers this property "unstable".
term status: unstable

Interview
type: Class
comment: A formalized discussion between two or more people.
subclass of: Event
example of usage: radio or newspaper interview
definition: A conversation between two or more people where questions are asked by the interviewer to obtain information from the interviewee.
term status: stable

Museum
type: Class
subclass of: Organization
example of usage: Definition was take from here: http://dictionary.reference.com/browse/museum
example of usage: The Getty Museum
definition: An organization devoted to the acquisition, conservation, study, exhibition, and educational interpretation of objects having scientific, historical, cultural or artistic value.
imported from: VIVO-ISF Ontology version 1.6

Legal Case Document
type: Class
comment: A document accompanying a legal case.
subclass of: Legal Document
definition: Official court papers for a case
term status: unstable

Undergraduate Student Role
type: Class
subclass of: Student Role
example of usage: A college student.
has curation status: IAO_0000120
definition: A student role inhering in a person that is realized when the bearer participates in a course of study at a college, university, etc. in pursuit of an associate or bachelor degree.
term editor: PERSON: Nicole Vasilevsky
definition source: http://www.thefreedictionary.com/student

offers
type: ObjectProperty
inverse of: offered by

Student Role
type: Class
subclass of: Role
example of usage: A college student.
has curation status: IAO_0000120
definition: A role inhering in a person that is realized when the bearer participates a course of study, as in a school, college, university, etc.
term editor: PERSON: Nicole Vasilevsky
definition source: http://www.thefreedictionary.com/student

Comment
type: Class
subclass of: Document
definition: A verbal or written remark concerning some entity. In written form, a comment is often appended to that entity and termed an annotation. Within computer programs or ontologies, comments are added to enhance human understanding, and are usually prefaced by a special syntactic symbol that ensures they are ignored during execution of the program. has super-classes
definition: A verbal or written remark concerning some entity. In written form, a comment is often appended to that entity and termed an annotation. Within computer programs or ontologies, comments are added to enhance human understanding, and are usually prefaced by

term label
type: DatatypeProperty

related concept
type: ObjectProperty
type: SymmetricProperty
domain: Concept
range: Concept

has value
type: DatatypeProperty

Postdoc or Fellow Advising Relationship
type: Class
subclass of: Advising Relationship
definition: An advisory relationship in which the advisee is a Postdoc or Fellow.

governing authority for
type: ObjectProperty
domain: Organization
inverse of: governing authority

Communication
type: Class
comment: These properties describe information about how to communicate with the object the vCard represents
equivalent class: Class
  intersection of: Class
    intersection of: Restriction
      on property: geo
      some values from: anyURI
    intersection of: Restriction
      max cardinality: 1
      on property: geo
  intersection of: Class
    intersection of: Restriction
      on property: timezone
      some values from: string
    intersection of: Restriction
      max cardinality: 1
      on property: timezone
  intersection of: Class
    intersection of: Restriction
      all values from: string
      on property: has language
    intersection of: Restriction
      max cardinality: 1
      on property: has language
  intersection of: Class
    intersection of: Restriction
      all values from: string
      on property: sort as
    intersection of: Restriction
      max cardinality: 1
      on property: sort as
equivalent class: Class
  intersection of: Class
    intersection of: Restriction
      on property: geo
      some values from: anyURI
    intersection of: Restriction
      max cardinality: 1
      on property: geo
  intersection of: Class
    intersection of: Restriction
      on property: timezone
      some values from: string
    intersection of: Restriction
      max cardinality: 1
      on property: timezone
  intersection of: Class
    intersection of: Restriction
      all values from: string
      on property: has language
    intersection of: Restriction
      max cardinality: 1
      on property: has language
  intersection of: Class
    intersection of: Restriction
      all values from: string
      on property: sort as
    intersection of: Restriction
      max cardinality: 1
      on property: sort as

Coworker
type: Class
subclass of: Relation Type

OBO Foundry

provides funding through
type: ObjectProperty
domain: Funding Organization
range: Funding Organization
example of usage: For example, National Science Foundation providesFundingThrough Graduate Research Fellowship Program; National Institutes of Health providesFundingThrough National Center for Research Resources.

Geographic Location
type: Class
subclass of: Location
subclass of: Restriction
  all values from: Geographic Location
  on property: part of
subclass of: Restriction
  all values from: Geographic Location
  on property: has part
example of usage: Use subclasses of core:Geographic Location subclasses instead of this class if possible.
example of usage: Removed the word "stable" because disputed territories from geopolitical.owl are included. This could imply that the geographic coordinates could change. I've also copied this definition to core:Geographic Location. I think core:Geographic Location and core:Geographic Region are both the same and only one is needed. There is also geopolitical.owl:geographical_region which further causes confusion.
definition: A location having coordinates in geographic space.
subclass of: Restriction
  all values from: Geographic Location
  on property: part of
subclass of: Restriction
  all values from: Geographic Location
  on property: has part

end
type: ObjectProperty
domain: Date/Time Interval
range: Date/Time Value
sub property of: date/time value

assigns
type: ObjectProperty
inverse of: assigned by

Title
type: Class
comment: To specify the position or job of the object the vCard represents
subclass of: Organizational
equivalent class: Class
  intersection of: Restriction
    on property: title
    some values from: string
  intersection of: Restriction
    min cardinality: 1
    on property: title
equivalent class: Class
  intersection of: Restriction
    on property: title
    some values from: string
  intersection of: Restriction
    min cardinality: 1
    on property: title

Concept
type: Class

research overview
type: FunctionalProperty
type: DatatypeProperty
domain: Person
example of usage: Used for a single narrative summary of research, typically covering a wide range of activities and time periods; use Researcher Role for information on individual activities

transcript of
type: ObjectProperty
comment: Relates a document to some transcribed original.
example of usage: The bibo:transcriptOf public description was found here: http://bibotools.googlecode.com/svn/bibo-ontology/trunk/doc/index.html . Bibo considers this term unstable.
term status: unstable

issuer
type: ObjectProperty
comment: An entity responsible for issuing often informally published documents such as press releases, reports, etc.
range: Agent
description annot: An entity responsible for issuing often informally published documents such as press releases, reports, etc. This term is classified as unstable by bibo.
term status: unstable

International Standard Book Number (ISBN) 10
type: DatatypeProperty
domain: Book
sub property of: identifier
example of usage: http://en.wikipedia.org/wiki/Isbn.

Medical Residency
type: Class
subclass of: Educational Process
definition: Residency is a stage of graduate medical training.

Spatial Region
type: Class
subclass of: Immaterial Entity

produced by
type: ObjectProperty
domain: Material Entity
range: Material Entity
inverse of: produces

nameShortEN
source identifier: http://www.fao.org/termportal/contr/fr/
source identifier: http://www.fao.org/termportal/contr/es/
source identifier: http://www.fao.org/termportal/contr/ar/
source identifier: http://www.fao.org/termportal/contr/en/
source identifier: http://www.fao.org/termportal/contr/zh/
source creator: FAO terminology
source identifier: http://www.fao.org/termportal/en/
source: FAO terminology http://www.fao.org/termportal/en/
type: DatatypeProperty
source modified: 2010-06-24

Text Phone
type: Class
subclass of: Telephone Type

Crush
type: Class
subclass of: Relation Type

Non-Permanent Resident Role
type: Class
subclass of: Non-US Citizen
has curation status: IAO_0000123
definition: A non-US citizen role that inheres in an individual who is residing in a country, but is neither a citizen nor a permanent resident.
term editor: PERSON: Nicole Vasilevsky
definition source: http://www.irs.gov/taxtopics/tc851.html

Bibontology

produces
type: ObjectProperty
domain: Material Entity
range: Material Entity
definition: a produces b if some process that occurs_in a has_output b, where a and b are material entities. Examples: hybridoma cell line produces monoclonal antibody reagent; chondroblast produces avascular GAG-rich matrix.
term editor: Melissa Haendel
imported from: ro.owl

prerequisite for
type: ObjectProperty
domain: Course
range: Course

International Standard Book Number (ISBN) 13
type: DatatypeProperty
domain: Book
sub property of: identifier
example of usage: source: http://en.wikipedia.org/wiki/Isbn.

published US Classification Class/subclass (CCL) code
type: DatatypeProperty
domain: Patent

Invited Talk
type: Class
subclass of: Presentation

URI
type: DatatypeProperty
sub property of: identifier
example of usage: Definition from: http://bibotools.googlecode.com/svn/bibo-ontology/trunk/doc/index.html

Agent
type: Class
subclass of: Relation Type

Document
subclass of: Restriction
  all values from: Literal
  on property: number of pages
editor preferred term: document
definition: A collection of information content entities intended to be understood together as a whole
subclass of: Restriction
  all values from: Literal
  on property: Online Computer Library Center (OCLC) number
term editor: PERSON: Lawrence Hunter
subclass of: Restriction
  all values from: Global Citation Count
  on property: has global citation frequency
type: Class
subclass of: Restriction
  all values from: Agent
  on property: features
subclass of: Restriction
  all values from: Dataset
  on property: cites as data source
imported from: iao.owl
subclass of: Restriction
  all values from: Literal
  on property: abstract
example of usage: Short Definition from the bibo ontology
subclass of: Restriction
  all values from: Document Part
  on property: has part
subclass of: Information Content Entity
has curation status: IAO_0000120
comment: A document (noun) is a bounded physical representation of body of information designed with the capacity (and usually intent) to communicate. A document may manifest symbolic, diagrammatic or sensory-representational information.
example of usage: A journal article, patent application, laboratory notebook, or a book
definition: A bounded physical representation of a body of information designed with the capacity (and usually intent) to communicate
subclass of: Restriction
  all values from: Literal
  on property: number of pages
subclass of: Restriction
  all values from: Literal
  on property: Online Computer Library Center (OCLC) number
subclass of: Restriction
  all values from: Global Citation Count
  on property: has global citation frequency
subclass of: Restriction
  all values from: Agent
  on property: features
subclass of: Restriction
  all values from: Dataset
  on property: cites as data source
subclass of: Restriction
  all values from: Literal
  on property: abstract
subclass of: Restriction
  all values from: Document Part
  on property: has part

total country area
type: DatatypeProperty

Reference Source
type: Class
comment: A document that presents authoritative reference information, such as a dictionary or encylopedia .
subclass of: Document
example of usage: Short Definition from the bibo ontology
definition: A document that presents authoritative reference information, such as a dictionary or encylopedia
term status: unstable

funding provided via
range: Class
  union of: Contract
  union of: Grant
range: Class
  union of: Contract
  union of: Grant

nationalityRU
source creator: FAO terminology
source identifier: http://www.fao.org/termportal/contr/ar/
source identifier: http://www.fao.org/termportal/contr/en/
source: FAO terminology http://www.fao.org/termportal/en/
source identifier: http://www.fao.org/termportal/contr/es/
type: DatatypeProperty
source identifier: http://www.fao.org/termportal/contr/fr/
source modified: 2010-06-24
source identifier: http://www.fao.org/termportal/en/
source identifier: http://www.fao.org/termportal/contr/zh/

Edited Book
comment: An edited book.
subclass of: Restriction
  all values from: Literal
  on property: edition
definition: An edited collection of stand-alone articles published as a book
type: Class
subclass of: Collected Document
term status: stable
subclass of: Restriction
  all values from: Organization
  on property: publisher
example of usage: Best American Science Writing 2009
subclass of: Restriction
  all values from: Literal
  on property: place of publication
subclass of: Restriction
  all values from: Literal
  on property: edition
subclass of: Restriction
  all values from: Organization
  on property: publisher
subclass of: Restriction
  all values from: Literal
  on property: place of publication

Male
type: Class
subclass of: Gender

Temporal Region
type: Class
subclass of: Occurrent

contact info for
type: ObjectProperty
domain: Contact
inverse of: has contact info

Room
type: Class
subclass of: Facility
subclass of: Restriction
  all values from: Facility
  on property: part of
example of usage: Enter room number of name.
example of usage: 100 Caldwell Hall; 114 Martha Van Rensselaer (Rushmore Conference Room)
definition: Room that provides a particular service or is used for a particular activity.
subclass of: Restriction
  all values from: Facility
  on property: part of

eRA Commons ID
type: DatatypeProperty
domain: Person
sub property of: identifier

manufacturer
range: Manufacturer
example of usage: Santa Cruz Biotechnology is the manufacturer of many antibodies.
definition source: PERSON: Melissa Haendel
type: ObjectProperty
definition: Organization or person that created the resource.
editor preferred term: has manufacturer
has curation status: IAO_0000120
term editor: PERSON: Melissa Haendel
domain: Class
  union of: Instrument
  union of: Reagent
  union of: Software
  union of: Database
domain: Class
  union of: Instrument
  union of: Reagent
  union of: Software
  union of: Database

codeCurrency
source identifier: http://www.fao.org/termportal/en/
source creator: FAO terminology
source identifier: http://www.fao.org/termportal/contr/ar/
source identifier: http://www.fao.org/termportal/contr/es/
source modified: 2010-06-24
source identifier: http://www.fao.org/termportal/contr/en/
source identifier: http://www.fao.org/termportal/contr/fr/
type: DatatypeProperty
source: FAO terminology http://www.fao.org/termportal/en/
source identifier: http://www.fao.org/termportal/contr/zh/

realized in
range: Process
BFO_0000179: realized-in
domain: Realizable Entity
IAO_0000600: [copied from inverse property 'realizes'] to say that b realizes c at t is to assert that there is some material entity d & b is a process which has participant d at t & c is a disposition or role of which d is bearer_of at t& the type instantiated by b is correlated with the type instantiated by c. (axiom label in BFO2 Reference: [059-003])
IAO_0000601: if a realizable entity b is realized in a process p, then p stands in the has_participant relation to the bearer of b. (axiom label in BFO2 Reference: [106-002])
IAO_0000602: (forall (x y z t) (if (and (RealizableEntity x) (Process y) (realizesAt y x t) (bearerOfAt z x t)) (hasParticipantAt y z t))) // axiom label in BFO2 CLIF: [106-002]
BFO_0000180: realizedIn
type: ObjectProperty

College
type: Class
subclass of: Organization
example of usage: College of Arts & Sciences; Ivy Tech Community College
definition: A primary academic unit within a University or a free-standing higher education organization without graduate degree programs.
definition: A primary academic unit within a University or a free-standing higher education organization without graduate degree programs
imported from: VIVO-ISF Ontology version 1.6

nameShortES
source identifier: http://www.fao.org/termportal/contr/fr/
source identifier: http://www.fao.org/termportal/en/
source creator: FAO terminology
source identifier: http://www.fao.org/termportal/contr/en/
source identifier: http://www.fao.org/termportal/contr/es/
source: FAO terminology http://www.fao.org/termportal/en/
type: DatatypeProperty
source identifier: http://www.fao.org/termportal/contr/zh/
source modified: 2010-06-24
source identifier: http://www.fao.org/termportal/contr/ar/

GDP
source identifier: http://data.albankaldawli.org/indicator/NY.GDP.MKTP.CD
source: World Bank http://data.worldbank.org/indicator/NY.GDP.MKTP.CD
source identifier: http://donnees.banquemondiale.org/indicateur/NY.GDP.MKTP.CD
description: GDP at purchaser's prices is the sum of gross value added by all resident producers in the economy plus any product taxes and minus any subsidies not included in the value of the products. It is calculated without making deductions for depreciation of fabricated assets or for depletion and degradation of natural resources. Data are in current U.S. dollars. Dollar figures for GDP are converted from domestic currencies using single year official exchange rates. For a few countries where the official exchange rate does not reflect the rate effectively applied to actual foreign exchange transactions, an alternative conversion factor is used. Source: World Bank national accounts data, and OECD National Accounts data files. http://data.worldbank.org/indicator/NY.GDP.MKTP.CD
source modified: 2010-12-16
source creator: World Bank
source identifier: ttp://datos.bancomundial.org/indicador/NY.GDP.MKTP.CD @es
type: DatatypeProperty
source identifier: http://data.worldbank.org/indicator/NY.GDP.MKTP.CD

user-defined tag
type: DatatypeProperty
domain: ARG_0000008
definition: A free text field for recording topics which relate to the resource.

realizes
domain: Process
BFO_0000179: realizes
IAO_0000602: (forall (x y t) (if (realizesAt x y t) (and (Process x) (or (Disposition y) (Role y)) (exists (z) (and (MaterialEntity z) (hasParticipantAt x z t) (bearerOfAt z y t)))))) // axiom label in BFO2 CLIF: [059-003]
inverse of: realized in
IAO_0000600: to say that b realizes c at t is to assert that there is some material entity d & b is a process which has participant d at t & c is a disposition or role of which d is bearer_of at t& the type instantiated by b is correlated with the type instantiated by c. (axiom label in BFO2 Reference: [059-003])
BFO_0000180: realizes
range: Realizable Entity
type: ObjectProperty

nationalityAR
source identifier: http://www.fao.org/termportal/contr/zh/
source: FAO terminology http://www.fao.org/termportal/en/
source identifier: http://www.fao.org/termportal/contr/en/
source identifier: http://www.fao.org/termportal/contr/fr/
source creator: FAO terminology
source identifier: http://www.fao.org/termportal/contr/es/
source identifier: http://www.fao.org/termportal/en/
source identifier: http://www.fao.org/termportal/contr/ar/
source modified: 2010-06-24
type: DatatypeProperty

Court Reporter
type: Class
comment: A collection of legal cases.
subclass of: Periodical
example of usage: Supreme Court Reporter
definition: Collection of legal cases
term status: stable

Disposition
type: Class
subclass of: Realizable Entity

member
type: ObjectProperty
comment: To include a member in the group this vCard represents
domain: Group
range: Class
  union of: Individual
  union of: Location
  union of: Organization
range: Class
  union of: Individual
  union of: Location
  union of: Organization

Primary Position
type: Class
subclass of: Position
example of usage: A position designated as primary by the organization or group where it is held. This designation may be applied to zero or more of an agent's positions and may be asserted in conjunction with other subclasses of position.
definition: A position designated as primary by the organization where it is held.

Technology Transfer Office
type: Class
subclass of: Organization
editor preferred term: Technology Transfer Office
has curation status: IAO_0000123
definition: An organization that provides services for commercialization and licensing of technologies at an institution.
term editor: PERSON: Nicole Vasilevsky
definition source: PERSON: Nicole Vasilevsky

contained in
type: ObjectProperty
inverse of: contains

has expertise in technique
editor preferred term: has expertise
term editor: PERSON: Melissa Haendel
domain: Person
type: ObjectProperty
has curation status: IAO_0000120
example of usage: Brian Druker has expertise in cancer research.
range: Technique
definition: Technique in which the person is proficient.
definition source: PERSON: Melissa Haendel

identifier
type: DatatypeProperty

population notes
type: DatatypeProperty

Process
type: Class
subclass of: Occurrent

contains
type: ObjectProperty

total award amount
type: FunctionalProperty
type: DatatypeProperty
domain: Class
  union of: Contract
  union of: Grant
domain: Class
  union of: Contract
  union of: Grant

Code
type: Class
comment: A collection of statutes.
subclass of: Periodical
example of usage: Short Definition from OCLC Input Standards, EntW
example of usage: Code of Federal Regulations
definition: A work consisting of texts of rules and regulations related to statutes issued by executive or administrative agencies
term status: stable

output of
type: ObjectProperty
sub property of: participates in

specifies the use of
definition: Instruments, techniques, reagents, organisms, or software that are referenced in a protocol.
range: Class
  union of: Instrument
  union of: Reagent
  union of: Technique
  union of: Software
example of usage: A protocol can specify the use of a flow cytometer.
domain: Protocol
type: ObjectProperty
editor preferred term: specifies the use of
definition source: PERSON: Melissa Haendel
term editor: PERSON: Melissa Haendel
has curation status: IAO_0000120
range: Class
  union of: Instrument
  union of: Reagent
  union of: Technique
  union of: Software

objective achieved by
type: ObjectProperty
domain: Objective Specification
range: Planned Process
definition: This relation obtains between a a objective specification and a planned process when the criteria specified in the objective specification are met at the end of the planned process.
editor note: definition needs clean up to indicate directionality
inverse of: achieves planned objective

Library
type: Class
subclass of: Organization
example of usage: Used information from this definition: http://dictionary.reference.com/browse/library.
example of usage: Marston Science Library
definition: An organization maintaining one or more collections of physical and/or electronic information resources for access or lending.
imported from: VIVO-ISF Ontology version 1.6

Database
type: Class
comment: Just a place horder. It will probably be replaced by NIF term: http://ontology.neuinfo.org/NIF/DigitalEntities/NIF-Resource.owl#nlx_res_20090405
subclass of: Information Content Entity
has curation status: IAO_0000123
definition: A database is an organized collection of data, today typically in digital form.
term editor: PERSON: Carlo Torniai
definition source: http://en.wikipedia.org/wiki/Database

documentation for project or resource
type: ObjectProperty
domain: Document
range: Class
  union of: Instrument
  union of: Service
  union of: Reagent
  union of: Research Project
  union of: Biological Specimen
  union of: Software
  union of: Database
inverse of: has documentation
range: Class
  union of: Instrument
  union of: Service
  union of: Reagent
  union of: Research Project
  union of: Biological Specimen
  union of: Software
  union of: Database

Staff Role
type: Class
subclass of: Employee Role
example of usage: A research technician in a lab.
has curation status: IAO_0000120
definition: An employee role inhering in a person that is realized when the bearer is employed by an employer.
term editor: PERSON: Nicole Vasilevsky
definition source: PERSON: Nicole Vasilevsky

American Board of Pathology

part of
type: TransitiveProperty
type: ObjectProperty

Letter
type: Class
subclass of: Personal Communication Document
example of usage: A written or printed communication addressed to a person or organization and usually transmitted by mail
definition: A written or printed communication addressed to a person or organization and usually transmitted by mail

Data Item
editor note: 2009-03-16: removed datum as alternative term as datum specifically refers to singular form, and is thus not an exact synonym.
editor preferred term: data item
editor note: 2009-03-16: data item deliberatly ambiguous: we merged data set and datum to be one entity, not knowing how to define singular versus plural. So data item is more general than datum.
type: Class
editor note: 2/2/2009 Alan and Bjoern discussing FACS run output data. This is a data item because it is about the cell population. Each element records an event and is typically further composed a set of measurment data items that record the fluorescent intensity stimulated by one of the lasers.
imported from: iao.owl
has curation status: IAO_0000125
example of usage: Data items include counts of things, analyte concentrations, and statistical summaries.
term editor: PERSON: Jonathan Rees
alternative term: data
subclass of: Information Content Entity
definition: a data item is an information content entity that is intended to be a truthful statement about something (modulo, e.g., measurement precision or other systematic errors) and is constructed/acquired by a method which reliably tends to produce (approximately) truthful statements.
term editor: PERSON: Chris Stoeckert
editor note: JAR: datum -- well, this will be very tricky to define, but maybe some information-like stuff that might be put into a computer and that is meant, by someone, to denote and/or to be interpreted by some process... I would include lists, tables, sentences... I think I might defer to Barry, or to Brian Cantwell Smith JAR: A data item is an approximately justified approximately true approximate belief
term editor: PERSON: Alan Ruttenberg

Acquaintance
type: Class
subclass of: Relation Type

Nickname
type: Class
comment: Specifies the text corresponding to the nickname of the object the vCard represents
subclass of: Identification
equivalent class: Class
  intersection of: Restriction
    on property: nickname
    some values from: string
  intersection of: Restriction
    min cardinality: 1
    on property: nickname
equivalent class: Class
  intersection of: Restriction
    on property: nickname
    some values from: string
  intersection of: Restriction
    min cardinality: 1
    on property: nickname

Agent
term editor: PERSON: Scott Hoffmann
type: Class
editor preferred term: agent
example of usage: see: http://xmlns.com/foaf/spec/#term_Agent
comment: An agent
scope note: Used to describe any "agent" related to bibliographic items. Such agents can be persons, organizations or groups of any kind.
subclass of: Restriction
  all values from: Literal
  on property: keywords
subclass of: Independent Continuant
definition: Agents are things that do stuff
subclass of: Restriction
  all values from: Information Content Entity
  on property: featured in
definition: Things that do stuff.
subclass of: Restriction
  all values from: Literal
  on property: keywords
subclass of: Restriction
  all values from: Information Content Entity
  on property: featured in

has member
type: ObjectProperty

has part
type: TransitiveProperty
type: ObjectProperty
inverse of: part of

logo
type: DatatypeProperty
domain: Logo
range: anyURI

Graduate Student
type: Class
subclass of: Student
definition: A person who has already received a bachelor's degree and is working toward a Master's or Doctoral degree.

American Board of Orthopaedic Surgery

Employee Role
type: Class
subclass of: Role
example of usage: An employee at a university.
has curation status: IAO_0000120
definition: A role inhering in a person that is realized when the bearer participates in an occupation by which a person earns a living or spends their time.
term editor: PERSON: Nicole Vasilevsky
definition source: http://dictionary.reference.com/browse/employment

related by
type: ObjectProperty
definition: Relates a Thing to a Relationship as a Thing that is somehow related to other Thing in the same Relationship instance. A Relationship instnace is a predicate over Thing and is created by an Agent.

member of
type: ObjectProperty
inverse of: has member

contact or provider for service
editor preferred term: provides services
term editor: PERSON: Melissa Haendel
definition source: PERSON: Melissa Haendel
range: Service
type: ObjectProperty
definition: Service offered by the organization.
domain: Class
  union of: Organization
  union of: Person
has curation status: IAO_0000120
example of usage: A core lab providing cell sorting to individual labs.
domain: Class
  union of: Organization
  union of: Person

has contact info
type: ObjectProperty
range: Contact

Manufacturer
type: Class
subclass of: Agent
has curation status: uncurated
definition: A person or organization that has a manufacturer role
equivalent class: Class
  intersection of: Class
    union of: Organization
    union of: Person
equivalent class: Class
  intersection of: Class
    union of: Organization
    union of: Person

Translation
type: Class
subclass of: Document
definition: The result of rendering a work from one language to another

American Board of Otolaryngology

Faculty Role
type: Class
subclass of: Employee Role
example of usage: A professor at a university.
has curation status: IAO_0000120
definition: An employee role inhering in a person that is realized when the bearer participates in the teaching and/or administrative force of a university, college, or school.
term editor: PERSON: Nicole Vasilevsky
definition source: http://dictionary.reference.com/browse/faculty

total land area
type: DatatypeProperty

has coordinate
type: DatatypeProperty

preferred namespace URI
type: DatatypeProperty

Report
type: Class
comment: A document describing an account or statement describing in detail an event, situation, or the like, usually as the result of observation, inquiry, etc..
subclass of: Document
subclass of: Restriction
  all values from: Organization
  on property: distributor
example of usage: Medical Subject Heading (MeSH) definition of Technical Report: Work consisting of a formal report giving details of the investigation and results of a medical or other scientific problem. When issued by a government agency or comparable official body, its contents may be classified, unclassified, or declassified with regard to security clearance. This publication type may also cover a scientific paper or article that records the current state or current position of scientific research and development. If so labeled by the editor or publisher, this publication type may be properly used for journal articles.
definition: A document describing an account or statement describing in detail an event, situation, or the like, usually as the result of observation, inquiry, etc.
term status: stable
subclass of: Restriction
  all values from: Organization
  on property: distributor

American Board of Obstetrics and Gynecology

Calendar Busy
type: Class
comment: To specify the URI for the busy time associated with the object that the vCard represents. Was called FBURI in vCard
subclass of: Calendar
equivalent class: Class
  intersection of: Restriction
    on property: calendar busy
    some values from: anyURI
  intersection of: Restriction
    min cardinality: 1
    on property: calendar busy
equivalent class: Class
  intersection of: Restriction
    on property: calendar busy
    some values from: anyURI
  intersection of: Restriction
    min cardinality: 1
    on property: calendar busy

study population count
type: DatatypeProperty
definition: number of human participants in the study (trial).

nameListAR
source creator: FAO terminology
source modified: 2010-06-24
source identifier: http://www.fao.org/termportal/en/
source identifier: http://www.fao.org/termportal/contr/en/
source identifier: http://www.fao.org/termportal/contr/ar/
source: FAO terminology http://www.fao.org/termportal/en/
source identifier: http://www.fao.org/termportal/contr/es/
source identifier: http://www.fao.org/termportal/contr/zh/
source identifier: http://www.fao.org/termportal/contr/fr/
type: DatatypeProperty

Economic Region
type: Class
subclass of: Group

CiTO (Citation Typing Ontology)

American Board of Ophthalmology

instant message
type: DatatypeProperty
domain: Messaging
range: anyURI

subcontracts grant
type: ObjectProperty
domain: Organization
range: Grant
inverse of: subcontracted through

Conference Series
type: Class
subclass of: Event Series
example of usage: For individual, separate conferences, use conference instead. core:ConferenceSeries and core:SeminarSeries are very similar.
definition: An organized series of a meeting for consultation or discussion.

protocol realized by
type: ObjectProperty
domain: Protocol
range: Class
  union of: Service
  union of: Research Project
inverse of: realizes protocol
range: Class
  union of: Service
  union of: Research Project

Quote
type: Class
comment: An excerpted collection of words.
subclass of: Excerpt
example of usage: Short Definition from the bibo ontology
definition: An excerpted collection of words
term status: stable

Non-Faculty Academic Position
type: Class
subclass of: Position
example of usage: Researcher; Academic Extension Associate; Postdoctoral Associate
example of usage: Those positions are held by people who do academic work but do not have faculty positions in universities or institutes.
definition: A position involving academic work but without faculty status

Colleague
type: Class
subclass of: Relation Type

has sound
type: ObjectProperty
range: Sound

American Board of Neurological Surgery

Outreach Provider Role
type: Class
subclass of: Role
example of usage: Communicating Astronomy to the Public
example of usage: The example is one outreach role required by US space agency NASA, which is related with one project in NASA. Name of the outreach role should be put here.
definition: An outreach or community service role directed outside a person's primary profession and institution

Organization
type: Class
comment: Defines all the properties required to be an Organization
comment: To specify the organizational name associated with the vCard
subclass of: VCard Kind

country
type: DatatypeProperty
domain: Address
range: string

Phase
type: Class
subclass of: Process
definition: Phase describes the level of a trial required of drugs before (and after) they are routinely used in clinical practice: - Phase I trials assess toxic effects on humans (not many people participate in them, and usually without controls); - Phase ll trials assess therapeutic benefit (usually involving a few hundred people, usually with controls, but not always); - Phase III trials compare the new treatment against standard (or placebo) treatment (usually a full randomised controlled trial). At this point, a drug can be approved for community use. - Phase IV monitors a new treatment in the community, often to evaluate longterm safety and effectiveness. [Glossary of Terms in The Cochrane Collaboration] A trial can be of a combination phase (e.g., I/II). The concept of phase is not applicable to trials studying certain interventions (e.g., device, procedure, behavioral)
term editor: Simona

Foundation
type: Class
subclass of: Organization
example of usage: The Ford Foundation
example of usage: Definition take from: http://dictionary.reference.com/browse/foundation.
definition: An institution founded with an endowment to support educational, research, artistic or other charitable activities.
imported from: VIVO-ISF Ontology version 1.6

subsequent legal decision
type: ObjectProperty
comment: A legal decision on appeal that takes action on a case (affirming it, reversing it, etc.).
example of usage: Public description is from comments of this object property in bibo ontology located here: http://bibotools.googlecode.com/svn/bibo-ontology/trunk/doc/index.html

revision
type: DatatypeProperty
range: dateTime

Me
type: Class
subclass of: Relation Type

American Board of Nuclear Medicine

category
type: DatatypeProperty
domain: Category
range: string

Scopus ID
type: DatatypeProperty
domain: Person
sub property of: identifier
example of usage: Home page for Scopus: http://www.scopus.com/home.url

Statute
type: Class
comment: A bill enacted into law.
subclass of: Legislation
example of usage: Short Definition from bibo ontology
definition: A bill enacted into law
term status: stable

American Board of Internal Medicine

Related
type: Class
comment: To specify a relationship between another entity and the entity represented by this vCard
subclass of: Organizational
equivalent class: Class
  intersection of: Restriction
    on property: related
    some values from: anyURI
  intersection of: Restriction
    min cardinality: 1
    on property: related
equivalent class: Class
  intersection of: Restriction
    on property: related
    some values from: anyURI
  intersection of: Restriction
    min cardinality: 1
    on property: related

Project
type: Class
subclass of: Process
subclass of: Restriction
  all values from: Literal
  on property: description
subclass of: Restriction
  all values from: Date/Time Interval
  on property: date/time interval
subclass of: Restriction
  all values from: Geographic Region
  on property: geographic focus
example of usage: An endeavor, frequently collaborative, that occurs over a finite period of time and is intended to achieve a particular aim.
definition: An endeavor, frequently collaborative, that occurs over a finite period of time and is intended to achieve a particular aim.
subclass of: Restriction
  all values from: Literal
  on property: description
subclass of: Restriction
  all values from: Date/Time Interval
  on property: date/time interval
subclass of: Restriction
  all values from: Geographic Region
  on property: geographic focus

preferred display order
type: DatatypeProperty

American Board of Medical Genetics

Calendar Request
type: Class
comment: To specify the calendar user address [RFC5545] to which a scheduling request [RFC5546] should be sent for the object represented by the vCard. Was called CALADRURI in vCard
subclass of: Calendar
equivalent class: Class
  intersection of: Restriction
    on property: calendar request
    some values from: anyURI
  intersection of: Restriction
    min cardinality: 1
    on property: calendar request
equivalent class: Class
  intersection of: Restriction
    on property: calendar request
    some values from: anyURI
  intersection of: Restriction
    min cardinality: 1
    on property: calendar request

Association
type: Class
subclass of: Organization
example of usage: Special Libraries Association; Association for Computing Machinery(ACM); American Medical Informatics Association(AMIA)
definition: A formal organization of people or groups of people around a subject or practice.
definition: A group of persons or organizations organized for a common purpose.
imported from: VIVO-ISF Ontology version 1.6

has official name
type: DatatypeProperty

codeDBPediaID
type: DatatypeProperty
source creator: DBpedia
source identifier: http://dbpedia.org/About
source modified: 2010-04-28
source: DBpedia http://dbpedia.org/About

Contact
type: Class
subclass of: Relation Type

proceedings
type: ObjectProperty
domain: Conference
range: Proceedings
description annot: A possible working example: The conference proceeding of the SPIE was generated from the conference - International Society for Optical Engineering.

edition
type: DatatypeProperty
comment: The name defining a special edition of a document. Normally its a literal value composed of a version number and words.
term status: stable

American Board of Family Medicine

location of
type: ObjectProperty
inverse of: located in

Planned Process
definition: A processual entity that realizes a plan which is the concretization of a plan specification.
subclass of: Process
has curation status: IAO_0000122
editor preferred term: planned process
term editor: Bjoern Peters
editor note: 'Plan' includes a future direction sense. That can be problematic if plans are changed during their execution. There are however implicit contingencies for protocols that an agent has in his mind that can be considered part of the plan, even if the agent didn't have them in mind before. Therefore, a planned process can diverge from what the agent would have said the plan was before executing it, by adjusting to problems encountered during execution (e.g. choosing another reagent with equivalent properties, if the originally planned one has run out.)
imported from: obi.owl
example of usage: Injecting mice with a vaccine in order to test its efficacy
definition source: branch derived
type: Class

Catalog
type: Class
subclass of: Document
subclass of: Restriction
  all values from: Organization
  on property: publisher
subclass of: Restriction
  all values from: Literal
  on property: place of publication
example of usage: Short Definition is the Medical Subject Heading (MeSH) definition
example of usage: NLM Catalog
definition: A list of items in a collection; an ordered compilation of item descriptions and sufficient information to afford access to them
subclass of: Restriction
  all values from: Organization
  on property: publisher
subclass of: Restriction
  all values from: Literal
  on property: place of publication

Restriction
max cardinality: 1
on property: has minimum longitude

Restriction
max cardinality: 1
on property: nameCurrencyES

Restriction
max cardinality: 1
on property: HDIYear

Restriction
max cardinality: 1
on property: nationalityZH

Restriction
max cardinality: 1
on property: population notes

Restriction
max cardinality: 1
on property: nameCurrencyFR

Restriction
max cardinality: 1
on property: total population

Restriction
max cardinality: 1
on property: country area unit

Restriction
max cardinality: 1
on property: landAreaYear

Restriction
max cardinality: 1
on property: agricultural area notes

Restriction
max cardinality: 1
on property: HDINotes

Restriction
max cardinality: 1
on property: HDIUnit

Restriction
max cardinality: 1
on property: nationalityIT

Restriction
max cardinality: 1
on property: total country area

Restriction
max cardinality: 1
on property: has maximum latitude

Restriction
max cardinality: 1
on property: nameCurrencyZH

Restriction
max cardinality: 1
on property: countryAreaYear

Restriction
max cardinality: 1
on property: GDPYear