hermaphrodite
type: NamedIndividual
type: Sex
type: Class
description: one organism having both male and female sexual characteristics and organs; at birth an unambiguous assignment of male or female cannot be made
term status: testing

occurrenceHasIndividual
type: ObjectProperty
comment: Links an occurrence to an individual
domain: Occurrence
term status: testing

botany author abbreviation
type: DatatypeProperty
sub property of: nick
term status: testing

samplingProtocol
type: ObjectProperty
comment: Links an Occurrence to a standard vocabulary of sampling protocols as URI's
domain: Occurrence
term status: testing

Rank Subgenus
type: TaxonRank
type: NamedIndividual
type: Class
term status: testing
broader: Rank Genus
narrower: Rank Species

Rank Subclass
type: TaxonRank
type: NamedIndividual
type: Class
term status: testing
broader: Rank Class
narrower: Rank Infraclass

SpeciesImageTag
type: Class
comment: A tag like entity that can be used to indicate that an image is associated with a specific species concept. Instances of SpeciesImageTag take the form of the species concept URI with the fragment of #Image rather than #Species.
term status: testing

hasAcceptedName
type: DatatypeProperty
sub property of: prefLabel
term status: deprecated

hasDLPage
type: ObjectProperty
comment: The range is a page on the DiscoverLife.org site.
range: Webpage
sub property of: page
term status: testing

hasDiscoverLifePage
type: ObjectProperty
comment: The range is a page on the http://www.discoverlife.org/ site.
comment: The range is a page on the Discover Life Web site.
range: Webpage
sub property of: page
term status: testing

continent
type: DatatypeProperty
term status: testing

radius
type: DatatypeProperty
comment: The radius in meters from a particular latitude, longitude point from within which a thing was observed or collected.
domain: Area

FreshwaterHabitat
type: Class
subclass of: Habitat
equivalent class: MarineHabitat
term status: testing

countryCode
type: DatatypeProperty
term status: testing

isWikispeciesArticleOf
type: ObjectProperty
domain: Webpage
inverse of: hasWikispeciesArticle
term status: testing

Status_Testing
type: NamedIndividual
type: Concept
term status: testing

hasGBIFPage
type: ObjectProperty
comment: A page at GBIF.org
range: Webpage
sub property of: page
term status: testing

TDWG2010 BioBlitz Project
type: NamedIndividual
type: Project
term status: testing

Identification
type: Class
comment: An identification action. The identification of a specimen.
subclass of: Event
term status: testing

Rank Division
type: TaxonRank
type: NamedIndividual
type: Class
term status: testing

hasImage
type: ObjectProperty
comment: Superproperty of all the links to images
equivalent property: depiction
term status: testing

canonicalFormID Of
type: ObjectProperty
comment: The URI ID for the scientific name with authorship form of the name i.e. Puma concolor Linnaeus 1758, for name to name mapping
domain: TaxonNameID
range: TaxonNameID
sub property of: relatedTaxonNameID

TaxonOntology
type: Class
term status: testing

hasWikipediaMap
type: ObjectProperty
range: MapImage
sub property of: hasMapImage
term status: testing

identificationMethod
type: ObjectProperty
comment: Method used to identify the individual, as a URI
domain: Identification
term status: testing

Rank Species
type: TaxonRank
type: NamedIndividual
type: Class
term status: testing
broader: Rank Subgenus
narrower: Rank Subpecies

Rank Parvorder
type: TaxonRank
type: NamedIndividual
type: Class
term status: testing
broader: Rank Infraorder
narrower: Rank Superfamily

occurrenceInStateProvince
type: ObjectProperty
comment: Links an Occurrence to Geonames StateProvince URI
domain: Occurrence
range: Feature
term status: testing

taxonNameID
type: ObjectProperty
comment: The URI to the Taxon Name String
range: TaxonNameID
term status: testing

inPhylum
type: ObjectProperty
term status: testing

identificationHasLabelImage
type: ObjectProperty
comment: The image of the identification label on a specimen
domain: Identification
range: Image
sub property of: hasImage
term status: testing

habitat
type: ObjectProperty
comment: associates a taxon with a habitat in which it may typically be found
equivalent property: habitat
term status: testing

Area
type: Class
subclass of: SpatialThing
term status: testing

originalName
type: DatatypeProperty
sub property of: altLabel
term status: testing

hasBioimagesPage
type: ObjectProperty
comment: The range is a page on the Bioimages site.
range: Webpage
sub property of: page
term status: testing

individualHasPreviousIdentificationAssertion
type: ObjectProperty
comment: Links an individual to the most appropriate identification. Zero to many
domain: SpeciesIndividual
term status: testing

inCoLKingdom
type: ObjectProperty
comment: Links a species concept to a Catalog of Life Kingdom in an ontology
term status: testing

heterochresonymID
type: ObjectProperty
comment: The URI to the Heterochresonym Name String
range: TaxonNameID
sub property of: synonymID
term status: testing

institutionCode
type: DatatypeProperty
term status: testing

taxonRank
type: DatatypeProperty
term status: testing

inFamily
type: ObjectProperty
term status: testing

Rank Infraorder
type: TaxonRank
type: NamedIndividual
type: Class
term status: testing
broader: Rank Suborder
narrower: Rank Parvorder

hasGBIFmap
type: ObjectProperty
range: MapImage
sub property of: hasMapImage
term status: testing

infraspecificEpithet
type: DatatypeProperty
sub property of: scientificName
term status: testing

speciesConcepthasVaritypeSpecimen
type: ObjectProperty
comment: Links a species concept to a varitype specimen
inverse of: varitypeSpecimenHasSpeciesConcept
term status: testing

Rank SubspecificAggregate
type: TaxonRank
type: NamedIndividual
type: Class
term status: testing
broader: Rank Species

Rank Subkingdom
type: TaxonRank
type: NamedIndividual
type: Class
term status: testing
broader: Rank Kingdom
narrower: Rank Infrakingdom

hasCollector
type: ObjectProperty
comment: The occurrence observer or specimen collector, hasCollector?
domain: Occurrence
range: Person
term status: testing

areaInStateProvince
type: ObjectProperty
comment: Links an Area to Geonames State/Province URI
term status: testing

identificationReference
type: ObjectProperty
comment: Links an identification to the URI for the reference used.
term status: testing

scientificName
type: DatatypeProperty
sub property of: scientificName
term status: testing

uniprotKingdom
type: ObjectProperty
range: Taxon

stateProvince
type: DatatypeProperty
term status: testing

originalNameID_Of
type: ObjectProperty
domain: TaxonNameID
sub property of: taxonNameID_Of
inverse of: originalNameID
term status: testing

Specific epithet
type: DatatypeProperty
sub property of: scientificName
term status: testing

descYearOf
type: ObjectProperty
domain: Year
inverse of: descYear
term status: testing

inSuborder
type: ObjectProperty
term status: testing

phylum
type: DatatypeProperty
sub property of: scientificName
term status: testing

behavioralNote
type: DatatypeProperty
term status: testing

inCoLPhylum
type: ObjectProperty
comment: Links a species concept to a Catalog of Life Phylum in an ontology
term status: testing

firstAuthorID
type: ObjectProperty
comment: The URI to the First Author
domain: TaxonNameID
range: Taxonomist
term status: testing

trinomial
type: DatatypeProperty
sub property of: trinomial
term status: testing

hasEOLPage
type: ObjectProperty
comment: The range is a page on the Encyclopedia of Life site.
range: Webpage
sub property of: page
term status: testing

Year
type: Class
comment: Class for the Concept Year
subclass of: DateTimeDescription
term status: testing

relatedTaxonNameID
type: ObjectProperty
comment: The URI to the Taxon Name String
domain: TaxonNameID
range: TaxonNameID
term status: testing

Rank Family
type: TaxonRank
type: NamedIndividual
type: Class
term status: testing
broader: Rank Superfamily
narrower: Rank Subfamily

conceptStatus
type: ObjectProperty
comment: The Links to the Status of the TaxonConcept
term status: testing

MonomialNameID
type: Class
subclass of: ScientificNameID
term status: testing

hasNCBI
type: DatatypeProperty
comment: The NCBI Taxonomy ID
term status: testing

hasMapImage
type: ObjectProperty
range: MapImage
sub property of: depiction
term status: testing

Rank Domain
type: TaxonRank
type: NamedIndividual
type: Class
term status: testing
narrower: Rank Subdomain

basisOfRecord
type: ObjectProperty
comment: Assumed to be equivalent to TDWG Basis of Record
term status: testing

isBioimagesPageOf
type: ObjectProperty
domain: Webpage
inverse of: hasBioimagesPage
term status: testing

acceptedName
type: DatatypeProperty
sub property of: prefLabel
term status: testing

SpeciesConcept
type: Class
subclass of: TaxonConcept
term status: testing

areaInCounty
type: ObjectProperty
comment: Links an Area to Geonames County URI
term status: testing

speciesConceptHasOcccurrence
type: ObjectProperty
comment: Links a species to an occurrence. Should be speciesConcept?
domain: SpeciesConcept
term status: testing

hasCitation
type: ObjectProperty
comment: The range is a uniprot pubmed uri for example http://purl.uniprot.org/pubmed/1083304
range: Citation
sub property of: page
term status: testing

isUnknownAboutIn
type: ObjectProperty
comment: Links a species concept to a Geonames URI where the relationship is unknown
term status: testing

inCoLClass
type: ObjectProperty
comment: Links a species concept to a Catalog of Life Class in an ontology
term status: testing

occurrenceInCounty
type: ObjectProperty
comment: Links an Occurrence to Geonames County URI
domain: Occurrence
range: Feature
term status: testing

taxonNameGroupID
type: ObjectProperty
comment: The URI to the Taxon Name Group String
term status: testing

hasEtypePage
type: ObjectProperty
range: Webpage
sub property of: page
term status: testing

georeferenceVerificationStatus
type: ObjectProperty
comment: Was this location verified, controlled choices URI
term status: testing

kingdom
type: DatatypeProperty
sub property of: scientificName
term status: testing

hasSpeciesConceptID
type: DatatypeProperty
comment: This is for a string urn type identifier
domain: SpeciesConcept
term status: testing

male
type: NamedIndividual
type: Sex
type: Class
description: Male (♂) refers to the sex of an organism, or part of an organism, which produces small mobile gametes, called spermatozoa.
term status: testing

occurrenceHasArea
type: ObjectProperty
comment: Links an occurrence to an area
domain: Occurrence
range: Area
term status: testing

Rank Order
type: TaxonRank
type: NamedIndividual
type: Class
term status: testing
broader: Rank Superorder
narrower: Rank Suborder

GenusNameID
type: Class
subclass of: MonomialNameID
term status: testing

Rank Subdivision
type: TaxonRank
type: NamedIndividual
type: Class
term status: testing

Occurrence
type: Class
subclass of: Event
term status: testing

areaHasOccurrence
type: ObjectProperty
comment: Links an Area to an Occurrence
term status: testing

descYear
type: ObjectProperty
comment: This is the year of the description
range: Year
term status: testing

inInfraclass
type: ObjectProperty
term status: testing

SpeciesModel
type: Class
term status: testing

isBugGuidePageOf
type: ObjectProperty
domain: Webpage
inverse of: hasBugGuidePage
term status: testing

hasEbird
type: DatatypeProperty
comment: eBird Species Code
term status: testing

homotypicNameID
type: ObjectProperty
comment: The URI to the HomotypicName Name String
range: TaxonNameID
sub property of: synonymID
term status: testing

uniprotOrder
type: ObjectProperty
range: Taxon

ScientificNameID
type: Class
subclass of: TaxonNameID
term status: testing

inDBpediaClade
type: ObjectProperty
comment: Links a species concept to a clade in the DBpedia ontology
term status: testing

individualHasOccurrence
type: ObjectProperty
comment: Links an individual to an Occurrence, correct
domain: SpeciesIndividual
term status: testing

TrinomialNameID
type: Class
subclass of: ScientificNameID
term status: testing

Taxonomist
type: Class
comment: Class for a Taxonomist a subclass of dbpedia-owl:Scientist
subclass of: Scientist
term status: testing

occurrenceHasLabelImage
type: ObjectProperty
comment: The image of the occurrence label on a specimen
domain: Occurrence
range: Image
sub property of: hasImage
term status: testing

FamilyNameID
type: Class
subclass of: MonomialNameID
term status: testing

hasWildObsPage
type: ObjectProperty
range: Webpage
sub property of: page
term status: testing

hasITIS
type: DatatypeProperty
comment: The ITIS ID
term status: testing

individualHasCurrrentIdentificationAssertion
type: ObjectProperty
comment: Links an individual to the most appropriate identification. Should be one.
domain: SpeciesIndividual
term status: testing

Rank Variety
type: TaxonRank
type: NamedIndividual
type: Class
term status: testing
broader: Rank Species

Sex
type: Class
term status: testing

inClass
type: ObjectProperty
term status: testing

inGenus
type: ObjectProperty
term status: testing

SpeciesIndividual
type: Class
term status: testing

Rank Superphylum
type: TaxonRank
type: NamedIndividual
type: Class
term status: testing
broader: Rank Infrakingdom
narrower: Rank Phylum

Rank Subpecies
type: TaxonRank
type: NamedIndividual
type: Class
term status: testing
broader: Rank Species

individualHasObservedArea
type: ObjectProperty
comment: Links an individual to an Area
domain: SpeciesIndividual
range: Area
term status: testing

individualHasSpeciesConcept
type: ObjectProperty
comment: Links an individual a Species Concept
domain: SpeciesIndividual
term status: testing

Rank Infraclass
type: TaxonRank
type: NamedIndividual
type: Class
term status: testing
broader: Rank Subclass
narrower: Rank Superorder

hasBBCPage
type: ObjectProperty
comment: The range is a page on the BBC site.
range: Webpage
sub property of: page
term status: testing

yearDescribed
type: DatatypeProperty
comment: The year that the species was originally described
term status: testing

Rank Superkingdom
type: TaxonRank
type: NamedIndividual
type: Class
term status: testing
broader: Rank Subdomain
narrower: Rank Kingdom

ScientificCollectorPerson
type: Class
comment: Someone who has collected a scientific sample or specimen.
subclass of: Scientist
term status: testing

acceptedTaxonNameID_Of
type: ObjectProperty
domain: TaxonNameID
sub property of: taxonNameID_Of
inverse of: acceptedNameID
term status: testing

TaxonNameGroupID
type: Class
term status: testing

order
type: DatatypeProperty
sub property of: scientificName
equivalent property: order
term status: testing

localityText
type: DatatypeProperty
term status: testing

MapImage
type: Class
subclass of: Image
term status: testing

OpenCycTaxon
type: Class
term status: testing

startDate
type: DatatypeProperty
term status: testing

pubYearOf
type: ObjectProperty
comment: The year that document was pub
domain: Year
range: Document
inverse of: yearPub
term status: testing

commonName
type: DatatypeProperty
sub property of: commonName
term status: testing

family
type: DatatypeProperty
sub property of: scientificName
term status: testing

Rank Subphylum
type: TaxonRank
type: NamedIndividual
type: Class
term status: testing
broader: Rank Phylum
narrower: Rank Superclass

OccurrenceSpecimenTag
type: Class
term status: testing

Rank Infrakingdom
type: TaxonRank
type: NamedIndividual
type: Class
term status: testing
broader: Rank Subkingdom
narrower: Rank Superphylum

occurrenceInContinent
type: ObjectProperty
comment: Links an Occurrence to Geonames Continent URI
domain: Occurrence
range: Feature
term status: testing

yearPub
type: ObjectProperty
comment: The year that document was pub
domain: Document
range: Year
term status: testing

typeSpecimenHasSod
type: ObjectProperty
comment: Links specimen to an original species description
term status: testing

inCoLFamily
type: ObjectProperty
comment: Links a species concept to a Catalog of Life Family in an ontology
term status: testing

inSubclass
type: ObjectProperty
term status: testing

georeferenceProtocol
type: ObjectProperty
comment: The method used to determine the latitude, longitude as a URI
term status: testing

uniprotPhylum
type: ObjectProperty
range: Taxon

featureContainsArea
type: ObjectProperty
comment: This is used to link a geonames feature to a geo area. For example geo:44.86528100,-87.23147800;u=10
domain: Feature
range: Area
sub property of: hasPart
inverse of: areaWithInFeature
term status: testing

county
type: DatatypeProperty
term status: testing

orthochresonymID
type: ObjectProperty
comment: The URI to the Orthochresonym Name String
range: TaxonNameID
sub property of: synonymID
term status: testing

scientificNameAuthorship
type: DatatypeProperty
comment: The author and year of the species description publication i.e (Baker, 1899)
equivalent property: authority
term status: testing

Rank Subfamily
type: TaxonRank
type: NamedIndividual
type: Class
term status: testing
broader: Rank Family
narrower: Rank Tribe

Rank Superclass
type: TaxonRank
type: NamedIndividual
type: Class
term status: testing
broader: Rank Subphylum
narrower: Rank Class

BinomialNameID
type: Class
subclass of: ScientificNameID
term status: testing

speciesConceptBasedOn
type: ObjectProperty
comment: This describes the theoretical models behind the species concept. All species concepts are at least based on an Objective Model. In addition the may also be based on a Biological Species Model and or a Phylogenetic Species Model. A species concept could be based on all three of these. This is to reflect that there are several criteria used to support a species concept. It also allows one to create a species concept for the domestic cat that is separate from its wild relative. If one followed a strict phylogentic species model, than the domestic cat would be considered to be a subclass of the species Felis sylvestris. This would result in observations or references about the domestic cat being interpreted as observations or references of the African Wildcat Felis sylvestris.
domain: SpeciesConcept
term status: testing

occurrenceHasSpeciesConcept
type: ObjectProperty
comment: Links an occurrence to a species concept
domain: Occurrence
range: SpeciesConcept
term status: testing

Rank Subdomain
type: TaxonRank
type: NamedIndividual
type: Class
term status: testing
broader: Rank Domain
narrower: Rank Superkingdom

CommonNameID
type: Class
subclass of: TaxonNameID
term status: testing

altAcceptedNameID
type: ObjectProperty
comment: The URI to an Alternative Accepted Name String
range: TaxonNameID
sub property of: taxonNameID
term status: testing

taxonNameID_Of
type: ObjectProperty
comment: The URI to the Taxon Name String
domain: TaxonNameID
term status: testing

DataObject
type: Class
subclass of: DataObject

Scientist
type: Class
comment: Class for Scientist a foaf:Person
subclass of: Person
equivalent class: Scientist
term status: testing

female
type: NamedIndividual
type: Sex
type: Class
description: Female (♀) is the sex of an organism, or a part of an organism, which produces mobile ova (egg cells).
term status: testing

SurrogateNameID
type: Class
subclass of: TaxonNameID
term status: testing

ScientificAuthorPerson
type: Class
comment: Someone who has authored a scientific article.
subclass of: Scientist
term status: testing

locationName
type: DatatypeProperty
term status: testing

hasEUNISPage
type: ObjectProperty
range: Webpage
sub property of: page
term status: testing

identificationOfIndividual
type: ObjectProperty
comment: Links an identification to an individual
domain: Identification
term status: testing

canonicalFormID
type: ObjectProperty
comment: The URI ID for the canonical form of the name i.e. Puma concolor or Felidae, for name to name mapping
domain: TaxonNameID
range: TaxonNameID
sub property of: relatedTaxonNameID

hasEOL
type: DatatypeProperty
comment: The Encyclopedia of Life Integer ID
term status: testing

NCBI Genus
type: ObjectProperty
comment: Links to the most appropriate NCBI Genus
term status: testing

Rank Kingdom
type: TaxonRank
type: NamedIndividual
type: Class
term status: testing
broader: Rank Superkingdom
narrower: Rank Subkingdom

taxonNameGroupID_Of
type: ObjectProperty
inverse of: taxonNameGroupID
term status: testing

altAcceptedNameID_Of
type: ObjectProperty
comment: The URI to an Alternative Accepted Name String
domain: TaxonNameID
sub property of: taxonNameID_Of
inverse of: originalNameID
term status: testing

areaHasIndividual
type: ObjectProperty
comment: Links an Area to an Individual
term status: testing

uniprotSpecies
type: ObjectProperty
range: Taxon

TaxonConcept Ontology
type: Vocabulary
type: Ontology
comment: Version 0.976 Added additional GenusNameID, SubfamilyNameID and FamilyNameID for NLP project
creator: Peter J DeVries
description: Version 0.976 This is an ontology for dealing with data related to species including observations, specimens, images etc. Traditionally species have been identified by the combination of a genus and specific epithet, for example Puma concolor. However these names change frequently as new information moves a given species into a different genus etc. Most of the time the species concept itself is unchanged. This leads a lot of confusion and difficulty connecting data relating to a given species concept together. This ontology and the related TaxonConcept data set avoids this by minting identifiers that are tied to a specific species concept which can have several names and classifications. The RDF descriptions of each species concept provides some guide as to what is the best species concept for a given specimen or observation, and links together data sets containing additional information about that concept. Since some of these related data sets entail specific names or classifications they are loosely linked using skos:closeMatch etc. Depending on your particular needs, you might want to merge these in your own knowledge base as sameAs or simply merge those properties that you think are appropriate.
modified: 2013-05-19
publisher: TaxonConcept_Knowledge_Base_Project
preferred namespace prefix: txn
preferred namespace uri: http://lod.taxonconcept.org/ontology/txn.owl#
version info: 0.976

surrogateName
type: DatatypeProperty
sub property of: altLabel
term status: testing

hasBOLDPage
type: ObjectProperty
comment: A page at boldsystems.org
range: Webpage
sub property of: page
term status: testing

Sex Unknowable
type: NamedIndividual
type: Sex
type: Class
term status: testing

Habitat
type: Class
equivalent class: Habitat
term status: testing

zoology author abbreviation
type: DatatypeProperty
sub property of: nick
term status: testing

OccurrenceTaxonTag
type: Class
term status: testing

thumbnail
type: ObjectProperty
range: Image
sub property of: depiction
term status: testing

identificationDate
type: DatatypeProperty
term status: testing

binomial
type: DatatypeProperty
sub property of: binomial
term status: testing

catalogCode
type: DatatypeProperty
term status: testing

Rank Suborder
type: TaxonRank
type: NamedIndividual
type: Class
term status: testing
broader: Rank Order
narrower: Rank Infraorder

sodHasTypeSpecimen
type: ObjectProperty
comment: Links an original description to a species type specimen
inverse of: typeSpecimenHasSod
term status: testing

nameYear
type: ObjectProperty
comment: The year that a name was published
domain: TaxonNameID
range: Year
term status: testing

yearDied
type: ObjectProperty
domain: Person
range: Year
term status: testing

Rank Superdivision
type: TaxonRank
type: NamedIndividual
type: Class
term status: testing

Status_Preliminary
type: NamedIndividual
type: Concept
term status: testing

Rank Superfamily
type: TaxonRank
type: NamedIndividual
type: Class
term status: testing
broader: Rank Parvorder
narrower: Rank Family

hasBugGuidePage
type: ObjectProperty
range: Webpage
sub property of: page
term status: testing

Sex Undetermined
type: NamedIndividual
type: Sex
type: Class
term status: testing

speciesConceptHasObservedArea
type: ObjectProperty
comment: Links a species to an area. Should be speciesConcept?
domain: SpeciesConcept
range: Area
term status: testing

SubfamilyNameID
type: Class
subclass of: MonomialNameID
term status: testing

hasADWPage
type: ObjectProperty
comment: The range is a page on the Animal Diversity Web site.
range: Webpage
sub property of: page
term status: testing

SpeciesIndividualTag
type: Class
comment: A tag like entity that can be used to indicate that an individual organism is an associated with a particular species concept. Instances of SpeciesIndividualTag take the form of the species concept URI with the fragment of #Individual rather than #Species.

scientificNameWithAuthor
type: DatatypeProperty
sub property of: prefLabel
term status: testing

inSubfamily
type: ObjectProperty
term status: testing

inSuperfamily
type: ObjectProperty
term status: testing

TaxonRank
type: Class
term status: testing

varitypeSpecimenHasSpeciesConcept
type: ObjectProperty
comment: Links a varitype specimen to a species concept
term status: testing

ScientificNameWithAuthorID
type: Class
subclass of: TaxonNameID
term status: testing

occurrenceInFeature
type: ObjectProperty
domain: Occurrence
range: Feature
term status: testing

inKingdom
type: ObjectProperty
term status: testing

Gallery
type: Class
term status: testing

class
type: DatatypeProperty
sub property of: scientificName
equivalent property: class
term status: testing

hybrid
type: DatatypeProperty
term status: testing

genus
type: DatatypeProperty
sub property of: scientificName
term status: testing

synonymName
type: DatatypeProperty
sub property of: hiddenLabel
term status: testing

FreshwaterHabitat
type: Class
subclass of: Habitat
equivalent class: FreshwaterHabitat
term status: testing

hasGBIF
type: DatatypeProperty
comment: The Global Biodiversity Information Facility integer ID
term status: testing

identifiedBy
type: ObjectProperty
comment: Links an identification to the URI a human that made the identification as URI
domain: Identification
range: Person
term status: testing

Image
type: Class
equivalent class: Image
term status: testing

heterotypicNameID
type: ObjectProperty
comment: The URI to the HeterotypicName Name String
range: TaxonNameID
sub property of: synonymID
term status: testing

uniprotFamily
type: ObjectProperty
range: Taxon

hasBOLD
type: DatatypeProperty
comment: The Barcode of Life Integer ID
term status: testing

Specimen
type: Class
comment: A organismal specimen that is related to a specific organism, parts of an individual organism, or a collection of these from several organisms. It should be used for the smallest entity in a specimen database. Ideally there should be at least one specimen per individual organism. Specimens consisting of multiple individuals or multiple species often complicate analysis. If one photo contains multiple entities, document these as separate specimens all linked to the same photo.
term status: testing

identificationHasSpeciesConcept
type: ObjectProperty
comment: The link between an Identification and Species Concept, redundant with identifiedAs
term status: testing

collectionCode
type: DatatypeProperty
term status: testing

TaxonConcept_Knowledge_Base_Project
type: NamedIndividual
type: Project
type: Organization
term status: testing

areaHasObservedSpeciesConcept
type: ObjectProperty
comment: Links an Area to a Species Concept
term status: testing

hasExpectationOf
type: ObjectProperty
comment: This is to link between a geographical area and a taxon-like entity. The doman and range are left blank so this can be used with different kinds of geographic vocabularies and different kinds of taxon concept vocabularies. It should not be used to indicate that a location has the expectation of a specific individual specimen, but to indicate that the location has an expectation of a specific class of organisms. For instance, it would be used to indicate that a geographic location has an expectation of a particular species. The use should approximate assertions similar to what one might find in a state or country checklist.
term status: testing

SpeciesOriginalDescription
type: Class
term status: testing

lastAuthorID
type: ObjectProperty
comment: The URI to the Last Author
domain: TaxonNameID
range: Taxonomist
term status: testing

thumbnailOf
type: ObjectProperty
domain: Image
sub property of: depicts
term status: testing

TerrestrialHabitat
type: Class
subclass of: Habitat
equivalent class: TerrestrialHabitat
term status: testing

isExpectedIn
type: ObjectProperty
comment: This is to link between a taxon-like entity and a geographical area. The doman and range are left blank so this can be used with different kinds of geographic vocabularies and different kinds of taxon concept vocabularies. It should not be used to indicate that a particular individual organism is expecten in a geographical area, but to indicate that the species etc. is expected in a particular geographical area. For instance, it would be used to indicate that a species is expected in a particular state or province. The use should approximate assertions similar to what one might find in a state or country checklist.
inverse of: hasExpectationOf
term status: testing

authority
type: DatatypeProperty
comment: The author and year of the species description publication i.e (Baker, 1899)
equivalent property: authority
term status: testing

inOrder
type: ObjectProperty
term status: testing

individualhasImage
type: ObjectProperty
comment: Intended to link an individual to a image. Should be subproperty of foaf:depiction
domain: SpeciesIndividual
sub property of: hasImage
term status: testing

ScientificIdentifierPerson
type: Class
comment: Someone who has identified a specimen.
subclass of: Scientist
term status: testing

individualStatus
type: ObjectProperty
comment: Links from an individual to a controlled vocabulary of URI's for the current status of that individual
domain: SpeciesIndividual
term status: testing

acceptedNameID
type: ObjectProperty
comment: The URI to the Accepted Name String, should only be one.
range: TaxonNameID
sub property of: taxonNameID
term status: testing

Rank Tribe
type: TaxonRank
type: NamedIndividual
type: Class
term status: testing
broader: Rank Subfamily
narrower: Rank Genus

endDate
type: DatatypeProperty
term status: testing

country
type: DatatypeProperty
term status: testing

inSuperorder
type: ObjectProperty
term status: testing

Rank Class
type: TaxonRank
type: NamedIndividual
type: Class
term status: testing
broader: Rank Superclass
narrower: Rank Subclass

TaxonConcept_Scheme
type: NamedIndividual
type: Concept
term status: testing

Rank Genus
type: TaxonRank
type: NamedIndividual
type: Class
term status: testing
broader: Rank Tribe
narrower: Rank Subgenus

hasOriginalName
type: DatatypeProperty
sub property of: altLabel
term status: deprecated

nameYear
type: ObjectProperty
comment: Inverse of The year that a name was published
domain: Year
range: TaxonNameID
inverse of: nameYear
term status: testing

hasWikipediaArticle
type: ObjectProperty
range: Webpage
sub property of: page
term status: testing

isWikipediaArticleOf
type: ObjectProperty
domain: Webpage
inverse of: hasWikipediaArticle
term status: testing

SpeciesTaxonomyNCBI
type: Class
comment: A tag like entity for the NCBI Taxonomic Classification.
term status: testing

identificationNote
type: DatatypeProperty
term status: testing

hasITISPage
type: ObjectProperty
comment: The range is a page on the ITIS.gov site.
range: Webpage
sub property of: page
term status: testing

ScientificDataCuratorPerson
type: Class
comment: Someone who has curated or entered data into a scientific data set.
subclass of: Scientist
term status: testing

TaxonNameID
type: Class
subclass of: TaxonNameID

uniprotClass
type: ObjectProperty
range: Taxon

uniprotGenus
type: ObjectProperty
range: Taxon

originalNameID
type: ObjectProperty
comment: The URI to the Original Name String
range: TaxonNameID
sub property of: taxonNameID
term status: testing

hasWikispeciesArticle
type: ObjectProperty
range: Webpage
sub property of: page
term status: testing

Rank Phylum
type: TaxonRank
type: NamedIndividual
type: Class
term status: testing
broader: Rank Superphylum
narrower: Rank Subphylum

isEOLPageOf
type: ObjectProperty
comment: The range is a page on the Encyclopedia of Life site.
domain: Webpage
term status: testing

hasUSDAPlantsPage
type: ObjectProperty
range: Webpage
sub property of: page
term status: testing

synonymID
type: ObjectProperty
comment: The URI to a synonymID of the TaxonNameID
range: TaxonNameID
sub property of: relatedTaxonNameID
term status: testing

TaxonConcept
type: Class
comment: A particular taxonomic concept. Currently only species concepts are implemented, however theoretically there could be additional subclasses of GenusConcepts, FamilyConcepts etc. A SubspeciesConcept and lower are considered to be subclasses of SpeciesConcepts, but one persons subspecies is often anothers species. My current thinking is to represent individuals and observations of subspecies as individuals and observations of the larger species concept. It has yet to be implemented but I am considering recording these as observations and individuals of a given species "in the form of" their subspecies indentifier or name.
term status: testing

NCBI Species
type: ObjectProperty
comment: Links to the most appropriate NCBI Species
term status: testing

hasUnknownExpectationOf
type: ObjectProperty
comment: This is to link between a geographical area and a taxon-like entity. Where the association is not known. The doman and range are left blank so this can be used with different kinds of geographic vocabularies and different kinds of taxon concept vocabularies. It should not be used to indicate that a location has the expectation of a specific individual specimen, but to indicate that the location has an expectation of a specific class of organisms. For instance, it would be used to indicate that a geographic location has an expectation of a particular species. The use should approximate assertions similar to what one might find in a state or country checklist.
inverse of: isUnknownAboutIn
term status: testing

inCoLOrder
type: ObjectProperty
comment: Links a species concept to a Catalog of Life Order in an ontology
term status: testing

identificationHasOcccurrence
type: ObjectProperty
comment: The link between an Identification and an Occurrence
domain: Identification
term status: testing

Rank Superorder
type: TaxonRank
type: NamedIndividual
type: Class
term status: testing
broader: Rank Infraclass
narrower: Rank Order

yearBorn
type: ObjectProperty
domain: Person
range: Year
term status: testing

areaWithInFeature
type: ObjectProperty
comment: This is used to connect geo areas to geoname features
domain: Area
range: Feature
sub property of: partOf
term status: testing