URL
type: DatatypeProperty
creator: Mikel Egaña Aranguren (https://orcid.org/0000-0001-8081-1839)
date: 2023-03-10T19:19:41Z

Open data
type: Class
comment: Data available at an Open Data portal, usually developed by a public administration
subclass of: Evidence
creator: Mikel Egaña Aranguren (https://orcid.org/0000-0001-8081-1839)
date: 2023-03-27T15:36:32Z

Owner
type: Class
comment: The owner of a company
subclass of: Role
creator: Mikel Egaña Aranguren (https://orcid.org/0000-0001-8081-1839)
date: 2023-03-08T21:12:53Z

Person
type: Class
comment: A person (alive, dead, undead, or fictional).
subclass of: Restriction
  min qualified cardinality: 1
  on data range: string
  on property: Name
subclass of: Restriction
  all values from: string
  on property: Profile URL
subclass of: Restriction
  all values from: string
  on property: Email
subclass of: Restriction
  on property: Has role
  some values from: Role

Start date
type: DatatypeProperty
domain: Role
range: dateTime
creator: Mikel Egaña Aranguren (https://orcid.org/0000-0001-8081-1839)
date: 2023-03-09T09:02:16Z

Individual contractor
type: Class
comment: A person that acts as a single contractor to other organizations, usually government organizations
subclass of: Role
creator: Mikel Egaña Aranguren (https://orcid.org/0000-0001-8081-1839)
date: 2024-01-27T10:23:30Z

Commitment
type: Class
comment: An obligation (possibly unilateral)

Email
type: DatatypeProperty
domain: Class
  union of: Organization
  union of: Person
range: string

GovernmentOrganization
type: Class
comment: A governmental organization or agency
subclass of: Organization

NewsArticle
type: Class
comment: A NewsArticle is an article whose content reports news, or provides background context and supporting materials for understanding the news
subclass of: Evidence

Profile URL
type: DatatypeProperty
domain: Class
  union of: Person
  union of: Role
range: anyURI
sub property of: URL
creator: Mikel Egaña Aranguren (https://orcid.org/0000-0001-8081-1839)
date: 2023-03-09T09:04:41Z

Value added tax included
type: DatatypeProperty
domain: Price specification
range: boolean

Price specification
type: Class
comment: The superclass of all price specifications
subclass of: Commitment
subclass of: Restriction
  on property: Has currency value
  some values from: double
subclass of: Restriction
  on property: Has currency
  some values from: string

Name
type: DatatypeProperty
domain: Person
range: string

Role
type: Class
comment: The role of a person in a en entity during a given time period, provided in months or years
subclass of: Commitment
subclass of: Restriction
  all values from: decimal
  on property: Years
subclass of: Restriction
  on property: In entity
  some values from: Organization
subclass of: Restriction
  all values from: decimal
  on property: Months
subclass of: Restriction
  all values from: dateTime
  on property: End date
subclass of: Restriction
  all values from: dateTime
  on property: Start date
creator: Mikel Egaña Aranguren (https://orcid.org/0000-0001-8081-1839)
date: 2023-03-08T21:06:06Z

Political Party
type: Class
comment: organized group of individuals who share similar political beliefs, ideologies, and policy goals, and they work together to gain political power and influence within a government system
subclass of: Organization

Represents
type: ObjectProperty
contributor: Jaime Gómez-Obregón (https://ladonacion.es/) @es
creator: Mikel Egaña Aranguren (https://orcid.org/0000-0001-8081-1839)
date: 2022-02-21T14:21:32Z

President
type: Class
comment: The president of an organization
subclass of: Role
creator: Mikel Egaña Aranguren (https://orcid.org/0000-0001-8081-1839)
date: 2023-03-09T08:50:34Z

Manager
type: Class
comment: A person within an organization who is responsible for planning, coordinating, and overseeing various activities and resources to achieve specific goals and objectives
subclass of: Role
creator: Mikel Egaña Aranguren (https://orcid.org/0000-0001-8081-1839)
date: 2023-03-09T10:33:21Z

Director
type: Class
comment: The director of an organization
subclass of: Role
creator: Mikel Egaña Aranguren (https://orcid.org/0000-0001-8081-1839)
date: 2023-03-09T08:50:19Z

CPV code
type: DatatypeProperty
domain: Contract
range: string
creator: Mikel Egaña Aranguren (https://orcid.org/0000-0001-8081-1839)
date: 2023-05-19T07:51:57Z

Evidence
type: Class
comment: The evidence of a relation. Normally an evidence will be a source of news. This is not legal evidence
subclass of: Restriction
  on property: URL
  some values from: anyURI
creator: Mikel Egaña Aranguren (https://orcid.org/0000-0001-8081-1839)
date: 2022-02-15T11:19:58Z

Pays to
type: ObjectProperty
contributor: Jaime Gómez-Obregón (https://ladonacion.es/) @es
creator: Mikel Egaña Aranguren (https://orcid.org/0000-0001-8081-1839)
date: 2022-02-21T14:24:12Z

Employee
type: Class
comment: A person hired by an organization
subclass of: Role
creator: Mikel Egaña Aranguren (https://orcid.org/0000-0001-8081-1839)
date: 2023-03-08T21:13:05Z

Takes place in
type: ObjectProperty
creator: Mikel Egaña Aranguren (https://orcid.org/0000-0001-8081-1839)
date: 2022-02-21T14:35:58Z

Transparent Relations Ontology
type: Ontology
contributor: Jaime Gómez-Obregón (https://ladonacion.es/) @es
contributor: Off-shore leaks DataBase (https://offshoreleaks.icij.org/)
creator: Mikel Egaña Aranguren (https://orcid.org/0000-0001-8081-1839) @eu
abstract: Transparent Relations Ontology (TRO) offers a vocabulary to publish information about relations that should be more transparent, usually between powerful parties, to detect potential conflicts of interests: for example, governments and their providers, or politicians and their personal relationships. Research journalism and Open Data are two areas in which this sort of data is growing, and new methods and standards are needed to cope with the FAIR publication and consumption of such data.
created: 2022-04-01T00:00:01
description: A vocabulary to represent relations that should be more transparent, usually between powerfull people or institutions
issued: 2022-04-01T00:00:01
license: https://apache.org/licenses/LICENSE-2.0
modified: 2023-06-06T00:00:01
preferred namespace prefix: tro
preferred namespace uri: https://w3id.org/TRO#
prior version: 0.1.2
version IRI: https://w3id.org/TRO/0.1.3
version info: 0.1.3
schema version: https://w3id.org/TRO/0.1.3

Parent
type: ObjectProperty
sub property of: Knows

NGO
type: Class
comment: Non-governmental Organization
subclass of: Organization

Sibling
type: SymmetricProperty
type: ObjectProperty
sub property of: Knows
creator: Mikel Egaña Aranguren (https://orcid.org/0000-0001-8081-1839)
date: 2023-03-27T15:34:21Z

Associate
type: Class
comment: A person who is connected to another organization in a relationship that is less close or committed than a partnership
subclass of: Role
creator: Mikel Egaña Aranguren (https://orcid.org/0000-0001-8081-1839)
date: 2023-03-08T21:12:46Z

Public Profile
type: Class
comment: A public profile in the web (e.g. LinkedIn)
subclass of: Evidence
creator: Mikel Egaña Aranguren (https://orcid.org/0000-0001-8081-1839)
date: 2023-03-10T19:19:00Z

Identifier
type: FunctionalProperty
type: DatatypeProperty
range: string

Sports Organization
type: Class
comment: all sports organizations, including sports teams, governing bodies, and sports associations
subclass of: Organization

Has currency value
type: DatatypeProperty
domain: Price specification
range: double

Years
type: DatatypeProperty

Member
type: Class
comment: A person is a member of an organization
subclass of: Role
creator: Mikel Egaña Aranguren (https://orcid.org/0000-0001-8081-1839)
date: 2023-03-27T15:32:50Z

Spouse
type: ObjectProperty
sub property of: Knows

Has price specification
type: ObjectProperty

Organization
type: Class
comment: A generic organization that can be formal or informal, legal or non-legal. It can have members, or not

Officer
type: Class
comment: An officer usually belongs to a publica organization
subclass of: Role
creator: Mikel Egaña Aranguren (https://orcid.org/0000-0001-8081-1839)
date: 2023-03-09T08:51:05Z

Minor contract
type: Class
comment: In some administrations minor contracts do not have to be justified
label: Contrato menor @es
label: Kontratu txikia @eu
subclass of: Contract
creator: Mikel Egaña Aranguren (https://orcid.org/0000-0001-8081-1839)
date: 2023-05-19T08:10:50Z

Registered in
type: ObjectProperty
contributor: Jaime Gómez-Obregón (https://ladonacion.es/) @es
creator: Mikel Egaña Aranguren (https://orcid.org/0000-0001-8081-1839)
date: 2022-02-21T14:30:10Z

Corporation
type: Class
comment: A business corporation
subclass of: Organization
subclass of: Restriction
  min qualified cardinality: 1
  on data range: string
  on property: Identifier

End date
type: DatatypeProperty
domain: Role
range: dateTime
creator: Mikel Egaña Aranguren (https://orcid.org/0000-0001-8081-1839)
date: 2023-03-09T09:02:35Z

Workers Union
type: Class
comment: A Workers Union (also known as a Labor Union, Labour Union, or Trade Union) is an organization that promotes the interests of its worker members by collectively bargaining with management, organizing, and political lobbying
subclass of: Organization

Has role
type: ObjectProperty
domain: Person
range: Role
creator: Mikel Egaña Aranguren (https://orcid.org/0000-0001-8081-1839)
date: 2023-03-08T21:10:19Z

Contract
type: Class
comment: A voluntary, deliberate, and legally binding agreement between two or more competent parties. Additional information: This includes concession contracts. (WG approval 01/06/2018)
subclass of: Commitment
subclass of: Restriction
  on property: URL
  some values from: anyURI
subclass of: Restriction
  all values from: dateTime
  on property: Start date
subclass of: Restriction
  on property: Binds Contractor
  some values from: Class
    union of: Organization
    union of: Person
subclass of: Restriction
  all values from: string
  on property: CPV code
subclass of: Restriction
  on property: Identifier
  some values from: string
subclass of: Restriction
  on property: Has price specification
  some values from: Price specification
subclass of: Restriction
  all values from: dateTime
  on property: End date

Provider of
type: ObjectProperty
comment: A company or and individual provides services or products to an institution
creator: Mikel Egaña Aranguren (https://orcid.org/0000-0001-8081-1839)
date: 2022-02-15T11:23:05Z

In entity
type: ObjectProperty
domain: Role
range: Organization
creator: Mikel Egaña Aranguren (https://orcid.org/0000-0001-8081-1839)
date: 2023-03-08T21:13:36Z

Binds Contractor
type: ObjectProperty
domain: Contract
range: Class
  union of: Organization
  union of: Person

Has bank account in
type: ObjectProperty
contributor: Jaime Gómez-Obregón (https://ladonacion.es/) @es
creator: Mikel Egaña Aranguren (https://orcid.org/0000-0001-8081-1839)
date: 2022-02-21T14:25:46Z

Knows
type: ObjectProperty
domain: Person
range: Person

With evidence
type: ObjectProperty
domain: Role
range: Evidence
creator: Mikel Egaña Aranguren (https://orcid.org/0000-0001-8081-1839)
date: 2023-03-08T21:27:00Z

Has currency
type: DatatypeProperty
domain: Price specification
range: string

Months
type: DatatypeProperty