Greater Than Relation
type: Class
comment: All members of this related node are greater than the value
subclass of: Relation

Less than or equal to Relation
type: Class
subclass of: Relation

Value
type: Property
comment: The value the node linked in the node relation is compared to

Suffix Relation
type: Class
comment: All members of this related node end with this suffix
subclass of: Relation

Import conditionally
type: Property
comment: Imports a file in order being able to evaluate a tree:path correctly
range: Conditional Import

Import
type: Property
comment: Imports a file in order being able to evaluate a tree:path correctly or comply fully to the tree:shape defined in the Collection

Pieter Colpaert

Has node
type: Property
comment: The URL to follow when this Node cannot be pruned
domain: Relation
range: Node

Less Than Relation
type: Class
subclass of: Relation

Greater than or equal to relation
type: Class
comment: All members of this related node are greater than or equal to the value
subclass of: Relation

Equal To Relation
type: Class
subclass of: Relation

Path
type: Property
comment: A property path, as defined by shacl, that indicates what resource the tree:value affects.
domain: Relation
range: Resource

Geospatially Contains Relation
type: Class
comment: All further members are geospatially contained within the WKT string of the tree:value.
subclass of: Relation

View
type: Property
comment: Links the collection to a `tree:Node` from which all other members can be found.
domain: Collection
range: Node

Relation
type: Property
comment: Links a node with another through a Relation class
domain: Node
range: Relation

View Description
type: Property
comment: Links together a tree:Node with its description of this TREE structure
domain: Node
range: View Description

Relation
type: Class
comment: A class describing the relation between two nodes

Collection
type: Class
comment: A tree:Collection is a collection containing members. The members may be spread across multiple tree:Nodes.
subclass of: Dataset

The X tile number
type: Property
comment: The X tile number from longitude cfr. OSM convention
domain: Node
range: float

View Description
type: Class
comment: Describes a specific TREE structure on top of the tree:Collection
subclass of: DataService

Ruben Taelman

Prefix Relation
type: Class
comment: All members of this related node start with this prefix
subclass of: Relation

The Y tile number
type: Property
comment: The Y tile number from latitude cfr. OSM convention
domain: Node
range: float

Member
type: Property
comment: The collection has a member.
domain: Collection

TREE
type: Ontology
comment: A hypermedia specification for fragmenting collections.

Time Query
type: Property
comment: Will search for elements starting from a certain timestamp
domain: Node
range: dateTime

Search
type: Property
comment: The Node can be searched for child nodes.
domain: Node
range: IriTemplate

Remaining Items
type: Property
comment: Total number of items of this node and its children
domain: Node
range: integer

Substring Relation
type: Class
comment: All members of this related node contain this substring
subclass of: Relation

In Between Relation
type: Class
comment: For comparing intervals: all further members are in-between the given interval
subclass of: Relation

Conditional Import
type: Class
comment: Import a page when the tree:path is interesting for the client

Shape
type: Property
comment: The SHACL shape the members of the collection adhere to.
domain: Collection
range: NodeShape

Node
type: Class
comment: A tree:Node is a node that may contain relations to other nodes.

Zoom level
type: Property
comment: The zoom level of the tile cfr. OSM convention
domain: Node
range: float