Ontologie des éléments du territoire et de ses infrastructures de l'IGN
type: Ontology
type: Vocabulary
preferred namespace prefix: topo
description: Ontologie décrivant les éléments du territoire et ses infrastructures. Elle repend l'essentiel du vocabulaire de la BDTOPO(IGN) et vise Ã couvrir l'ensemble des entités topographiques et administratives du territoire national. Les thèmes couverts sont: le réseau routier, le réseau ferroviaire, le réseau de transport d'énergie, le réseau hydrographique, les bâtiments, la végétation arborée, l'orographie, les communes, les points d'activité ou d'intérêt.
issued: 2014-04-16
modified: 2014-04-16
version info: Version 1.0 - 2014-04-16
rights: Copyright © 2014 IGN
license: Licence-Ouverte-Open-Licence
creator: http://recherche.ign.fr/labos/cogit/cv.php
contributor: ~atemezin
publisher: Institut national de l'information géographique et forestière

Entité topographique
type: Class
comment: Un phénomène du monde réel qui est associé Ã une localisation sur la terre
label: Topographic entity @en
equivalent class: Feature

Zone d'activité ou d'intérêt
type: Class
comment: Bâtiment ou site ayant une vocation ou un caractère particuliers (administratif, religieux, sportif, industriel, etc.).
label: Working area or area of interest @en
subclass of: Entité topographique

Bâti
type: Class
comment: Bâtiments (indifférenciés, industriels et remarquables) et autres constructions.
label: Buildings and structures @en
subclass of: Entité topographique

Bâtiment
type: Class
comment: Construction d'une certaine importance destinée Ã abriter des personnes, des choses ou des animaux.
label: Building @en
subclass of: Bâti

Construction
type: Class
comment: Ouvrage de génie civil.
label: Structure @en
subclass of: Bâti

Réservoir
type: Class
comment: Réservoir (eau, matières industrielles,...) de plus de 10m de diamètre.
label: Tank @en
subclass of: Bâti

Cimetière
type: Class
comment: Lieu où l’on enterre les morts.
label: Cemetery @en
subclass of: Bâti

Terrain de sport
type: Class
comment: Équipement sportif de plein air.
label: Sports ground @en
subclass of: Bâti

Piste d'aérodrome
type: Class
comment: Aire située sur un aérodrome, aménagée afin de servir au roulement des aéronefs, au décollage et Ã l’atterrissage, en dur ou en herbe.
label: Taxiway @en
subclass of: Bâti

Zone de végétation
type: Class
comment: Espace végétal naturel ou non différencié selon le couvert forestier.
label: Vegetation area @en
subclass of: Entité topographique

Élément du relief
type: Class
comment: Entité topographique correspondant Ã une rupture de pente artificielle, ou Ã un élément remarquable du relief nommé.
label: Relief feature @en
subclass of: Entité topographique

Infrastructure de transport d'énergie
type: Class
comment: Éléments du réseau de transport d'électricité Ã une haute et très haute tension, et conduites utilisées pour le transport de matière première.
label: Energy transport infrastructure @en
subclass of: Entité topographique

Conduite
type: Class
comment: Conduite (autre que canalisation d’eau) ou tapis roulant utilisés pour le transport de matière première (gaz, hydrocarbure, minerai, etc.) ou canalisation de nature inconnue.
label: Pipeline @en
subclass of: Infrastructure de transport d'énergie

Ligne électrique
type: Class
comment: Portion de ligne électrique homogène pour l'ensemble des attributs qui la concernent.
label: Electricity transmission line @en
subclass of: Infrastructure de transport d'énergie

Poste de transformation
type: Class
comment: Enceinte Ã l'intérieur de laquelle le courant transporté par une ligne électrique est transformé.
label: Transformation sub-station @en
subclass of: Infrastructure de transport d'énergie

Pylône
type: Class
comment: Support de ligne électrique. Pylône, portique.
label: Pylon @en
subclass of: Infrastructure de transport d'énergie

Élément du réseau ferroviaire
type: Class
comment: Éléments du réseau de transport ferroviaire: voies ferrées et aires de triage.
label: Transport by rail feature @en
subclass of: Entité topographique

Aire de triage
type: Class
comment: Surface qui englobe l’ensemble des tronçons de voies, voies de garage, aiguillages permettant le tri des wagons et la composition des trains. Aire de triage, faisceau de voies.
label: Marshalling yard @en
subclass of: Élément du réseau ferroviaire

Voie ferrée
type: Class
comment: Portion de voie ferrée homogène pour l'ensemble des attributs qui la concernent. Dans le cas d’une ligne composée de deux Ã quatre voies parallèles, l’ensemble des voies est modélisé par un seul objet.
label: Railway track @en
subclass of: Élément du réseau ferroviaire

Ligne de transport par câble
type: Class
comment: Moyen de transport constitué d'un ou de plusieurs câbles porteurs.
label: Cableway transport line @en
subclass of: Entité topographique

Élément du réseau routier
type: Class
comment: Éléments du réseau de transport routier: voies de communication revêtues et non revêtues, réseau 'adressé', et une sélection des chemins et sentiers.
label: Road transport feature @en
subclass of: Entité topographique

Route
type: Class
comment: Portion de voie de communication destinée aux automobiles, aux piétons, aux cycles ou aux animaux, homogène pour l'ensemble des attributs et des relations qui la concerne. Le tronçon de route peut être revêtu ou non revêtu (pas de revêtement de surface ou revêtement de surface fortement dégradé).
label: Road @en
subclass of: Restriction
  some values from: Voie nommée
  on property: isPartOf
subclass of: Élément du réseau routier
subclass of: Restriction
  some values from: Voie nommée
  on property: isPartOf

Voie nommée
type: Class
comment: Une voie est un ensemble de tronçons de route associés Ã un même nom. Une voie est identifiée par son nom dans une commune donnée. Le nom de voie est celui qui sert Ã l’adressage.
label: Named street @en
subclass of: Élément du réseau routier

Borne postale
type: Class
comment: Borne postale située Ã l'extrémité d'un tronçon de route.
label: Civic number marker @en
subclass of: Élément du réseau routier

Parking
type: Class
comment: Zone aménagée pour le parcage des automobiles. Parking non couvert, public ou privé, aire de stationnement d’environ un demi hectare et plus.
label: Car park @en
subclass of: Élément du réseau routier

Aire de péage
type: Class
comment: Emprise de la chaussée d'une aire de péage.
label: Toll-gate area @en
subclass of: Élément du réseau routier

Place
type: Class
comment: Place ou carrefour revêtu de grande largeur.
label: Square @en
subclass of: Élément du réseau routier

Entité hydrographique terrestre
type: Class
comment: Entité topographique relative au réseau hydrographique terrestre, Ã la production ou au stockage d'eau.
label: Inland hydrographic feature @en
subclass of: Entité topographique

Point d'eau
type: Class
comment: Source (captée ou non), point de production d’eau (pompage, forage, puits,...) ou point de stockage d’eau de petite dimension (citerne, abreuvoir, lavoir, bassin).
label: Waterhole @en
subclass of: Entité hydrographique terrestre

Surface d'eau
type: Class
comment: Surface d'eau non marine : large canal, étang, large fleuve, lac, mare, large rivière.
label: Water surface @en
subclass of: Entité hydrographique terrestre

Bassin
type: Class
comment: Construction non couverte destinée Ã recevoir de l'eau temporairement ou de manière permanente.
label: Basin @en
subclass of: Entité hydrographique terrestre

Canalisation d'eau
type: Class
comment: Canalisation d'eau aérienne.
label: Water pipe @en
subclass of: Entité hydrographique terrestre

Cours d'eau
type: Class
comment: Portion de cours d'eau, réel ou fictif, permanent ou temporaire, naturel ou artificiel, homogène pour l'ensemble des attributs qui la concernent, et qui n'inclut pas de confluent.
label: Watercourse @en
subclass of: Entité hydrographique terrestre

Laisse
type: Class
comment: Limite supérieure ou inférieure de l'estran.
label: Tide line @en
subclass of: Entité hydrographique terrestre

Commune
type: Class

Type de ZAI
type: Class
label: Type of Area Of Interest (AOI) @en
comment: Regroupe l'ensemble des instances désignant des types de zones d'activités et d'intérêt.
subclass of: Concept

Type de bâtiment
type: Class
label: Type of building @en
comment: Regroupe l'ensemble des instances désignant des types de bâtiments.
subclass of: Concept

Type de construction
type: Class
label: Type of structure @en
comment: Regroupe l'ensemble des instances désignant des types de constructions.
subclass of: Concept

Type de réservoir
type: Class
label: Type of tank @en
comment: Regroupe l'ensemble des instances désignant des types de réservoirs.
subclass of: Concept

Type de terrain de sport
type: Class
label: Type of sports ground @en
comment: Regroupe l'ensemble des instances désignant des types de terrains de sports.
subclass of: Concept

Type de végétation
type: Class
label: Type of vegetation @en
comment: Regroupe l'ensemble des instances désignant des types de végétation arborée.
subclass of: Concept

Type d'élément du relief
type: Class
label: Type of relief feature @en
comment: Regroupe l'ensemble des instances désignant des types de reliefs.
subclass of: Concept

Type de voie ferrée
type: Class
label: Type of railway track @en
comment: Regroupe l'ensemble des instances désignant des types de voies ferrées.
subclass of: Concept

Type de ligne de transport par câble
type: Class
label: Type of cableway transport line @en
comment: Regroupe l'ensemble des instances désignant des types d'infrastructures de transport par câble.
subclass of: Concept

Type de franchissement
type: Class
label: Type of crossing @en
comment: Regroupe l'ensemble des instances désignant des types d'ouvrages de franchissement.
subclass of: Concept

Type de route
type: Class
label: Type of road @en
comment: Regroupe l'ensemble des instances désignant des types de routes.
subclass of: Concept

Type de point d'eau
type: Class
label: Type of waterhole @en
comment: Regroupe l'ensemble des instances désignant des types de points d'eau.
subclass of: Concept

Type de laisse
type: Class
label: Type of tide line @en
comment: Regroupe l'ensemble des instances désignant des types de laisses.
subclass of: Concept

nature
type: ObjectProperty
comment: Relie une entité topographique au concept qui précise sa nature.
domain: Entité topographique
range: Concept

type de ZAI
type: ObjectProperty
label: type of Area Of Interest (AOI) @en
sub property of: nature
comment: Relie une instance de zone d'activité et d'intérêt Ã une instance de skos:Concept définie dans la liste 'zai' qui précise sa nature.
domain: Zone d'activité ou d'intérêt
range: Restriction
  on property: inScheme
  has value: Type de ZAI
range: Restriction
  on property: inScheme
  has value: Type de ZAI

type de bâtiment
type: ObjectProperty
label: type of building @en
sub property of: nature
comment: Relie une instance de bâtiment Ã une instance de skos:Concept définie dans la liste 'bati' qui précise sa nature.
domain: Bâtiment
range: Restriction
  on property: inScheme
  has value: Type de bâtiment
range: Restriction
  on property: inScheme
  has value: Type de bâtiment

type de construction
type: ObjectProperty
label: type of structure @en
sub property of: nature
comment: Relie une instance de construction Ã une instance de skos:Concept définie dans la liste 'cnstr' qui précise sa nature.
domain: Construction
range: Restriction
  on property: inScheme
  has value: Type de construction
range: Restriction
  on property: inScheme
  has value: Type de construction

type de réservoir
type: ObjectProperty
label: type of tank @en
sub property of: nature
comment: Relie une instance de réservoir Ã une instance de skos:Concept définie dans la liste 'rsv' qui précise sa nature.
domain: Réservoir
range: Restriction
  on property: inScheme
  has value: Type de réservoirs
range: Restriction
  on property: inScheme
  has value: Type de réservoirs

type de terrain de sport
type: ObjectProperty
label: type of sports ground @en
sub property of: nature
comment: Relie une instance de terrain de sport Ã une instance de skos:Concept définie dans la liste 'tds' qui précise sa nature.
domain: Terrain de sport
range: Restriction
  on property: inScheme
  has value: Type de terrain de sport
range: Restriction
  on property: inScheme
  has value: Type de terrain de sport

type de végétation
type: ObjectProperty
label: type of vegetation @en
sub property of: nature
comment: Relie une instance de zone de végétation Ã une instance de skos:Concept définie dans la liste 'veg' qui précise sa nature.
domain: Zone de végétation
range: Restriction
  on property: inScheme
  has value: Type de végétation
range: Restriction
  on property: inScheme
  has value: Type de végétation

type d'élément du relief
type: ObjectProperty
label: type of relief feature @en
sub property of: nature
comment: Relie une instance d'élément du relief Ã une instance de skos:Concept définie dans la liste 'rel' qui précise sa nature.
domain: Élément du relief
range: Restriction
  on property: inScheme
  has value: Type d'élément du relief
range: Restriction
  on property: inScheme
  has value: Type d'élément du relief

type de voie ferrée
type: ObjectProperty
label: type of railway track @en
sub property of: nature
comment: Relie une instance de voie ferrée Ã une instance de skos:Concept définie dans la liste 'vfr' qui précise sa nature.
domain: Voie ferrée
range: Restriction
  on property: inScheme
  has value: Type de voie ferrée
range: Restriction
  on property: inScheme
  has value: Type de voie ferrée

type de ligne de transport par câble
type: ObjectProperty
label: type of cableway transport line @en
sub property of: nature
comment: Relie une instance d'infrastructure de transport par câble Ã une instance de skos:Concept définie dans la liste 'tpc' qui précise sa nature.
domain: Ligne de transport par câble
range: Restriction
  on property: inScheme
  has value: Type de ligne de transport par câble
range: Restriction
  on property: inScheme
  has value: Type de ligne de transport par câble

type de route
type: ObjectProperty
label: type of road @en
sub property of: nature
comment: Relie une instance de route Ã une instance de skos:Concept définie dans la liste 'rte' qui précise sa nature.
domain: Route
range: Restriction
  on property: inScheme
  has value: Type de route
range: Restriction
  on property: inScheme
  has value: Type de route

type de point d'eau
type: ObjectProperty
label: type of waterhole @en
sub property of: nature
comment: Relie une instance de point d'eau Ã une instance de skos:Concept définie dans la liste 'pte' qui précise sa nature.
domain: Point d'eau
range: Restriction
  on property: inScheme
  has value: Type de point d'eau
range: Restriction
  on property: inScheme
  has value: Type de point d'eau

type de laisse
type: ObjectProperty
label: type of tide line @en
sub property of: nature
comment: Relie une instance de laisse Ã une instance de skos:Concept définie dans la liste 'tdl' qui précise sa nature.
domain: Laisse
range: Restriction
  on property: inScheme
  has value: Type de laisse
range: Restriction
  on property: inScheme
  has value: Type de laisse

type de franchissement
type: ObjectProperty
comment: Relie les éléments de réseaux de transport au type d'ouvrage de franchissement auquel ils correspondent.
label: type of crossing @en
domain:
  union of: Voie ferrée
  union of: Route
range: Restriction
  on property: inScheme
  has value: Type de franchissement
domain:
  union of: Voie ferrée
  union of: Route
range: Restriction
  on property: inScheme
  has value: Type de franchissement

classement administratif
type: ObjectProperty
comment: Classement administratif. Statut d’une route numérotée ou nommée.
domain: Route
label: administrative status @en
range: Restriction
  on property: inScheme
  has value: Type de route
range: Restriction
  on property: inScheme
  has value: Type de route

concerne
type: ObjectProperty
comment: Relation entre une borne postale et la voie Ã laquelle elle se rapporte.
domain: Borne postale
label: related to @en
range: Voie nommée

commune gestionnaire de la voie nommée
type: ObjectProperty
comment: Relation entre une voie nommée et la commune dont elle dépend.
domain: Voie nommée
label: manager of the nammed street @en
range: Commune

borne initiale
type: ObjectProperty
comment: Relation entre un tronçon de route et la borne postale correspondant Ã son point initial.
domain: Route
label: initial civic number marker @en
range: Borne postale

borne finale
type: ObjectProperty
comment: Relation entre un tronçon de route et la borne postale correspondant Ã son point final.
domain: Route
label: final civic number marker @en
range: Borne postale

origine
type: ObjectProperty
comment: Source de l'information.
domain: Entité topographique
sub property of: wasDerivedFrom
range: Entity

importance
type: DatatypeProperty
comment: Importance du toponyme dans son environnement. Le toponyme de valeur 1 est plus important que le toponyme de valeur 2, lui-même plus important que le toponyme de valeur 3, etc.
domain: Entité topographique
range: DataRange
  one of: 1
  one of: 2
  one of: 3
  one of: 4
  one of: 5
  one of: 6
  one of: 7
  one of: 8
  one of: NC
  one of: NR
range: DataRange
  one of: 1
  one of: 2
  one of: 3
  one of: 4
  one of: 5
  one of: 6
  one of: 7
  one of: 8
  one of: NC
  one of: NR

précision planimétrique
type: DatatypeProperty
comment: Précision géométrique planimétrique.
domain: Entité topographique
label: planimetric accuracy @en
range: double

précision altimétrique
type: DatatypeProperty
comment: Précision géométrique altimétrique.
domain: Entité topographique
label: altimetric accuracy @en
range: double

hauteur
type: DatatypeProperty
comment: Hauteur du bâtiment correspondant Ã la différence entre le Z le plus élevé du pourtour du bâtiment et un point situé au pied du bâtiment.
domain: Bâtiment
label: height @en
range: integer

z min
type: DatatypeProperty
comment: Altitude minimale d’un objet linéaire ou surfacique. Cette information est issue de la saisie photogrammétrique et concerne des objets dont les points initiaux et finaux ne sont pas caractéristiques de l’altitude de l’objet (objets surfaciques, objets linéaires isolés). Pour des objets surfaciques comme les bâtiments ou les réservoirs, il s’agit de l’altitude minimum du pourtour tel qu’il est défini en planimétrie (généralement l’altitude aux gouttières) et non de l’altitude minimum absolue. Dans le cas d’un bâtiment obtenu après intégration du bâti issu du cadastre, Z_MIN correspond Ã une altitude toit médiane calculée, en prenant en compte les altitudes des contours des bâtiments directement contigus s’ils existent. Dans ce cas Z_MAX et Z_MIN prennent la même valeur. L’attribut peut prendre une valeur conventionnelle (9999) lorsque la géométrie de l’objet n’est pas issue d’une saisie photogrammétrique (ex. objets numérisés sur la carte en service).
domain: Entité topographique
label: min z @en
range: double

z max
type: DatatypeProperty
comment: Altitude maximale d’un objet linéaire ou surfacique. Cette information est issue de la saisie photogrammétrique et concerne des objets dont les points initiaux et finaux ne sont pas caractéristiques de l’altitude de l’objet (objets surfaciques, objets linéaires isolés). Pour des objets surfaciques comme les bâtiments ou les réservoirs, il s’agit de l’altitude maximum du pourtour tel qu’il est défini en planimétrie (généralement l’altitude aux gouttières) et non de l’altitude maximum absolue (voir schéma ci-dessus). Dans le cas d’un bâtiment obtenu après intégration du bâti issu du cadastre, Z_MAX correspond Ã une altitude toit médiane calculée, en prenant en compte les altitudes des contours des bâtiments directement contigus s’ils existent. Dans ce cas Z_MAX et Z_MIN prennent la même valeur. L’attribut peut prendre une valeur conventionnelle (9999) lorsque la géométrie de l’objet n’est pas issue d’une saisie photogrammétrique (ex. objets numérisés sur la carte en service).
domain: Entité topographique
label: max z @en
range: double

z moyen
type: DatatypeProperty
comment: Altitude moyenne des points composants la géométrie de l’objet telle qu’il a été saisi Ã l’origine lorsqu’il est issu d’une saisie photogrammétrique. L’attribut peut prendre une valeur conventionnelle (9999) lorsque la géométrie de l’objet n’est pas issue d’une saisie photogrammétrique (ex. objets numérisés sur la carte en service).
domain: Entité topographique
label: average z @en
range: double

z initial
type: DatatypeProperty
comment: Altitude du sommet initial d'une portion d'élément linéaire d'un réseau.
domain: Class
  intersection of: Entité topographique
  intersection of: Restriction
    some values from: Curve
    on property: geometry
label: initial z @en
range: double
domain: Class
  intersection of: Entité topographique
  intersection of: Restriction
    some values from: Curve
    on property: geometry

z final
type: DatatypeProperty
comment: Altitude du sommet final d'une portion d'élément linéaire d'un réseau.
domain: Class
  intersection of: Entité topographique
  intersection of: Restriction
    some values from: Curve
    on property: geometry
label: final z @en
range: double
domain: Class
  intersection of: Entité topographique
  intersection of: Restriction
    some values from: Curve
    on property: geometry

entité Ã vocation militaire
type: DatatypeProperty
comment: Attribut permettant de distinguer une entité topographique Ã vocation militaire ou simplement gérée par le ministère de la défense d'une entité civile. La valeur « vrai » est également affectée aux cimetières militaires gérés par le Ministère des Anciens Combattants ou par des états étrangers.
domain: Cimetière
domain: Restriction
  has value: Aérodrome
  on property: nature
label: military feature @en
range: boolean
domain: Restriction
  has value: Aérodrome
  on property: nature

type de piste
type: DatatypeProperty
comment: Attribut permettant de distinguer différentes natures d'aérodrome.
domain: Piste d'aérodrome
label: type of taxiway @en
range: DataRange
  one of: Piste aménagée sur une surface dure
  one of: Piste aménagée sur de l'herbe
range: DataRange
  one of: Piste aménagée sur une surface dure
  one of: Piste aménagée sur de l'herbe

voltage
type: DatatypeProperty
comment: Tension de construction de la ligne électrique en kV (kilo Volts).
domain: Ligne électrique
range: DataRange
  one of: 63
  one of: 90
  one of: 150
  one of: 225
  one of: 400
  one of: NR
range: DataRange
  one of: 63
  one of: 90
  one of: 150
  one of: 225
  one of: 400
  one of: NR

position par rapport au sol
type: DatatypeProperty
comment: Position par rapport au sol. Donne le niveau de l’objet par rapport Ã la surface du sol (valeur nulle pour un objet au sol, négative pour un objet situé au-dessous du niveau du sol et positive pour un objet en sursol).
domain: Conduite
label: position in relation to the ground @en
range: integer

électrifié
type: DatatypeProperty
comment: Désigne le type d'énergie servant Ã la propulsion des locomotives. Prends la valeur 'vrai' s'il s'agit d'une ligne électrifiée.
domain: Voie ferrée
label: electrified @en
range: boolean

largeur de la voie ferrée
type: DatatypeProperty
comment: Attribut permettant de distinguer les voies ferrées de largeur standard (normale) pour la France (1,435 m), des voies ferrées plus larges ou plus étroites.
domain: Voie ferrée
label: railway track width @en
range: DataRange
  one of: étroite
  one of: normale
  one of: large
range: DataRange
  one of: étroite
  one of: normale
  one of: large

nombre de voies ferrées
type: DatatypeProperty
comment: Nombre de voies constituant cette portion de ligne de chemin de fer. La valeur 0 indique que le nombre de voies est inconnu.
domain: Voie ferrée
label: number of tracks @en
range: integer

en construction
type: DatatypeProperty
comment: Indique l'état d'une entité topographique artificielle. Renvoie 'vrai' si cette entité est en cours de construction.
domain: Voie ferrée
domain: Route
label: under construction @en
range: boolean

numéro
type: DatatypeProperty
comment: Désigne le classement administratif d'un tronçon routier.
domain: Route
label: number @en
range: string

gestionnaire
type: DatatypeProperty
comment: Définit le gestionnaire administratif d’une route. Toutes les routes classées possèdent un ‘Gestionnaire’.
domain: Route
label: manager @en
range: string

date de mise en service
type: DatatypeProperty
comment: Définit la date prévue ou la date effective de mise en service d’un tronçon de route. Cet attribut n'est rempli que pour les tronçons en construction, il est Ã “NR“ dans les autres cas. Les tronçons qui possèdent une date de mise en service sont complètement fermés aux véhicules avant cette date.
domain: Route
label: in service date @en
range: string

itinéraire vert
type: DatatypeProperty
comment: Indique l’appartenance ou non d’un tronçon routier au réseau vert. Le réseau vert, composé de pôles verts et de liaisons vertes, couvre l’ensemble du territoire français. Les pôles verts sont composés de communes de plus de 23.000 habitants en province et de 39.000 habitants en Ile-de-France, ainsi que certains pôles d’activités administratifs, économiques, touristiques ou industriels. On retient seulement le réseau vert de transit entre pôles verts. Le réseau vert de rabattement, Ã l’intérieur des villes, et le réseau vert conseillé aux poids lourds ne sont pas retenus.
domain: Route
label: green itinerary @en
range: boolean

itinéraire européen
type: DatatypeProperty
comment: Numéro de route européenne : une route européenne emprunte en général le réseau autoroutier ou national (exceptionnellement départemental ou non classé).
domain: Route
label: european itinerary @en
range: string

fictif
type: DatatypeProperty
comment: La valeur 'oui' indique que la géométrie du tronçon de réseau n'est pas significative.
domain: Route
domain: Cours d'eau
label: dummy @en
range: boolean

largeur de chaussée
type: DatatypeProperty
comment: Largeur de chaussée (d’accotement Ã accotement) exprimée en mètres.
domain: Route
label: carriageway width @en
range: double

nom d'itinéraire
type: DatatypeProperty
comment: Définit un parcours routier nommé.
domain: Route
label: name of itinerary @en
range: string

nombre de voies de circulation
type: DatatypeProperty
comment: Nombre total de voies d’une route, d’une rue ou d’une chaussée de route Ã chaussées séparées.
domain: Route
label: number of traffic lanes @en
range: integer

sens de circulation
type: DatatypeProperty
comment: Sens de circulation autorisée pour les automobiles sur les voies.
domain: Route
label: direction of traffic @en
range: DataRange
  one of: double
  one of: direct
  one of: inverse
  one of: NC
  one of: NR
range: DataRange
  one of: double
  one of: direct
  one of: inverse
  one of: NC
  one of: NR

type d’adressage
type: DatatypeProperty
comment: Renseigne sur le type d’adressage du tronçon.
domain: Route
label: type of addressing @en
range: DataRange
  one of: classique
  one of: métrique
  one of: linéaire
  one of: autre
  one of: NC
  one of: NR
range: DataRange
  one of: classique
  one of: métrique
  one of: linéaire
  one of: autre
  one of: NC
  one of: NR

artificiel
type: DatatypeProperty
comment: Permet de distinguer les cours d'eau naturels des cours d'eau artificiels ou artificialisés.
domain: Cours d'eau
label: artificial @en
range: boolean

régime des eaux
type: DatatypeProperty
comment: Attribut permettant de caractériser un objet hydrographique en fonction du régime des eaux.
domain: Cours d'eau
label: water regime @en
range: DataRange
  one of: permanent
  one of: intermittent
range: DataRange
  one of: permanent
  one of: intermittent

numéro de borne postale
type: DatatypeProperty
comment: Numéro de borne postale.
domain: Borne postale
label: civic number @en
range: integer

code postal
type: DatatypeProperty
comment: Numéro de code postal.
domain: Commune
label: postal code @en
range: integer

Type de ZAI
type: ConceptScheme
comment: Liste des différents types de zones d'activité et d'intérêt, représentés comme une hiérarchie de concepts SKOS.
label: Type of AOI @en
has top concept: PAI administratif ou militaire
has top concept: PAI culture ou loisirs
has top concept: PAI espace naturel
has top concept: PAI science ou enseignement
has top concept: PAI gestion des eaux
has top concept: PAI industriel ou commercial
has top concept: PAI religieux
has top concept: PAI santé
has top concept: PAI sport
has top concept: PAI transport
has top concept: PAI zone d'habitation
has top concept: PAI hydrographie
has top concept: PAI orographie

Type de bâtiment
type: ConceptScheme
comment: Liste des différents types de bâtiments, représentés comme une hiérarchie de concepts SKOS.
label: Type of building @en

Type de végétation
type: ConceptScheme
comment: Liste des différents types de végétation, représentés comme une hiérarchie de concepts SKOS.
label: Type of vegetation @en
has top concept: Zone arborée

Type d'élément du relief
type: ConceptScheme
comment: Liste des différents types d'éléments du relief, représentés comme une hiérarchie de concepts SKOS.
label: Type of relief feature @en

Type de construction
type: ConceptScheme
comment: Liste des différents types de constructions, représentés comme une hiérarchie de concepts SKOS.
label: Type of structure @en

Type de réservoirs
type: ConceptScheme
comment: Liste des différents types de réservoirs, représentés comme une hiérarchie de concepts SKOS.
label: Type of tank @en

Type de terrain de sport
type: ConceptScheme
comment: Liste des différents types de terrains de sport, représentés comme une hiérarchie de concepts SKOS.
label: Type of sports ground @en

Type de ligne de transport par câble
type: ConceptScheme
comment: Liste des différents types lignes de transport par câble, représentés comme une hiérarchie de concepts SKOS.
label: Type of cableway transport line @en

Type de voie ferrée
type: ConceptScheme
comment: Liste des différents types de voies ferrées, représentés comme une hiérarchie de concepts SKOS.
label: Type of railway track @en

Type de franchissement
type: ConceptScheme
comment: Liste des différents types d'obstacles ou d'infrastructures dédiées au franchissement d'obstacles, représentés comme une hiérarchie de concepts SKOS.
label: Type of crossing @en

Type de route
type: ConceptScheme
comment: Liste des différents types de routes, représentés comme une hiérarchie de concepts SKOS.
label: Type of road @en

Type de point d'eau
type: ConceptScheme
comment: Liste des différents types de points d'eau, représentés comme une hiérarchie de concepts SKOS.
label: Type of waterhole @en

Type de laisse
type: ConceptScheme
comment: Liste des différents types de laisses, représentés comme une hiérarchie de concepts SKOS.
label: Type of tide line @en

PAI administratif ou militaire
type: Type de ZAI
type: Concept
definition: Désignation d'un établissement, site ou zone ayant un caractère public, administratif ou militaire.
in scheme: Type de ZAI
preferred label: Administrative or military POI @en

PAI culture ou loisirs
type: Type de ZAI
type: Concept
definition: Désignation d'un établissement ou lieu spécialement aménagé pour une activité culturelle, touristique ou de loisirs.
in scheme: Type de ZAI
preferred label: Culture or leasure POI @en

PAI espace naturel
type: Type de ZAI
type: Concept
definition: Désignation d'un lieu-dit non habité dont le nom ne se rapporte ni Ã un détail orographique ni Ã un détail hydrographique.
in scheme: Type de ZAI
preferred label: Natural POI @en

PAI science ou enseignement
type: Type de ZAI
type: Concept
definition: Désignation d'un établissement d'enseignement ou de recherche.
in scheme: Type de ZAI
preferred label: Science or education POI @en

PAI gestion des eaux
type: Type de ZAI
type: Concept
definition: Désignation d'une construction ou site liés Ã l'approvisionnement, au traitement de l'eau pour différents besoins (agricole, industriel, consommation) ou Ã l'épuration des eaux usées avant rejet dans la nature.
in scheme: Type de ZAI
preferred label: Water treatment POI @en

PAI industriel ou commercial
type: Type de ZAI
type: Concept
definition: Désignation d'un bâtiment, site ou zone Ã caractère industriel ou commercial.
in scheme: Type de ZAI
preferred label: Industrial or commercial POI @en

PAI religieux
type: Type de ZAI
type: Concept
definition: Désignation d'un bâtiment réservé Ã la pratique d'une religion.
in scheme: Type de ZAI
preferred label: Religious POI @en

PAI santé
type: Type de ZAI
type: Concept
definition: Désignation d'un établissement thermal ou de type hospitalier.
in scheme: Type de ZAI
preferred label: Healthcare POI @en

PAI sport
type: Type de ZAI
type: Concept
definition: Désignation d'un établissement ou lieu spécialement aménagé pour la pratique d'une ou plusieurs activités sportives.
in scheme: Type de ZAI
preferred label: Sports POI @en

PAI transport
type: Type de ZAI
type: Concept
definition: Désignation d'un bâtiment ou site lié Ã une activité de transport routier, ferré ou aérien.
in scheme: Type de ZAI
preferred label: Transport POI @en

PAI zone d'habitation
type: Type de ZAI
type: Concept
definition: Désignation d'un lieu-dit habité caractérisé par un nom.
in scheme: Type de ZAI
preferred label: Dwellings zone POI @en

PAI hydrographie
type: Type de ZAI
type: Concept
definition: Désignation se rapportant Ã un détail hydrographique.
in scheme: Type de ZAI
preferred label: Hydrographic POI @en

PAI orographie
type: Type de ZAI
type: Concept
definition: Désignation d'un détail du relief.
in scheme: Type de ZAI
preferred label: Relief POI @en

Borne
type: Type de ZAI
type: Concept
definition: Borne nommée : borne frontière, point de triangulation, point frontière.
in scheme: Type de ZAI
preferred label: Marker @en
broader: PAI administratif ou militaire

Bureau de poste
type: Type de ZAI
type: Concept
definition: Bureau de poste ouvert au public : Bureau de poste, hôtel des postes. Seuls les bureaux de poste ouverts en permanence sont inclus. En général, dans les agglomérations, seules les postes centrales sont incluses.
in scheme: Type de ZAI
preferred label: Post office @en
alternative label: Hôtel des postes
alternative label: General post office @en
broader: PAI administratif ou militaire

Caserne de pompiers
type: Type de ZAI
type: Concept
definition: Bâtiment ayant ou non un bureau ou une permanence et qui est entièment concerné par l'activité du corps des Sapeurs-Pompiers.
in scheme: Type de ZAI
preferred label: Fire station @en
broader: PAI administratif ou militaire

Enceinte militaire
type: Type de ZAI
type: Concept
definition: Zone en permanence réservée pour les rassemblements de troupes de toutes les armes, soit pour des manoeuvres, des exercices (camp d'instruction), soit pour des essais, des études: base, camp, caserne, dépôt de matériels, terrain permanent d'entrainement, caserne de CRS, caserne de gendarmes mobiles, ... Les champs de tir sont exclus ainsi que les propriétés de l'armée qui ne sont indiquées d'aucune manière sur le terrain (ni clôtures, ni barrières, ni pancartes, ...) et ne faisant l'objet d'aucune restriction particulière.
in scheme: Type de ZAI
preferred label: Military Area @en
broader: PAI administratif ou militaire

Établissement pénitenciaire
type: Type de ZAI
type: Concept
definition: Établissement clos aménagé pour recevoir des délinquants condamnés Ã une peine privative de liberté ou des détenus en instance de jugement: maison d'arrêt, prison. Les annexes sont exclues.
in scheme: Type de ZAI
preferred label: Penitentiary @en
broader: PAI administratif ou militaire

Gendarmerie
type: Type de ZAI
type: Concept
definition: Caserne où les gendarmes sont logés ; bureaux où ils remplissent leurs fonctions administratives : gendarmerie, gendarmerie d'autoroute. Définition de l'emprise du site : surface de l'ensemble de la caserne, généralement délimitée par une clôture et incluant logements et bureaux.
in scheme: Type de ZAI
broader: PAI administratif ou militaire

Hôtel de département
type: Type de ZAI
type: Concept
definition: Bâtiment où siège le conseil général. Seul le bâtiment principal est inclus. Les annexes ne le sont pas, sauf éventuellement une annexe située dans une autre agglomération lorsqu'elle a une fonction proche de celle du siège.
in scheme: Type de ZAI
preferred label: Departmental administration building @en
broader: PAI administratif ou militaire

Hôtel de région
type: Type de ZAI
type: Concept
definition: Bâtiment où siège le conseil régional. Seul le bâtiment principal est inclus. Les annexes ne le sont pas, sauf éventuellement une annexe située dans une autre agglomération lorsqu'elle a une fonction proche de celle du siège.
in scheme: Type de ZAI
preferred label: Regional administration building @en
broader: PAI administratif ou militaire

Maison forestière
type: Type de ZAI
type: Concept
definition: Maison gérée par l'office national des forêts. Les maisons de garde occupées par au moins un agent de l'ONF sont incluses. Les bureaux de l'ONF, les domiciles d'agents servant aussi de bureau, sont exclus lorsqu'ils ne sont pas situés dans une maison forestière.
in scheme: Type de ZAI
preferred label: Forest house @en
broader: PAI administratif ou militaire

Ouvrage militaire
type: Type de ZAI
type: Concept
definition: Ouvrages ou installations militaires.
in scheme: Type de ZAI
preferred label: Defence work @en
broader: PAI administratif ou militaire

Palais de justice
type: Type de ZAI
type: Concept
definition: Bâtiment où l'on rend la justice : palais de justice, tribunal. Seule la justice pénale est traitée. Les tribunaux administratifs sont exclus.
in scheme: Type de ZAI
preferred label: Law-courts @en
broader: PAI administratif ou militaire

Poste de police
type: Type de ZAI
type: Concept
definition: Établissement occupé par un commissaire de police (officier de police judiciaire chargé de faire observer les règlements de police et de veiller au maintien de la paix publique) : hôtel de police nationale, commissariat, CRS d'autoroute, de port ou d'aéroport. Les bâtiments hébergeant uniquement la police municipale sont exclus. Les casernes de CRS et de gendarmes mobiles prennent la valeur 'enceinte militaire' et les gendarmeries la valeur 'gendarmerie'.
in scheme: Type de ZAI
preferred label: Police post @en
alternative label: Hôtel de police
alternative label: Police station @en
broader: PAI administratif ou militaire

Préfecture de région
type: Type de ZAI
type: Concept
definition: Établissement qui abrite le siège de l'administration civile de la région. Les annexes sont exclues.
in scheme: Type de ZAI
preferred label: Regional prefecture @en
broader: PAI administratif ou militaire

Camping
type: Type de ZAI
type: Concept
definition: Emplacement aménagé pour la pratique du camping d'une superficie de plus de 2 ha.
in scheme: Type de ZAI
preferred label: Camping grounds @en
broader: PAI culture ou loisirs

Construction nommée
type: Type de ZAI
type: Concept
definition: Construction nommée habitée ou associée Ã un groupe d'habitations : construction diverse, pigeonnier, moulin Ã vent.
in scheme: Type de ZAI
preferred label: Named building @en
broader: PAI culture ou loisirs

Digue
type: Type de ZAI
type: Concept
definition: Digue, môle, jetée.
definition: Dike, breakwater, jetty. @en
in scheme: Type de ZAI
preferred label: Dike @en
broader: PAI culture ou loisirs

Dolmen
type: Type de ZAI
type: Concept
definition: Monument mégalithique formé d'une grande pierre plate posée sur d'autres pierres dressées verticalement. Les allées couvertes sont incluses.
in scheme: Type de ZAI
broader: PAI culture ou loisirs

Espace public nommé
type: Type de ZAI
type: Concept
definition: Large espace découvert urbain désigné par un toponyme où aboutissent plusieurs rues, fermé Ã la circulation automobile, constituant un lieu remarquable : place, square, jardin, parc, parc communal, parc intercommunal, parc départemental, parc interdépartemental. Seuls les espaces publics possédant un toponyme sont retenus. Les parcs Ã vocation commerciale sont exclus (voir la valeur 'Parc de loisirs'), de même que les parcs naturels (réserves, parcs nationaux, parcs naturels régionaux) qui sont traités en PAI_ESPACE_NATUREL.
in scheme: Type de ZAI
preferred label: Named public area @en
broader: PAI culture ou loisirs

Habitation troglodytique
type: Type de ZAI
type: Concept
definition: Excavation naturelle ou creusée dans le roc (caverne, grotte), habitée ou anciennement habitée.
in scheme: Type de ZAI
preferred label: Cliff dwelling @en
broader: PAI culture ou loisirs

Maison du parc
type: Type de ZAI
type: Concept
definition: Bâtiment ouvert au public et géré par un Parc National ou Régional.
in scheme: Type de ZAI
preferred label: Park center @en
broader: PAI culture ou loisirs

Menhir
type: Type de ZAI
type: Concept
definition: Pierre allongée, dressée verticalement. Les alignements en cromlech sont inclus.
in scheme: Type de ZAI
broader: PAI culture ou loisirs

Musée
type: Type de ZAI
type: Concept
definition: Établissement ouvert au public exposant une grande collection d'objets, de documents, etc., relatifs aux arts et aux sciences et pouvant servir Ã leur histoire. Sont inclus : tous les musées controlés ou supervisés par le ministère de la Culture (musées nationaux, classés, controlés,etc.), les musées relevant de certains ministères techniques ou de l'assistance publique (musée de l'armée, de la marine), les musées privés ou associatifs ayant une grande notoriété, les écomusées.
in scheme: Type de ZAI
preferred label: Museum @en
broader: PAI culture ou loisirs

Parc des expositions
type: Type de ZAI
type: Concept
definition: Lieu d'exposition ou de culture : centre culturel, parc des expositions.
in scheme: Type de ZAI
preferred label: Fairground @en
broader: PAI culture ou loisirs

Parc de loisirs
type: Type de ZAI
type: Concept
definition: Parc Ã caractère commercial spécialement aménagé pour les loisirs : centre permanent de jeux, parc d'attractions, parc de détente, centre de loisirs. Seuls les parcs dont la superficie excède 10 ha et dotés d'équipements conséquents sont inclus. Les parcs publics (jardins, parcs communaux, départementaux) sont exclus (voir la valeur 'espace public').
in scheme: Type de ZAI
preferred label: Leisure park @en
broader: PAI culture ou loisirs

Parc zoologique
type: Type de ZAI
type: Concept
definition: Parc ouvert au public, où il est possible de voir des animaux sauvages vivant en captivité ou en semi-liberté. Tous les parcs ouverts au public sont inclus.
in scheme: Type de ZAI
preferred label: Zoological park @en
broader: PAI culture ou loisirs

Refuge
type: Type de ZAI
type: Concept
definition: Refuge, refuge gardé, abri de montagne nommé.
in scheme: Type de ZAI
preferred label: Shelter @en
broader: PAI culture ou loisirs

Vestiges archéologiques
type: Type de ZAI
type: Concept
definition: Vestiges archéologiques, fouilles, tumulus, oppidum.
in scheme: Type de ZAI
preferred label: Archeological ruins @en
broader: PAI culture ou loisirs

Village de vacances
type: Type de ZAI
type: Concept
definition: Établissement de vacances comprenant des équipements sportifs ou de détente conséquents dont le gestionnaire est privé ou public: village de vacanaces, colonie de vacances. Les hôtels et les 'camps de vacances' sont exclus, ainsi que les établissements dont la capacité de rpise en charge est inférieure Ã 300 personnes.
in scheme: Type de ZAI
preferred label: Holiday village @en
broader: PAI culture ou loisirs

Arbre
type: Type de ZAI
type: Concept
definition: Arbre nommé isolé, arbre remarquable.
in scheme: Type de ZAI
preferred label: Tree @en
broader: PAI espace naturel

Lieu-dit non habité
type: Type de ZAI
type: Concept
definition: Lieu-dit quelconque, dont le nom est généralement attaché Ã des terres : lieu-dit non habité, plantation, espace cultivé.
in scheme: Type de ZAI
preferred label: Non inhabited local placename @en
broader: PAI espace naturel

Parc
type: Type de ZAI
type: Concept
definition: Espace réglementé, généralement libre d'accès pour le public et où la nature fait l'objet d'une protection spéciale : jardin, parc municipal, parc intercommunal, parc départemental, parc interdépartemental, parc naturel régional, parc national, réserve naturelle, parc marin. Les parcs Ã vocation commerciale ne sont pas pris en compte.
in scheme: Type de ZAI
preferred label: Park @en
broader: PAI espace naturel

Pare-feu
type: Type de ZAI
type: Concept
definition: Dispositif destiné Ã empêcher la propagation d'un incendie (généralement, ouverture pratiquée dans le massif forestier menacé).
in scheme: Type de ZAI
preferred label: Fire-break @en
broader: PAI espace naturel

Point de vue
type: Type de ZAI
type: Concept
definition: Endroit d'où l'on jouit d'une vue pittoresque : point de vue, table d'orientation, belvédè. Seuls les points de vue aménagés (table d'orientation, bancs,etc.) sont inclus.
in scheme: Type de ZAI
preferred label: Viewpoint @en
broader: PAI espace naturel

Établissement d'enseignement maternel ou primaire
type: Type de ZAI
type: Concept
definition: Établissement consacré Ã l'enseignement maternel et primaire : école primaire, école maternelle, groupe scolaire, Institut Médico-Pédagogique (I.M.P.). Tous les établissements d'enseignement primaire, publics, confessionnels ou privés, ayant un contrat simple ou d'association avec l'État sont inclus. Les crèches sont exclues.
in scheme: Type de ZAI
preferred label: Nursery or elementary school @en
broader: PAI science ou enseignement

Établissement d'enseignement secondaire
type: Type de ZAI
type: Concept
definition: Établissement consacré Ã l'enseignement secondaire : collège, lycée, Centre d'Aide par le Travail (C.A.T.), Formation Professionnelle des Adultes (F.P.A.), Institut Médico-Professionnel (I.M.Pro.). Tous les établissements d'enseignement secondaire publics, confessionnels ou privés, ayant un contrat simple ou d'association avec l'État sont inclus.
in scheme: Type de ZAI
preferred label: Secondary education school @en
broader: PAI science ou enseignement

Établissement d'enseignement supérieur
type: Type de ZAI
type: Concept
definition: Établissement consacré Ã l'enseignement supérieur : faculté, centre universitaire, institut, grande école,etc. Tous les établissements d'enseignement supérieur publics, confessionnels ou privés, ayant un contrat simple ou d'association avec l'État sont inclus. Les cours du soir, les cités et les restaurants universitaires sont exclus.
in scheme: Type de ZAI
preferred label: Postsecondary education school @en
broader: PAI science ou enseignement

Établissement scientifique ou technique
type: Type de ZAI
type: Concept
definition: Établissement scientifique ou technique nommé: centre de recherche, laboratoire, observatoire, station scientifique.
in scheme: Type de ZAI
preferred label: Scientific or technological center @en
broader: PAI science ou enseignement

Usine de traitement des eaux
type: Type de ZAI
type: Concept
definition: Établissement comprenant des installations destinées Ã rendre l'eau propre Ã la consommation (usine de traitement des eaux) ou Ã épurer des eaux usées avant leur rejet dans la nature (stations d'épuration, de lagunage) : usine de traitement des eaux, station d'épuration, station de lagunage. Les stations d'épuration et de lagunage sont incluses. Les stations traitant l'eau afin de la rendre propre Ã la consommation sont incluses lorsqu'elles comprennent des installations conséquentes (usines comprenant bassins, filtrages, traitements mécaniques). Sont exclues les stations lorsqu'il s'agit uniquement d'un traitement chimique d'appoint effectué au niveau d'un captage ou d'un réservoir. Les stations de relèvement sont également exclues.
in scheme: Type de ZAI
preferred label: Water treatment plant @en
broader: PAI gestion des eaux

Installation d'aquaculture
type: Type de ZAI
type: Concept
definition: Site aménagé pour l'élevage piscicole ou la culture d'espèces animales marines (coques, coquilles Saint-Jacques, huîtres, moules, palourdes,etc.) : bouchot, parc Ã huîtres, zone conchylicole, zone mytilicole, zone ostréicole. Toutes les zones de plus de 3 ha possédant des installations fixes de pêche et délimitées par des alignements de pieux, les parcs Ã huîtres, les bassins. Les installations de pêche au carrelet sont exclues.
in scheme: Type de ZAI
preferred label: Aquaculture facilities @en
broader: PAI industriel ou commercial

Centrale électrique
type: Type de ZAI
type: Concept
definition: Usine où l'on produit de l'énergie électrique : centrale hydroélectrique, centrale thermique, centrale nucléaire. Les centrales électriques souterraines sont exclues.
in scheme: Type de ZAI
preferred label: Power station @en
broader: PAI industriel ou commercial

Haras national
type: Type de ZAI
type: Concept
definition: Lieu ou établissement destiné Ã la reproduction de l'espèce chevaline, Ã l'amélioration des races de chevaux par la sélection des étalons. Tous les haras nationaux sont inclus. L'enceinte comprend l'ensemble des installations (manège, écuries, piste d'entraînement,etc.).
in scheme: Type de ZAI
preferred label: Ranch @en
broader: PAI industriel ou commercial

Marais salants
type: Type de ZAI
type: Concept
definition: Zone constituée de bassins creusés Ã proximité des côtes pour extraire le sel de l'eau de mer par évaporation. Les zones de marais salants de moins de 3 ha sont exclues. Les anciens marais salants qui ne sont plus en activité sont exclus.
in scheme: Type de ZAI
preferred label: Salt evaporator @en
broader: PAI industriel ou commercial

Marché
type: Type de ZAI
type: Concept
definition: Tout ensemble construit dont la finalité est la commercialisation de gros ou de détail de denrées alimentaires : marché couvert, marché d'intérêt national, marché d'intérêt régional, halle, foire, zone d'exposition Ã caractère permanent, criée couverte.
in scheme: Type de ZAI
preferred label: Market @en
broader: PAI industriel ou commercial

Mine
type: Type de ZAI
type: Concept
definition: Lieu d'où l'on extrait des minerais : mine de houille, mine de lignite, crassier, entrée de mine, terril. Les mines Ã ciel ouvert de plus de 10 ha sont incluses. Les mines souterraines sont exclues.
in scheme: Type de ZAI
broader: PAI industriel ou commercial

Usine
type: Type de ZAI
type: Concept
definition: Établissement dominé par une activité industrielle (fabrication d'objets ou de produits, transformation ou conservation de matières premières) : atelier, fabrique, manufacture, mine avec infrastructure bâtie, usine, scierie. Les sites dont la superficie est inférieure Ã 5 ha sont généralement exclus.
in scheme: Type de ZAI
preferred label: Factory @en
broader: PAI industriel ou commercial

Zone industrielle
type: Type de ZAI
type: Concept
definition: Regroupement d'activités de production sur l'initiative des collectivités locales ou d'organismes parapublics (chambres de commerce et d'industrie) et portant un nom : zone artisanale, zone industrielle. Les sites dont la superficie est inférieure Ã 5 ha sont généralement exclus.
in scheme: Type de ZAI
preferred label: Industrial area @en
broader: PAI industriel ou commercial

Croix
type: Type de ZAI
type: Concept
definition: Monument religieux : croix, calvaire, vierge, statue religieuse.
in scheme: Type de ZAI
preferred label: Cross @en
broader: PAI religieux

Édifice religieux catholique ou orthodoxe
type: Type de ZAI
type: Concept
definition: Bâtiment réservé Ã l'exercice du culte catholique ou orthodoxe : église, cathédrale, basilique, chapelle, abbaye, oratoire.
in scheme: Type de ZAI
preferred label: Catholic or orthodox building @en
broader: PAI religieux

Édifice religieux protestant
type: Type de ZAI
type: Concept
definition: Bâtiment réservé Ã l'exercice du culte protestant : temple (protestant), église réformée.
in scheme: Type de ZAI
preferred label: Protestant building @en
broader: PAI religieux

Édifice religieux israélite
type: Type de ZAI
type: Concept
definition: Bâtiment réservé Ã l'exercice du culte israélite : synagogue.
in scheme: Type de ZAI
preferred label: Jewish religious building @en
broader: PAI religieux

Édifice religieux islamique
type: Type de ZAI
type: Concept
definition: Bâtiment réservé Ã l'exercice du culte islamique : mosquée.
in scheme: Type de ZAI
preferred label: Moslem religious building @en
broader: PAI religieux

Édifice religieux divers
type: Type de ZAI
type: Concept
definition: Bâtiment réservé Ã l'exercice d'un culte religieux autre que chrétien, islamique ou israélite : temple bouddhiste, temple hindouiste.
in scheme: Type de ZAI
preferred label: Other religious building @en
broader: PAI religieux

Tombeau
type: Type de ZAI
type: Concept
definition: Cimetière, tombe ou tombeau nommé : cimetière, tombe, tombeau, ossuaire, funérarium.
in scheme: Type de ZAI
preferred label: Tomb @en
broader: PAI religieux

Établissement hospitalier
type: Type de ZAI
type: Concept
definition: Établissement public ou privé qui reçoit ou traite pendant un temps limité les malades, les blessés et les femmes en couches : hôpital, sanatorium, hospice, centre de soins, dispensaire, hôpital de jour, hôpital psychiatrique, etc. Tous les établissements assurant les soins et l'hébergement ou les soins seulement sont inclus. Les maisons de retraite ne possédant pas de centre de soins sont exclues.
in scheme: Type de ZAI
preferred label: Healthcare facility @en
broader: PAI santé

Établissement thermal
type: Type de ZAI
type: Concept
definition: Établissement où l'on utilise les eaux médicinales (eaux minérales, chaudes ou non) : établissement thermal, centre de thalassothérapie. Seuls sont inclus les établissements agréés par la Sécurité Sociale.
in scheme: Type de ZAI
preferred label: Health resort @en
broader: PAI santé

Hôpital
type: Type de ZAI
type: Concept
definition: Établissement public ou privé, où sont effectués tous les soins médicaux et chirurgicaux lourds et/ou de longue durée, ainsi que les accouchements : hôpital, CHU, hôpital militaire, clinique.
in scheme: Type de ZAI
preferred label: Hospital @en
broader: PAI santé

Golf
type: Type de ZAI
type: Concept
definition: Terrain ouvert au public et consacré Ã la pratique du golf. Les terrains de moins de 9 trous et les minigolfs sont exclus.
in scheme: Type de ZAI
preferred label: Golf course @en
broader: PAI sport

Hippodrome
type: Type de ZAI
type: Concept
definition: Lieu ouvert au public et consacré aux courses de chevaux. Seuls les hippodromes possédant des aménagements conséquents (tribunes, bâtiments spécifiques) sont inclus.
in scheme: Type de ZAI
preferred label: Racecourse @en
broader: PAI sport

Piscine
type: Type de ZAI
type: Concept
definition: Grand bassin de natation, et ensemble des installations qui l'entourent : piscine couverte, piscine découverte. Toutes les piscines ouvertes au public et ayant un bassin au moins de 25 m ou plus sont incluses. Les piscines des centres de vacances ou des hôtels sont exclues (voir la classe TERRAIN_SPORT).
in scheme: Type de ZAI
preferred label: Swimming-pool @en
narrow match: BassinDeNatation
broader: PAI sport

Stade
type: Type de ZAI
type: Concept
definition: Grande enceinte, terrain aménagé pour la pratique des sports, et le plus souvent entouré de gradins, de tribunes : stade, terrain de sports, vélodrome découvert, circuit auto-moto, complexe sportif pluridisciplinaire. Seules les enceintes incluant des aménagements conséquents (piste 'construite', tribunes,etc.) sont incluses. Les terrains d'entraînement incluant seulement 2 ou 3 terrains de football et de petits vestiaires sont exclus (voir aussi la classe TERRAIN_SPORT).
in scheme: Type de ZAI
preferred label: Stadium @en
broader: PAI sport

Aérodrome
type: Type de ZAI
type: Concept
definition: Tout terrain ou plan d'eau spécialement aménagé pour l'atterrissage, le décollage et les manoeuvres des aéronefs y compris les installations annexes qu'il peut comporter pour les besoins du trafic et le service des aéronefs : aérodrome militaire, héliport militaire.Ne sont pas pris en compte les aéro-clubs, les terrains de vol Ã voile, les pistes d'ULM.
in scheme: Type de ZAI
preferred label: Aerodrome @en
broader: PAI transport

Aéroport international
type: Type de ZAI
type: Concept
definition: Aérodrome de statut international sur lequel ont été prévues des installations en vue de l'abri, de l'entretien ou de la répartition des aéronefs, ainsi que pour la réception, l'embarquement et le débarquement des passagers, le chargement et le déchargement des marchandises.
in scheme: Type de ZAI
preferred label: International airport @en
broader: PAI transport

Aéroport
type: Type de ZAI
type: Concept
definition: Aérodrome sur lequel ont été prévues des installations en vue de l'abri, de l'entretien ou de la répartition des aéronefs, ainsi que pour la réception, l'embarquement et le débarquement des passagers, le chargement et le déchargement des marchandises.
in scheme: Type de ZAI
preferred label: Airport @en
broader: PAI transport

Aire de service
type: Type de ZAI
type: Concept
definition: Espace aménagé Ã l'écart des chaussées, notamment des autoroutes, pour permettre aux usagers de se ravitailler en carburant. Emprise de l'aire. Les contours de la surface ne s'appuient jamais sur des tronçons de route (qui représentent l'axe des chaussées).
in scheme: Type de ZAI
preferred label: Service area @en
broader: PAI transport

Aire de repos
type: Type de ZAI
type: Concept
definition: Espace aménagé (présence d'un point d'eau obligatoire) Ã l 'écart des chaussées, notamment des autoroutes, pour permettre aux usagers de s'arrêter et de se reposer.Emprise de l'aire. Les contours de la surface ne s'appuient jamais sur des tronçons de route qui représentent l'axe des chaussées.
in scheme: Type de ZAI
preferred label: Rest area @en
broader: PAI transport

Barrage
type: Type de ZAI
type: Concept
definition: Obstacle artificiel placé en travers d'un cours d'eau : barrage, écluse, vanne.
in scheme: Type de ZAI
narrow match: Barrage
narrow match: Ecluse
broader: PAI transport

Carrefour
type: Type de ZAI
type: Concept
definition: Noeud du réseau routier : carrefour routier, échangeur, rond-point.
in scheme: Type de ZAI
preferred label: Crossroads @en
broader: PAI transport

Chemin
type: Type de ZAI
type: Concept
definition: Voie de communication non routière : allée, chemin, laie forestière, sentier.
in scheme: Type de ZAI
preferred label: Trail @en
broader: PAI transport

Échangeur
type: Type de ZAI
type: Concept
definition: Noeud du réseau routier Ã chaussées séparées. Échangeur autoroutier portant un nom.
in scheme: Type de ZAI
preferred label: Interchange @en
broader: PAI transport

Gare routière
type: Type de ZAI
type: Concept
definition: Ensemble des installations destinées Ã l'embarquement et au débarquement de voyageurs en car ou en bus en un point déterminé. Ne sont pas retenues les gares routières des bus de ville, des bus scolaires, de la RATP et les dépôts de bus.
in scheme: Type de ZAI
preferred label: Bus station @en
broader: PAI transport

Gare de voyageurs
type: Type de ZAI
type: Concept
definition: Établissement ferroviaire ou de transport par câble assurant avec ou sans personnel un service commercial de voyageurs : gare, station, point d'arrêt, station réseau ferré urbain, gare téléphérique. Toutes les gares et arrêts ferroviaires en service sont inclus.
in scheme: Type de ZAI
preferred label: Passengers station @en
broader: PAI transport

Gare de voyageurs et fret
type: Type de ZAI
type: Concept
definition: Établissement ferroviaire assurant un service commercial de voyageurs et de marchandises.(Uniquement le bâtiment principal ouvert au public.)
in scheme: Type de ZAI
preferred label: Passengers and goods station @en
broader: PAI transport

Gare de fret
type: Type de ZAI
type: Concept
definition: Établissement ferroviaire assurant un service commercial de marchandises : gare de fret, point de desserte. Le fret aérien ou maritime est exclu.
in scheme: Type de ZAI
preferred label: Goods station @en
broader: PAI transport

Infrastructure routière
type: Type de ZAI
type: Concept
definition: Élément du réseau routier ne figurant ni en attribut d'un objet 'tronçon de route' ni avec la valeur d'attribut 'carrefour' : route, aire de péage, aire de repos.
in scheme: Type de ZAI
preferred label: Road transport infrastructure @en
broader: PAI transport

Parking
type: Type de ZAI
type: Concept
definition: Une aire de stationnement ou parking est une zone aménagée pour le stationnement des véhicules : aire de stationnement, parking, parking souterrain, parking Ã étages. Tous les parkings publics nommés de plus de 25 places sont inclus qu'ils soient souterrains ou aériens (ex. parkings municipaux), Les parkings de plus de 25 places associés Ã des services de transport (gares, aéroports) sont retenus même s'ils n'ont pas de nom propre. Les parkings d'aires de repos ou de service ne sont pas retenus (voir les valeur 'Aire de repos' et 'Aire de service'). Le parkings appartenant Ã des établissements purement commerciaux (ex. parking de supermarché) sont exclus (pour ces derniers, voir aussi la classe 'Surface de route'). Un Parking est un objet ponctuel situé au centre de l'aire de stationnement, ou Ã l'entrée pour les parkings souterrains. Il est généralement associé Ã une surface pour des parkings aériens de plus de 5 ha.
in scheme: Type de ZAI
preferred label: Car park @en
broader: PAI transport

Barrière de péage
type: Type de ZAI
type: Concept
definition: Barrière de péage. Toutes les barrières de péage sont représentées, qu'elles soient ou non accompagnées d'un élargissement de la chaussée ou d'un bâtiment : péage d'autoroute, de pont, de route.
in scheme: Type de ZAI
preferred label: Toll-gate @en
related match: Péage
broader: PAI transport

Port
type: Type de ZAI
type: Concept
definition: Abri naturel ou artificiel aménagé pour recevoir les navires, pour l'embarquement et le débarquement de leur chargement : port de plaisance, port de pêche, port national, port privé, port international, port militaire.
in scheme: Type de ZAI
preferred label: Harbor @en
broader: PAI transport

Rond-point
type: Type de ZAI
type: Concept
definition: Rond-point, place de forme circulaire, ovale ou semi-circulaire, ou carrefour giratoire. Un giratoire est formé d'un anneau central qui permet aux usagers de prendre n'importe quelle direction, y compris de faire un demi-tour. Seuls les ronds-points nommés sont retenus.
in scheme: Type de ZAI
preferred label: Roundabout @en
broader: PAI transport

Station de métro
type: Type de ZAI
type: Concept
definition: Station où il est possible d'accéder au réseau du métro. On saisit un seul objet 'Station de métro' même s'il y a plusieurs entrées distinctes, éventuellement plusieurs ponctuels 'Station de métro' pour les correspondances importantes (ex : Bastille) mais un seul ponctuel pour une station de métro qui n'est pas une correspondance.
in scheme: Type de ZAI
preferred label: Underground station @en
broader: PAI transport

Voie ferrée
type: Type de ZAI
type: Concept
definition: Voie ferrée nommée
in scheme: Type de ZAI
preferred label: Railway line @en
broader: PAI transport

Grange
type: Type de ZAI
type: Concept
definition: Construction légère : abri, baraquement, cabane, grange, hangar.
in scheme: Type de ZAI
preferred label: Barn @en
broader: PAI zone d'habitation

Lieu-dit habité
type: Type de ZAI
type: Concept
definition: Lieu-dit habité caractérisé par un nom.
in scheme: Type de ZAI
preferred label: Inhabited local placename @en
broader: PAI zone d'habitation

Moulin
type: Type de ZAI
type: Concept
definition: Moulin ou ancien moulin Ã eau.
in scheme: Type de ZAI
preferred label: Mill @en
broader: PAI zone d'habitation

Quartier
type: Type de ZAI
type: Concept
definition: Quartier nommé : cité, faubourg, lotissement.
in scheme: Type de ZAI
preferred label: District @en
broader: PAI zone d'habitation

Amer
type: Type de ZAI
type: Concept
definition: Point de repère visible de la mer : amer, bouée, balise, phare, feu, tourelle.
in scheme: Type de ZAI
preferred label: Seamark @en
broader: PAI hydrographie

Baie
type: Type de ZAI
type: Concept
definition: Espace marin pénétrant entre les terres : anse, baie, calanque, crique, golfe.
in scheme: Type de ZAI
preferred label: Bay @en
broader: PAI hydrographie

Banc
type: Type de ZAI
type: Concept
definition: En mer ou sur un fleuve, relief sous-marin non rocheux représentant un danger potentiel pour la navigation: bancs, hauts-fonds.
in scheme: Type de ZAI
preferred label: Bank @en
broader: PAI hydrographie

Canal
type: Type de ZAI
type: Concept
definition: Cours d'eau artificiel : ancien canal, bief, canal, fossé, rigole.
in scheme: Type de ZAI
preferred label: Channel @en
broader: PAI hydrographie

Embouchure
type: Type de ZAI
type: Concept
definition: Embouchure d'un fleuve : delta, embouchure, estuaire.
in scheme: Type de ZAI
preferred label: Mouth @en
broader: PAI hydrographie

Espace maritime
type: Type de ZAI
type: Concept
definition: Espace maritime, mer, océan, passe.
in scheme: Type de ZAI
preferred label: Maritime feature @en
broader: PAI hydrographie

Glacier
type: Type de ZAI
type: Concept
definition: Nom d'un glacier ou d'un détail relatif Ã un glacier : crevasse, glacier, moraine, névé, sérac.
in scheme: Type de ZAI
broader: PAI hydrographie

Lac
type: Type de ZAI
type: Concept
definition: Étendue d'eau terrestre : bassin, étang, lac, mare.
in scheme: Type de ZAI
preferred label: Lake @en
broader: PAI hydrographie

Marais
type: Type de ZAI
type: Concept
definition: Zone humide : marais, marécage, saline.
in scheme: Type de ZAI
preferred label: Marsh @en
broader: PAI hydrographie

Pêcherie
type: Type de ZAI
type: Concept
definition: Zone d'activité aquacole : bouchot, parc Ã huîtres, pêcherie.
in scheme: Type de ZAI
preferred label: Aquaculture area @en
broader: PAI hydrographie

Perte
type: Type de ZAI
type: Concept
definition: Lieu où disparaît, où se perd un cours d'eau, qui réapparaît ensuite, en formant une résurgence, après avoir effectué un trajet souterrain.
in scheme: Type de ZAI
preferred label: Loss @en
broader: PAI hydrographie

Point d'eau
type: Type de ZAI
type: Concept
definition: Tout point d'eau naturel ou artificiel : captage, citerne, fontaine, puits, résurgence, source.
in scheme: Type de ZAI
preferred label: Waterhole @en
broader: PAI hydrographie

Rivière
type: Type de ZAI
type: Concept
definition: Cours d'eau: fleuve, rivière, ruisseau, torrent.
in scheme: Type de ZAI
preferred label: River @en
broader: PAI hydrographie

Aérogare
type: Type de bâtiment
type: Concept
definition: Ensemble des bâtiments d'un aéroport réservés aux voyageurs et aux marchandises.
in scheme: Type de bâtiment
preferred label: Air terminal @en

Arc de triomphe
type: Type de bâtiment
type: Concept
definition: Portique monumental : arc de triomphe, porte de ville.
in scheme: Type de bâtiment
preferred label: Triumphal arch @en

Arène
type: Type de bâtiment
type: Concept
definition: Vaste édifice Ã gradins, de forme en partie ou totalement ronde ou elliptique : amphithéâtre, arène, théâtre antique, théâtre de plein air.
in scheme: Type de bâtiment
preferred label: Arena @en
alternative label: Théâtre antique
alternative label: Roman theater @en

Bâtiment religieux
type: Type de bâtiment
type: Concept
definition: Bâtiment réservé Ã l’exercice d’un culte religieux, autre qu’une chapelle ou qu’une église : mosquée, synagogue, temple.
in scheme: Type de bâtiment
preferred label: Religious building @en

Bâtiment sportif
type: Type de bâtiment
type: Concept
definition: Bâtiment réservé Ã la pratique sportive : gymnase, piscine couverte, salle de sport, tennis couvert.
in scheme: Type de bâtiment
preferred label: Sports building @en

Chapelle
type: Type de bâtiment
type: Concept
definition: Petit édifice religieux catholique de forme caractéristique.
in scheme: Type de bâtiment
preferred label: Chapel @en

Château
type: Type de bâtiment
type: Type de ZAI
type: Concept
definition: Habitation ou ancienne habitation féodale, royale ou seigneuriale: château, château fort, citadelle, tour. Le lieu-dit, toujours nommé, peut ne pas être habité ou ne plus être habité mais n'est pas totalement en ruines.
in scheme: Type de bâtiment
in scheme: Type de ZAI
preferred label: Castle @en
broader: PAI zone d'habitation

Église
type: Type de bâtiment
type: Concept
definition: Édifice religieux catholique de forme caractéristique : basilique, cathédrale, église.
in scheme: Type de bâtiment
preferred label: Church @en

Fort
type: Type de bâtiment
type: Concept
definition: Ouvrage militaire : blockhaus, casemate, fort, ouvrage fortifié.
in scheme: Type de bâtiment
alternative label: Blockhaus
alternative label: Blockhouse @en
alternative label: Casemate

Gare
type: Type de bâtiment
type: Concept
definition: Bâtiment servant Ã l'embarquement et au débarquement des voyageurs en train.
in scheme: Type de bâtiment
preferred label: Station @en

Mairie
type: Type de bâtiment
type: Concept
definition: Édifice où se trouvent les services de l'administration municipale, appelé aussi hôtel de ville.
in scheme: Type de bâtiment
in scheme: Type de ZAI
preferred label: Town-hall @en
alternative label: Hôtel de ville
alternative label: City hall @en
broader: PAI administratif ou militaire

Monument
type: Type de bâtiment
type: Concept
definition: Monument commémoratif quelconque, sans caractère religieux particulier : monument, statue, stèle. Les arcs de triomphe sont exclus.
in scheme: Type de bâtiment
in scheme: Type de ZAI
broader: PAI culture ou loisirs

Péage
type: Type de bâtiment
type: Concept
definition: Bâtiment où sont perçus les droits d‘usage.
in scheme: Type de bâtiment
preferred label: Toll @en
related match: Peage

Préfecture
type: Type de bâtiment
type: Concept
definition: Bâtiment où sont installés les services préfectoraux.
in scheme: Type de bâtiment
in scheme: Type de ZAI
preferred label: Prefecture @en
broader: PAI administratif ou militaire

Sous-préfecture
type: Type de bâtiment
type: Concept
definition: Bâtiment où sont les bureaux du sous-préfet: chef-lieu d’arrondissement.
in scheme: Type de bâtiment
in scheme: Type de ZAI
preferred label: Subprefecture @en
broader: PAI administratif ou militaire

Tour
type: Type de bâtiment
type: Concept
definition: Bâtiment remarquable dans le paysage par sa forme élevée : donjon, moulin Ã vent, tour, tour de contrôle.
in scheme: Type de bâtiment
preferred label: Tower @en
alternative label: Donjon
alternative label: Moulin
alternative label: Mill @en

Tribune
type: Type de bâtiment
type: Concept
definition: Tribune de terrain de sport (stade, hippodrome, vélodrome,…).
in scheme: Type de bâtiment
preferred label: Stand @en

Bâtiment agricole
type: Type de bâtiment
type: Concept
definition: Bâtiment réservé Ã des activités agricoles : bâtiment d'élevage industriel, hangar agricole (grand), minoterie.
in scheme: Type de bâtiment
preferred label: Farm building @en

Bâtiment ou zone Ã caractère commercial
type: Type de ZAI
type: Type de bâtiment
type: Concept
definition: Bâtiment ou zone de grande surface réservé Ã des activités commerciales : centre commercial, hypermarché, magasin (grand, isolé), parc des expositions (bâtiment), zone Ã caractère commercial.
in scheme: Type de bâtiment
in scheme: Type de ZAI
preferred label: Commercial building or area @en
broader: PAI industriel ou commercial

Bâtiment ou zone Ã caractère industriel
type: Type de bâtiment
type: Type de ZAI
type: Concept
definition: Bâtiment ou zone réservé Ã des activités industrielles non distingué de façon spécifique : centre de recherche, dépôt, coopérative (vinicole, céréaliè'), champignonniè, élevage avicole, haras, abattoir, déchèterie, atelier (grand), auvent de quai de gare), auvent de péage, bâtiment industriel (grand), centrale électrique (bâtiment), construction technique, entrepôt, hangar industriel (grand), scierie, usine.
in scheme: Type de bâtiment
in scheme: Type de ZAI
preferred label: Industrial building or area @en
broader: PAI industriel ou commercial

Serre
type: Type de bâtiment
type: Concept
definition: Abri clos Ã parois translucides destiné Ã protéger les végétaux du froid : jardinerie, serre.
in scheme: Type de bâtiment
preferred label: Glass-house @en

Silo
type: Type de bâtiment
type: Concept
definition: Réservoir, qui chargé par le haut se vide par le bas, et qui sert de dépôt, de magasin, etc. Le silo est exclusivement destiné aux produits agricoles : cuve Ã vin, silo.
in scheme: Type de bâtiment

Construction légère
type: Type de bâtiment
type: Concept
definition: Structure légère non attachée au sol par l’intermédiaire de fondations (cabanes, abris de jardins…) ou bâtiment quelconque ouvert sur au moins un côté (préaux, auvents, tribunes).
in scheme: Type de bâtiment
preferred label: Light construction @en

Château d'eau
type: Type de réservoir
type: Concept
definition: Réservoir d’eau construit en hauteur pour surélever le niveau de l’eau par rapport aux constructions.
in scheme: Type de réservoirs
preferred label: Water tower @en

Réservoir d'eau
type: Type de réservoir
type: Concept
definition: Réservoirs d’eau et châteaux d’eau au sol dans lesquels la réserve d’eau est située au niveau du sol.
in scheme: Type de réservoirs
preferred label: Water-tank @en

Réservoir industriel
type: Type de réservoir
type: Concept
definition: Réservoir de matière première industrielle : gazomètre, réservoir d’hydrocarbure, réservoir de matériaux de construction, réservoir industriel.
in scheme: Type de réservoirs
preferred label: Tank @en

Piste de sport
type: Type de terrain de sport
type: Concept
definition: Large piste en plein air réservée Ã la course : autodrome (piste), circuit automoto (piste), cynodrome (piste), hippodrome (piste), vélodrome (piste).
in scheme: Type de terrain de sport
preferred label: Sports track @en

Terrain de tennis
type: Type de terrain de sport
type: Concept
definition: Terrain spécialement aménagé pour la pratique du tennis.
in scheme: Type de terrain de sport
preferred label: Tennis court @en

Bassin de natation
type: Type de terrain de sport
type: Concept
definition: Bassin de natation d’une piscine découverte : bassin de natation, piscine (découverte).
in scheme: Type de terrain de sport
preferred label: Swimming-pool @en
broad match: Piscine

Barrage
type: Type de franchissement
type: Type de construction
type: Concept
definition: Ouvrage établi en travers du lit d’un cours d’eau et créant une dénivellation du plan d’eau entre l’amont et l’aval : barrage, vanne.
in scheme: Type de construction
in scheme: Type de franchissement
preferred label: Dam @en
broad match: Barrage

Mur anti-brui
type: Type de construction
type: Concept
definition: Mur destiné Ã protéger les riverains d’une voie de communication du bruit qu’elle engendre.
in scheme: Type de construction
preferred label: Sound attenuation barrier @en

Ruines
type: Type de construction
type: Concept
definition: Bâtiment ou construction en ruines.
in scheme: Type de construction
in scheme: Type de ZAI
preferred label: Ruins @en
broader: PAI zone d'habitation

Quai
type: Type de construction
type: Concept
definition: Muraille en maçonnerie ou enrochement, élevée le long d’un cours d’eau pour retenir les berges, pour empêcher les débordements. Rivage d’un port aménagé pour l’accostage des bateaux. Ouvrage en maçonnerie s’opposant Ã l’écoulement des eaux marines ou fluviales.
in scheme: Type de construction
preferred label: Wharf @en

Antenne
type: Type de construction
type: Concept
definition: Construction destinée Ã la réception ou Ã l'émission d'ondes électromagnétiques : antenne, pylône de télécommunication.
in scheme: Type de construction
preferred label: Antenna @en

Cheminée
type: Type de construction
type: Concept
definition: Construction destinée Ã l'émission de fumées ou de gaz.
in scheme: Type de construction
preferred label: Chimney @en

Éolienne
type: Type de construction
type: Concept
definition: Une éolienne est un dispositif permettant d'utiliser l'énergie éolienne pour produire de l'énergie mécanique ou bien de l'électricité.
in scheme: Type de construction
preferred label: Wind pump @en

Phare
type: Type de construction
type: Concept
definition: Tour élevée portant au sommet un foyer plus ou moins puissant destiné Ã guider les navires pendant la nuit.
in scheme: Type de construction
preferred label: Lighthouse @en

Torchère
type: Type de construction
type: Concept
definition: Canalisation verticale par laquelle s'échappent et brûlent les résidus gazeux d'une raffinerie.
in scheme: Type de construction
preferred label: Flare tower @en

Transformateur
type: Type de construction
type: Concept
definition: Bâtiment technique dont la fonction est de transformer un système de courants variables en un ou plusieurs autres systèmes de courants variables de même fréquence, mais d’intensité ou de tension généralement différentes.
in scheme: Type de construction
preferred label: Transformer @en

Dalle de protection
type: Type de construction
type: Concept
definition: Dalle (ou auvent) horizontale protégeant une voie de communication des chutes de pierres, des coulées de neige, ou protégeant le voisinage du bruit.
in scheme: Type de construction
preferred label: Protective wall @en

Écluse
type: Type de construction
type: Concept
definition: Ouvrage hydraulique formé essentiellement de portes munies de vannes destiné Ã retenir ou Ã lâcher l’eau selon les besoins : ascenseur Ã bateaux, cale sèche, écluse, radoub.
in scheme: Type de construction
preferred label: Lock @en
broad match: Barrage

Escalier monumental
type: Type de construction
type: Concept
definition: Escalier monumental.
in scheme: Type de construction
preferred label: Monumental stairs @en

Zone arborée
type: Type de végétation
type: Concept
definition: Espace peuplé d’arbres d’essence quelconque.
in scheme: Type de végétation
preferred label: Wooded area @en

Forêt fermée de feuillus
type: Type de végétation
type: Concept
definition: Espace peuplé d’arbres forestiers couvrant au moins 40% du sol, et composée de plus de 75% de feuillus (taux de couvert relatif).
in scheme: Type de végétation
preferred label: Closed hardwood forest @en
broader: ZoneArboree

Forêt fermée mixte
type: Type de végétation
type: Concept
definition: Espace peuplé d’arbres forestiers couvrant au moins 40% du sol, et composée de plus de 25% et moins de 75% de feuillus (taux de couvert relatif).
in scheme: Type de végétation
preferred label: Closed mixed forest @en
broader: ZoneArboree

Forêt fermée de conifères
type: Type de végétation
type: Concept
definition: Espace peuplé d’arbres forestiers couvrant au moins 40% du sol et composée essentiellement de conifères (soit un taux de couvert relatif de plus de 75%).
in scheme: Type de végétation
preferred label: Closed softwood forest @en
broader: ZoneArboree

Forêt ouverte
type: Type de végétation
type: Concept
definition: Espace peuplé d’arbres forestiers dont le couvert absolu est compris entre 10% et 40%.
in scheme: Type de végétation
preferred label: Open forest @en
broader: ZoneArboree

Peupleraie
type: Type de végétation
type: Concept
definition: Zone plantée de peupliers.
in scheme: Type de végétation
preferred label: Poplar plantation @en
broader: ZoneArboree

Haie
type: Type de végétation
type: Concept
definition: Clôture naturelle composée d’arbres, d’arbustes, d’épines ou de branchages et servant Ã limiter ou Ã protéger un champ. Alignement d’arbres ou plantation d’arbres fruitiers dont la largeur est inférieure Ã 25 m.
in scheme: Type de végétation
preferred label: Hedge @en
broader: ZoneArboree

Lande ligneuse
type: Type de végétation
type: Concept
definition: Végétation spontanée qui comprend une proportion importante de plantes ligneuses (bruyères, genêts, ajoncs, épineux divers, etc.) et semi ligneuses (fougères, phragmites…) dont la hauteur ne dépasse pas 5 mètres. Cette végétation ligneuse présente un couvert végétal d’au moins 25%.
in scheme: Type de végétation
preferred label: Woody heath @en
broader: ZoneArboree

Verger
type: Type de végétation
type: Concept
definition: Zone de plantation d’arbres hors peuplement forestier.
in scheme: Type de végétation
preferred label: Orchard @en
broader: ZoneArboree

Vigne
type: Type de végétation
type: Concept
definition: Zone de vignes.
in scheme: Type de végétation
preferred label: Vineyard @en
broader: ZoneArboree

Bois
type: Type de végétation
type: Concept
definition: Espace peuplé d’arbres forestiers couvrant au moins 40% du sol.
in scheme: Type de végétation
in scheme: Type de ZAI
preferred label: Wood @en
broader: ZoneArboree
broader: PAI espace naturel

Bananeraie
type: Type de végétation
type: Concept
definition: Plantation de bananiers.
in scheme: Type de végétation
preferred label: Banana plantation @en
broader: ZoneArboree

Mangrove
type: Type de végétation
type: Concept
definition: Dans les régions côtières intertropicales,formation végétale caractérisée par des forêts impénétrables de palétuviers qui fixent leurs fortes racines dans les baies aux eaux calmes où se déposent boues et limons.
in scheme: Type de végétation
preferred label: Mangrove forest @en
broader: ZoneArboree

Canne Ã sucre
type: Type de végétation
type: Concept
definition: Plantation de canne Ã sucre.
in scheme: Type de végétation
preferred label: Sugarcane plantation @en
broader: ZoneArboree

Levée
type: Type d'élément du relief
type: Concept
definition: Digue en terre (levée de terre) ou en maçonnerie de faible largeur : crassier, levée de terre, digue en terre, remblai, terril.
in scheme: Type d'élément du relief
preferred label: Levee @en

Mur de soutènement
type: Type d'élément du relief
type: Concept
definition: Mur épaulant un remblai, une terrasse.
in scheme: Type d'élément du relief
preferred label: Retaining wall @en

Talus
type: Type d'élément du relief
type: Concept
definition: Ligne de rupture de pente : crassier, déblai, remblai, talus.
in scheme: Type d'élément du relief
preferred label: Slope @en

Carrière
type: Type d'élément du relief
type: Concept
definition: Lieu d'où l'on extrait Ã ciel ouvert des matériaux de construction (pierre, roche) : carrière, sablière, ballastière, gravière. Grand talus marquant le front et la structure principale d’une carrière : gravière (talus), mine Ã ciel ouvert (talus), talus de carrière.
in scheme: Type d'élément du relief
in scheme: Type de ZAI
preferred label: Quarry @en
broader: PAI industriel ou commercial

Cap
type: Type d'élément du relief
type: Concept
definition: Prédominance dans le contour d'une côte : cap, pointe, promontoire.
in scheme: Type d'élément du relief
in scheme: Type de ZAI
preferred label: Cape @en
broader: PAI orographie

Cirque
type: Type d'élément du relief
type: Concept
definition: Dépression semi-circulaire, Ã bords raides.
in scheme: Type d'élément du relief
in scheme: Type de ZAI
broader: PAI orographie

Col
type: Type d'élément du relief
type: Concept
definition: Point de passage imposé par la configuration du relief : col, passage.
in scheme: Type d'élément du relief
in scheme: Type de ZAI
preferred label: Mountain pass @en
broader: PAI orographie

Crête
type: Type d'élément du relief
type: Concept
definition: Ligne de partage des eaux : crête, arête, ligne de faîte.
in scheme: Type d'élément du relief
in scheme: Type de ZAI
preferred label: Crest @en
broader: PAI orographie

Dépression
type: Type d'élément du relief
type: Concept
definition: Dépression naturelle du sol : cuvette, bassin fermé, dépression, doline.
in scheme: Type d'élément du relief
in scheme: Type de ZAI
preferred label: Depression @en
broader: PAI orographie

Dune
type: Type d'élément du relief
type: Concept
definition: Monticule de sable sur les bords de la mer.
in scheme: Type d'élément du relief
in scheme: Type de ZAI
broader: PAI orographie

Escarpement
type: Type d'élément du relief
type: Concept
definition: Escarpement du relief : barre rocheuse, escarpement rocheux, face abrupte, falaise.
in scheme: Type d'élément du relief
in scheme: Type de ZAI
preferred label: Escarpment @en
broader: PAI orographie

Gorge
type: Type d'élément du relief
type: Concept
definition: Vallée étroite et encaissée : canyon, cluse, défilé, gorge.
in scheme: Type d'élément du relief
in scheme: Type de ZAI
broader: PAI orographie

Grotte
type: Type d'élément du relief
type: Concept
definition: Grotte naturelle ou excavation : aven, cave, gouffre, grotte.
in scheme: Type d'élément du relief
in scheme: Type de ZAI
preferred label: Cave @en
broader: PAI orographie

Île
type: Type d'élément du relief
type: Concept
definition: Île, îlot ou presqu'île.
in scheme: Type d'élément du relief
in scheme: Type de ZAI
preferred label: Island @en
broader: PAI orographie

Isthme
type: Type d'élément du relief
type: Concept
definition: Bande de terre étroite entre deux mers, réunissant deux terres : cordon littoral, isthme.
in scheme: Type d'élément du relief
in scheme: Type de ZAI
preferred label: Isthmus @en
broader: PAI orographie

Montagne
type: Type d'élément du relief
type: Concept
definition: Désigne une montagne ou un massif de manière globale et non un sommet en particulier (voir sommet).
in scheme: Type d'élément du relief
in scheme: Type de ZAI
preferred label: Mountain @en
broader: PAI orographie

Pic
type: Type d'élément du relief
type: Concept
definition: Sommet pointu d'une montagne : aiguille, pic, piton.
in scheme: Type d'élément du relief
in scheme: Type de ZAI
preferred label: Peak @en
broader: PAI orographie

Plage
type: Type d'élément du relief
type: Concept
definition: Zone littorale marquée par le flux et le reflux des marées : grève, plage.
in scheme: Type d'élément du relief
in scheme: Type de ZAI
preferred label: Beach @en
broader: PAI orographie

Plaine
type: Type d'élément du relief
type: Concept
definition: Zone de surface terrestre caractérisée par une relative planéité : plaine, plateau.
in scheme: Type d'élément du relief
in scheme: Type de ZAI
preferred label: Plain @en
broader: PAI orographie

Récif
type: Type d'élément du relief
type: Concept
definition: Rocher situé en mer ou dans un fleuve, mais dont une partie, faiblement émergée, peut constituer un obstacle ou un repère : brisant, récif, rocher marin.
in scheme: Type d'élément du relief
in scheme: Type de ZAI
preferred label: Reef @en
broader: PAI orographie

Rochers
type: Type d'élément du relief
type: Concept
definition: Zone ou détail caractérisé par une nature rocheuse mais non verticale : chaos, éboulis, pierrier, rocher.
in scheme: Type d'élément du relief
in scheme: Type de ZAI
preferred label: Rocks @en
broader: PAI orographie

Sommet
type: Type d'élément du relief
type: Concept
definition: Point haut du relief non caractérisé par un profil abrupt (voir la nature Pic) : colline, mamelon, mont, sommet.
in scheme: Type d'élément du relief
in scheme: Type de ZAI
preferred label: Summit @en
broader: PAI orographie

Vallée
type: Type d'élément du relief
type: Concept
definition: Espace entre deux ou plusieurs montagnes. Forme définie par la convergence des versants et qui est, ou a été parcourue par un cours d'eau : combe, ravin, val, vallée, vallon, thalweg.
in scheme: Type d'élément du relief
in scheme: Type de ZAI
preferred label: Valley @en
broader: PAI orographie

Versant
type: Type d'élément du relief
type: Concept
definition: Plan incliné joignant une ligne de crête Ã un thalweg : coteau, versant.
in scheme: Type d'élément du relief
in scheme: Type de ZAI
preferred label: Slope @en
broader: PAI orographie

Volcan
type: Type d'élément du relief
type: Concept
definition: Toute forme de relief témoignant d'une activité volcanique : cratère, volcan.
in scheme: Type d'élément du relief
in scheme: Type de ZAI
preferred label: Volcano @en
broader: PAI orographie

Ligne Ã grande vitesse
type: Type de voie ferrée
type: Concept
definition: Ligne ferroviaire réservée aux trains Ã grande vitesse.
in scheme: Type de voie ferrée
preferred label: Ultra-high speed railway @en

Voie ferrée principale
type: Type de voie ferrée
type: Concept
definition: Voie ferrée en exploitation servant au transport des voyageurs ou des marchandises. RER, voie ferrée en exploitation, voie ferrée touristique, voie-mère d’embranchement particulier. Toutes les voies ferrées en exploitation assurant un service régulier ou saisonnier pour le transport des voyageurs ou des marchandises. Les lignes de métro et les lignes de TGV sont exclues.
in scheme: Type de voie ferrée
preferred label: Standard gauge railway @en

Voie de service
type: Type de voie ferrée
type: Concept
definition: Les voies de service de moins de 200 m de long sont exclues, ainsi que les voies s’inscrivant dans un faisceau de voies ferrées de plus de 25 m de large (voir <aire de triage>) et les voies de service souterraines.
in scheme: Type de voie ferrée
preferred label: Service track @en

Voie non exploitée
type: Type de voie ferrée
type: Concept
definition: Voie ferrée déclassée, voie ferrée fermée Ã tout trafic, voie ferrée neutralisée.
in scheme: Type de voie ferrée
preferred label: Unused track @en

Voie de transport urbain
type: Type de voie ferrée
type: Concept
definition: Ligne de métro aérien ou de tramway.
in scheme: Type de voie ferrée
preferred label: Urban transport railway @en

Funiculaire
type: Type de voie ferrée
type: Concept
definition: Funiculaire ou voie ferrée Ã crémaillère.
in scheme: Type de voie ferrée
preferred label: Funicular railway @en
alternative label: Voie ferrée Ã crémaillère
alternative label: Rack-railway @en

Câble transporteur
type: Type de ligne de transport par câble
type: Concept
definition: Moyen de transport constitué d'un ou de plusieurs câbles porteurs et servant Ã assurer le transport de matériel.
in scheme: Type de ligne de transport par câble
preferred label: Cableway @en

Téléphérique
type: Type de ligne de transport par câble
type: Type de ZAI
type: Concept
definition: Téléphériques, y compris les remonte-pentes, remontées mécaniques, télécabines, téléskis, télébennes, télésièges.
in scheme: Type de ligne de transport par câble
in scheme: Type de ZAI
preferred label: Aerial ropeway @en
broader: PAI transport

Pont
type: Type de franchissement
type: Concept
definition: Ouvrage d’art susceptible d’enjamber un ou plusieurs éléments du réseau routier, ferré ou hydrographique ou permettant le franchissement d'une vallée : pont, passerelle, pont isolé, pont mobile. Portion du réseau située au dessus du niveau du sol.
in scheme: Type de construction
in scheme: Type de ZAI
in scheme: Type de franchissement
preferred label: Bridge @en
broader: PAI transport

Tunnel
type: Type de franchissement
type: Concept
definition: Portion souterraine du réseau.
in scheme: Type de franchissement
in scheme: Type de ZAI
broader: PAI transport

Gué
type: Type de franchissement
type: Concept
definition: Passage naturel ou aménagé permettant aux véhicules de travaerser un cours d'eau sans le recours d'un pont ou d'un bateau.
in scheme: Type de franchissement
preferred label: Ford @en

Cascade
type: Type de ZAI
type: Type de franchissement
type: Concept
definition: Chute d’eau, cascade.
in scheme: Type de franchissement
in scheme: Type de ZAI
preferred label: Waterfall @en
broader: PAI hydrographie

Écluse
type: Type de franchissement
type: Concept
definition: Ouvrage hydraulique formé essentiellement de portes munies de vannes destiné Ã retenir ou Ã lâcher l’eau selon les besoins : Ascenseur Ã bateaux, écluse.
in scheme: Type de franchissement
preferred label: Lock @en

Pont-canal
type: Type de franchissement
type: Concept
definition: Tronçon de cours d’eau artificiel passant sur un pont.
in scheme: Type de franchissement
preferred label: Canal aqueduct @en

Autoroute
type: Type de route
type: Concept
definition: Routes sans croisement, accessibles seulement en des points aménagés Ã cet effet et réservées aux véhicules Ã propulsion mécanique. Le classement dans la catégorie des autoroutes est prononcé par décret du conseil d’état, pris après enquête publique.
in scheme: Type de route
preferred label: Motorway @en

Quasi-autoroute
type: Type de route
type: Concept
definition: Routes de même définition que l’autoroute mais non classées officiellement dans cette catégorie. Ce sont des routes Ã chaussées séparées par un terre-plein central, qui ne possèdent pas de croisement Ã niveau avec le reste du réseau routier.
in scheme: Type de route
preferred label: Non-classified motorway @en

Bretelle
type: Type de route
type: Concept
definition: Bretelles de liaison (ou d’échangeur) ou voies d’accès Ã une aire de service ou de repos.
in scheme: Type de route
preferred label: Ramp @en

Route Ã deux chaussées
type: Type de route
type: Concept
definition: Routes comportant 2 chaussées séparées par un obstacle physique éventuellement ouvert aux carrefours. Elles possèdent donc des croisements Ã niveau, ce qui leur interdit d'être classées dans la catégorie autoroute ou quasi-autoroute.
in scheme: Type de route
preferred label: Dual carriageway road @en

Route Ã une chaussée
type: Type de route
type: Concept
definition: Routes comportant 1 chaussée. Toutes les routes goudronnées qui ne sont pas classées en Route Ã 2 chaussées, Quasi-autoroute ou Autoroute se retrouvent dans cette classe.
in scheme: Type de route
preferred label: Single carriageway road @en

Route empierrée
type: Type de route
type: Concept
definition: Routes sommairement revêtues (pas de revêtement de surface ou revêtement très dégradé), mais permettant la circulation de véhicules automobiles de tourisme par tout temps. Toutes les routes empierrées sont incluses.
in scheme: Type de route
preferred label: Gravel road @en

Chemin
type: Type de route
type: Concept
definition: Les chemins sont prévus pour la circulation de véhicules ou d’engins d’exploitation. Ils ne sont pas forcément carrossables pour tous les véhicules et par tout temps.
in scheme: Type de route
preferred label: Dirt road @en

Bac auto
type: Type de route
type: Concept
definition: Trajets du bateau servant Ã passer des véhicules d’une rive Ã l’autre d’un cours d’eau ou d’un bras de mer.
in scheme: Type de route
preferred label: Car ferry @en

Bac piéton
type: Type de route
type: Concept
definition: Trajets du bateau servant Ã passer des piétons d’une rive Ã l’autre d’un cours d’eau ou d’un bras de mer.
in scheme: Type de route
preferred label: Passenger ferry @en

Piste cyclable
type: Type de route
type: Concept
definition: Tronçons de chaussée en site propre, réservés aux cycles. Les bandes cyclables sont exclues.
in scheme: Type de route
preferred label: Bicycle path @en

Sentier
type: Type de route
type: Concept
definition: Chemins étroits ne permettant pas le passage de véhicules. Seuls les principaux sentiers sont inclus. Passerelles supportant une allée, directement reliés au réseau routier. Les passerelles ont une position par rapport au sol supérieure Ã 0.
in scheme: Type de route
preferred label: Footpath @en

Escalier
type: Type de route
type: Concept
definition: Escaliers directement reliés au réseau routier, assurant la jonction entre deux voies de communication ou entre le réseau routier et un élément adressable.
in scheme: Type de route
preferred label: Stair way street @en

Route nationale
type: Type de route
type: Concept
definition: Voie du domaine public routier national autre que les autoroutes.
in scheme: Type de route
preferred label: Main road @en

Route départementale
type: Type de route
type: Concept
definition: Voie qui fait partie du domaine public routier départemental.
in scheme: Type de route
preferred label: Secondary road @en

Citerne
type: Type de point d'eau
type: Concept
definition: Réservoir où l'on recueille et conserve les eaux de pluie.
in scheme: Type de point d'eau
preferred label: Cistern @en

Fontaine
type: Type de point d'eau
type: Concept
definition: Construction comportant une alimentation en eau et généralement un bassin.
in scheme: Type de point d'eau
preferred label: Fountain @en

Source
type: Type de point d'eau
type: Concept
definition: Point d'émergence Ã la surface du sol de l'eau emmagasinée Ã l'intérieur. Exsurgence, résurgence, source.
in scheme: Type de point d'eau
preferred label: Spring @en

Source captée
type: Type de point d'eau
type: Concept
definition: Installation de captage d’une source.
in scheme: Type de point d'eau
preferred label: Water catchment @en

Station de pompage
type: Type de point d'eau
type: Type de ZAI
type: Concept
definition: Installation comprenant une pompe destinée Ã pomper l'eau du sous-sol, d'une rivière, ou Ã monter de l'eau dans un réservoir ou un château d'eau.
in scheme: Type de point d'eau
in scheme: Type de ZAI
preferred label: Pumping station @en
broader: PAI gestion des eaux

Laisse des plus hautes mers
type: Type de laisse
type: Concept
definition: Limite supérieure de l'estran. Elle sépare la zone littorale découvrante de la zone jamais envahie par la mer.
in scheme: Type de laisse
preferred label: High-tide line @en

Laisse des plus basses mers
type: Type de laisse
type: Concept
definition: Limite inférieure de l'estran. Elle sépare la zone littorale découvrante de la zone toujours envahie par la mer.
in scheme: Type de laisse
preferred label: Low-tide line @en

Scan25
type: Entity

BD TOPO
type: Entity

BD CARTO
type: Entity

Géoroute
type: Entity

BD NYME
type: Entity

BD PARCELLAIRE
type: Entity

Cadastre
type: Entity

Orthophotographie
type: Entity

Plan
type: Entity

Fichier
type: Entity

Relevé de terrain
type: Entity

Calcul
type: Entity

Autre source de données
type: Entity