Non-Motorised Wheelchair Person
type: Class
comment: A traditional wheelchair that is used by hands. It has significantly lower speed than motorised wheelchairs.
subclass of: Mobility With Wheelchair Person

Bathroom
type: Class
comment: Bathroom is mainly used for bathing & washing up related activities.
subclass of: Room

Assembly Point
type: Class
comment: A place where people in an office, etc. should go if there is an emergency, for example, a fire (Cambridge English Dictionary) .
subclass of: Route Point

Mobile Phone
type: Class
comment: A telephone with access to a cellular radio system so it can be used over a wide area, without a physical connection to a network (Oxford Dictionary of English).
subclass of: Telephone
subclass of: Handheld Device

Building Spatial Structure
type: Class
comment: A man made structure with spatial properties.
subclass of: Building Space

Turn Point
type: Class
comment: A logic point that is used to enforce people to change their direction.
subclass of: Navigational Point

Impaired Person
type: Class
comment: An individual whose natural senses or physical abilities are either diminished or damaged.
subclass of: Person

Often Deviate
type: NamedIndividual
comment: This instance is used to express when someone is deviating frequently while following the provided path.

Mercantile Building
type: Class
comment: Places where goods are displayed and sold. Examples: grocery stores, department stores, and gas stations.
subclass of: Non-Residential Building

Seating Arrangement Route
type: Class
comment: A type of route in which the ending point represents the seat of one or more individuals such as in cinema, stadiums, auditoriums, etc.
subclass of: Route

Uses
type: ObjectProperty
comment: Expresses a momentary information about a physical space or a point being used by a social unit.
domain: Social Unit
range: Class
  union of: Device
  union of: Point Of Interest
  union of: Route
  union of: Route Element
  union of: Space

Has X Time Deviated
type: DatatypeProperty
comment: Number of times a social unit is deviated while following the provided path.
domain: Social Unit
range: integer

Shortest Path
type: NamedIndividual
comment: A type of route having minimum cost in terms of distance or time.

Fit
type: NamedIndividual
comment: This instance is used to express when the physical and mental condition is sound of someone.

Observable Property
type: Class
comment: An observable quality (property, characteristic) of a FeatureOfInterest.
example: The height of a tree, the depth of a water body, or the temperature of a surface are examples of observable properties, while the value of a classic car is not (directly) observable but asserted.

End Point
type: Class
comment: A logic point that is used to indicate the end of a corridor.
subclass of: Navigational Point

Physically Impaired Person
type: Class
comment: A physical impairment is a condition in which any part of person's body is either damaged or is not working properly.
subclass of: Impaired Person

Mobility With Wheelchair Person
type: Class
comment: A person using a wheelchair (a mobility device that is used while having any kind of tempoary or permanent physical impairment).
subclass of: Motor Impaired Person

Junction
type: Class
comment: A logic point that connects more than two corridors.
subclass of: Navigational Point

Has Motion State
type: ObjectProperty
comment: The motion state of a person.
domain: Person
range: Motion State

Classroom
type: Class
comment: A room, typically in a school, in which a class of students is taught (Oxford Dictionary of English).
subclass of: Room

Mental Ability
type: Class
comment: The mental ability of an indi-vidual to remain focused on an external stimuli or an internal experience for a certain period of time (World Health Organisation).
subclass of: Ability

Activity Impact
type: Class
comment: A parameter to express the impact of an activity on a specific person (or type of persons) in terms of any specific value or a type.
subclass of: Parameter
subclass of: Restriction
  cardinality: 1
  on property: Of Activity
subclass of: Restriction
  cardinality: 1
  on property: Has Impact
subclass of: Restriction
  all values from: Activity
  on property: Of Activity
subclass of: Restriction
  all values from: Impact
  on property: Has Impact
subclass of: Restriction
  all values from: Social Unit
  on property: For Person

Of Event
type: ObjectProperty
comment: A property to express a sbeo:Event in a n-ary relation for sbeo:EventSeverity.
domain: Class
  union of: Activity Impact
  union of: Event Severity
range: Incident

Walking
type: NamedIndividual
comment: An unhurried rate of movement on foot (Oxford Dictionary of English).

Running
type: NamedIndividual
comment: A movement of an able-bodied person at a speed faster than a walk

Panic
type: Class
comment: A sudden uncontrollable fear or anxiety among the occupants of the building that often causes wildly unthinking behaviour (Oxford Dictionary of English). In indoor environments, it may happens due to several reasons such as earthquake, fire or other sudden hazardous situations.
subclass of: Incident

Has Fitness Status
type: ObjectProperty
comment: A fitness status is associated with a person that represent the quality of being suitable for a specific activity. There are three different levels of fitness levels are introduced that can be extended according to the needs of the application. These are 'Fit', 'Exhausted' and 'Injured'.
domain: Person
range: Fitness Status

Spatial Ability
type: Class
comment: This ability expresses the capacity to understand, reason and remember the spatial relations among objects and spaces.
subclass of: Ability

Point Of Interest Segement
type: Class
comment: A traverasal part of a space that is connected to a specific Point of Interest.
subclass of: Horizontal Passage

Identification Number
type: DatatypeProperty
comment: An unique identification number of something such as, social unit, device, etc.
domain: Class
  union of: Device
  union of: Social Unit
range: integer

Route Type
type: ObjectProperty
comment: This property is used to express the type of a route in terms of graph-based routes, such as Shortest Path, Simplest Path etc.
domain: Route
range: Graph-Based Route

Motorised Wheelchair Person
type: Class
comment: It is a kind of wheelchair that has either a mechanical engine or an electric battery. It has more speed than a traditional wheelchair.
subclass of: Mobility With Wheelchair Person
subclass of: Mobility With Assisted Device Person

Last Name
type: DatatypeProperty
comment: The last name of the person.
domain: Person

Alerting Device
type: Class
comment: Alerting devices are those devices that are used to react to normal as well as alarming situations to let people know that some specific condition is occuring.
subclass of: Device

Dynamic Description
type: DatatypeProperty
comment: A dynamic or momentary information about a specific activity, event, social unit, or a space.
domain: Class
  union of: Activity
  union of: Event
  union of: Point Of Interest
  union of: Social Unit
  union of: Space
range: string

Basement
type: Class
comment: A story of a building, partly or wholly underground.
subclass of: Room

Profound Hearing Impaired Person
type: Class
comment: A person who cannot hear sounds softer than 90-120 dB. A person suffering from profound hearing loss, using a hearing aid is also ineffective most of the time.
subclass of: Hearing Impaired Person

Colour Blind Person
type: Class
comment: A person having the decreased ability to see color or differences in color.
subclass of: Visually Impaired Person

Transition Point
type: Class
comment: A point at which person passes from one place to the next.
subclass of: Route Point

Site Of Building
type: Class
comment: Building site is a locale containing one or more separate buildings. They are zones.
subclass of: Space

Acquaintance Of
type: SymmetricProperty
type: ObjectProperty
comment: Any friend or an acquaintance tie among occupants.
domain: Person
range: Person

Fire Protection Device
type: Class
comment: Device that is used to minimize the effects of potentially danger fires.
subclass of: Incident Protection Device

Room Exit
type: Class
comment: A logical point that is used to represent the exit of a room.
subclass of: Exit

Educational Building
type: Class
comment: Schools and day care centers.
subclass of: Non-Residential Building

Fitness Status
type: Class
comment: A fitness status is associated with a person that represent the quality of being suitable for a specific activity.
equivalent class: Class
  one of: Exhausted
  one of: Fit
  one of: Injured

Unavailable
type: NamedIndividual
comment: Not available or accessible.

Fire
type: Class
comment: An event that may burn different parts of the building and hazourdous for both the people and the building.
subclass of: Incident

Audio Description
type: Class
comment: A type of description in which sounds such as voices, are used to provide the information about any entity.
subclass of: Description

Hall
type: Class
comment: A large entrance room of a house or building.
subclass of: Lobby
subclass of: Horizontal Passage

Activity Severity
type: Class
comment: A parameter to express the severity of an activity for a specific person (or type of persons) in terms of potential severity levels.
subclass of: Parameter
subclass of: Restriction
  cardinality: 1
  on property: Of Activity
subclass of: Restriction
  cardinality: 1
  on property: Has Severity
subclass of: Restriction
  all values from: Activity
  on property: Of Activity
subclass of: Restriction
  all values from: Severity
  on property: Has Severity
subclass of: Restriction
  all values from: Social Unit
  on property: For Person

Congestion
type: Class
comment: An event that happens at bottlenecks when the flow of people increases than a provided limit due to herding (and similar phenomena of human behaviour), especially during an emergency evacuation process.
subclass of: Incident

Of Activity
type: ObjectProperty
comment: A property to express a sbeo:Activity in a n-ary relation for sbeo:ActivitySeverity.
domain: Class
  union of: Activity Impact
  union of: Activity Severity
range: Activity

Telephone
type: Class
comment: A device for transmitting voices over a distance using wire or radio, by converting acoustic vibrations to electrical signals (Oxford Dictionary of English).
subclass of: Device

Severe Hearing Impaired Person
type: Class
comment: A person who is unable to hear anything without wearing a hearing aid.
subclass of: Hearing Impaired Person

Adjacent To
type: SymmetricProperty
type: ObjectProperty
comment: Nearest in space or position; immediately adjoining without intervening space or element; an exact neighbour.
domain: Class
  union of: Route Element
  union of: Space
range: Class
  union of: Route Element
  union of: Space

Group
type: Class
comment: It represents a collection of two or more people who interact with each other and may have the similar characteristics or objectives.
subclass of: Social Unit
subclass of: Restriction
  cardinality: 1
  on property: Length
subclass of: Restriction
  all values from: integer
  on property: Length
subclass of: Restriction
  min cardinality: 2
  on property: Has Member

Collaborative Navigation
type: NamedIndividual
comment: A type of navigation in which two or more persons are involved that may or may not have same objectives.

Balcony
type: Class
comment: An accessible structure extending from a building, especially outside a window.
subclass of: Building Space

Storage Room
type: Class
comment: Room for storage.
subclass of: Room

Road
type: Class
comment: A road is a way on land between two places that has been paved or otherwise improved to allow travel by foot or some form of conveyance, including a motor vehicle, cart, bicycle, or horse.
subclass of: Thoroughfare
subclass of: Horizontal Passage

Person Accessibility
type: Class
comment: A parameter to express the accessibility of any space for a specific person (or type of persons) in terms of some value.
subclass of: Parameter
subclass of: Restriction
  cardinality: 1
  on property: Value
subclass of: Restriction
  all values from: float
  on property: Value
subclass of: Restriction
  cardinality: 1
  on property: Of Space
subclass of: Restriction
  all values from: Person
  on property: For Person
subclass of: Restriction
  on property: Of Space
  some values from: Class
    union of: Route Element
    union of: Space

Speed
type: DatatypeProperty
comment: The average speed of a person.
domain: Social Unit
range: float

Sensor
type: Class
comment: Device, agent (including humans), or software (simulation) involved in, or implementing, a Procedure. Sensors respond to a stimulus, e.g., a change in the environment, or input data composed from the results of prior Observations, and generate a Result. Sensors can be hosted by Platforms.
example: Accelerometers, gyroscopes, barometers, magnetometers, and so forth are Sensors that are typically mounted on a modern smart phone (which acts as Platform). Other examples of sensors include the human eyes.

Route Element
type: Class
comment: It represents the physical or conceptual elements of a navigation path.
subclass of: Restriction
  on class: Availability Status
  on property: Has Availability Status
  qualified cardinality: 1

Excluded For
type: ObjectProperty
comment: Expresses the removal of any physical space or point of interest for the consideration of any social unit.
domain: Class
  union of: Point Of Interest
  union of: Route Element
  union of: Space
range: Social Unit

Mobility With Assisted Device Person
type: Class
comment: A person who used a motorised device for moving, such as motorised wheelchair or scooter, etc.
subclass of: Motor Impaired Person

Cost
type: DatatypeProperty
comment: A numeric value associated with an edge or a complete route(path). It is also reffered to as a weight.
domain: Class
  union of: Route
  union of: Route Element
range: float

Swimming Pool
type: Class
comment: A tank or large artificial basin, as of concrete, for filling with water for swimming.
subclass of: Room

Stadium Building
type: Class
comment: A building that has a large open area surrounded by many rows of seats, and used for sports events, concerts, etc.
subclass of: Assembly Building

Hall Exit
type: Class
comment: A logical point that is used to represent the exit of a Hall.
subclass of: Exit

For Person
type: ObjectProperty
comment: A property to express a foaf:Person in a n-ary relation for sbeo:Parameter.
domain: Parameter
range: Person

Accommodation Capacity
type: FunctionalProperty
type: DatatypeProperty
comment: The accommodating capacity (in terms of persons) of a particular space.
domain: Class
  union of: Point Of Interest
  union of: Route Element
  union of: Space
range: integer

Part Of
type: TransitiveProperty
type: ObjectProperty
comment: Expresses a physical space as a part or a fragment of another physical space. For example, a block of apartments can be a part of apartment building, etc.
domain: Class
  union of: Route Element
  union of: Space
range: Class
  union of: Route Element
  union of: Space

Motor Impaired Person
type: Class
comment: A person who has either partial or total loss of function of a body part, usually a limb or limbs.
subclass of: Physically Impaired Person

Sensory Impairmed Person
type: Class
comment: Sensory impairment is when one of the senses such as sight, hearing, smell, touch, taste and spatial awareness, is no longer normal.
subclass of: Impaired Person

Smartphone
type: Class
comment: A mobile phone that is able to perform many of the functions of a computer, typically having a relatively large screen and an operating system capable of running general-purpose applications (Oxford Dictionary of English).
subclass of: Mobile Phone

Autonomous Navigation
type: NamedIndividual
comment: A type of navigation in which a person plans and executes his or her path without any human or machine intervention.

No Deviate
type: NamedIndividual
comment: This instance is used to express when someone is not deviating at all while following one's provided path.

Exhausted
type: NamedIndividual
comment: This instance is used to express the when someone has drained of one's energy or effectiveness.

Thoroughfare
type: Class
comment: A road or path forming a route between two places (Oxford Dictionary of English).
subclass of: Space

Parameter
type: Class
comment: A numerical or other measurable factor forming one of a set that defines a system or sets the conditions of its operation.

Current Occupancy
type: DatatypeProperty
comment: The current occupancy (in terms of persons) of a particular space.
domain: Class
  union of: Point Of Interest
  union of: Route
  union of: Route Element
  union of: Space
range: integer

Accompanying
type: TransitiveProperty
type: SymmetricProperty
type: ObjectProperty
comment: Be present or associated with a person.
domain: Person
range: Person

Down Syndrome Person
type: Class
comment: A person with Down's syndrome.
subclass of: Mental Impaired Person

Has Ability
type: ObjectProperty
comment: A property to express a sbeo:Ability in a n-ary relation for sbeo:PersonAbility.
domain: Person Ability
range: Ability

Ability To Talk
type: Class
comment: An ability to talk.
subclass of: Sensor Ability

Appartment Building
type: Class
comment: A set of one or more buildings that contain apartments in it.
subclass of: Residential Building

Corridor Segment
type: Class
comment: A fragment or an atomic element of a corridor.
subclass of: Corridor

Visually Impaired Person
type: Class
comment: It is a partial or total unability to see. It is also known as visual loss. Here, we considered a person having visual impairment who as severe low vision; 20/200 to 20/400 or higher.
subclass of: Sensory Impairmed Person

Terrorist Attack
type: Class
comment: A surprise event involving the deliberate use of violence against the occupants of the buildings.
subclass of: Incident

Ramp
type: Class
comment: A sloping surface joining two different levels, as at the entrance or between floors of a building (Oxford Dictionary of English).
subclass of: Building Space
subclass of: Vertical Passage

Escalator
type: Class
comment: A moving staircase consisting of an endlessly circulating belt of steps driven by a motor, which conveys people between the floors of a public building (Oxford Dictionary of English).
subclass of: Building Space
subclass of: Vertical Passage

Corridor Exit
type: Class
comment: A logical point that is used to represent the exit of a corridor.
subclass of: Exit

Ability To Run
type: Class
comment: An ability to run.
subclass of: Mobility Ability

Has Navigational State
type: ObjectProperty
comment: A navigational state of a social unit while following any path.
domain: Social Unit
range: Navigational State

This instance is used to mention when a person has been evacuated successfully.
type: NamedIndividual
label: Evacuated

Building
type: Class
comment: Buildings are roofed constructions which can be used separately, have been built for permanent purposes, can be entered by persons and are suitable or intended for protecting persons, animals or objects.
subclass of: Building Space
subclass of: Space

Event
type: Class
comment: An occurrence; something that happens (Oxford Dictionary of English). It represents when something planned or sudden happens.

Passage
type: Class
comment: Any spatial element that is part of a path and traversable by persons. In addition, it may be used as a logic representation of physical passages to represent an edge (or an arc) in a route graph.
subclass of: Route Element

Stampeding
type: Class
comment: A sudden and uncontrollable run by the group of people caused by panic.
subclass of: Panic

Visiting
type: NamedIndividual
comment: The activity of making visits.

Hall Segment
type: Class
comment: A fragment or an atomic element of a hall.
subclass of: Hall

Role
type: ObjectProperty
comment: Expresses a role of an agent.
domain: Role In Context
range: Role

Has Member
type: ObjectProperty
comment: Expresses one of the persons who compose a social group.
domain: Group
range: Person

Horizontal Passage
type: Class
comment: A type of a passage that connects spatial elements located on the same storey or floor.
subclass of: Passage
disjoint with: Vertical Passage

Escort Supported Wheelchair Person
type: Class
comment: A physical impaired person whose wheelchair is escorted by another person.
subclass of: Mobility With Wheelchair Person

Has Navigation Type
type: ObjectProperty
comment: A type of navigation provided to a person to perform a specific activity.
domain: Person
range: Navigation

Connected To
type: SymmetricProperty
type: ObjectProperty
comment: Being joined by a common element; more specificially, a physical connection between two space elements.
domain: Class
  union of: Route Element
  union of: Space
range: Class
  union of: Route Element
  union of: Space

Day Care
type: Class
comment: A place where infants and young children are provided a supervision and care of during the daytime, particularly so that their parents can hold jobs.
subclass of: Building Space

Ability
type: Class
comment: Possession of the means or skill to do something (Oxford Dictionary of English).

Hall Entrance
type: Class
comment: A logical point that is used to represent the entrance to a hall.
subclass of: Entrance

Laundry
type: Class
comment: A room or zone, as in a home or apartment building, reserved for doing the family wash.
subclass of: Room

Device
type: Class
comment: A thing made or adapted for a particular purpose, especially a piece of mechanical or electronic equipment (Oxford Dictionary of English).
subclass of: Restriction
  cardinality: 1
  on property: Has Availability Status

has index
type: FunctionalProperty
type: DatatypeProperty
comment: An index of a slot in an ordered list.
domain: Slot
range: positiveInteger

Building Storey
type: Class
comment: The storey represents a (nearly) horizontal aggregation of spaces that are vertically bound.
subclass of: Building Spatial Structure

has next
type: FunctionalProperty
type: ObjectProperty
comment: Associates the next slot in an ordered list.
domain: Slot
range: Slot
inverse of: has previous

Fire Extinguisher
type: Class
comment: An active fire protection instrument used by persons to blow out small scale fire.
subclass of: Active Fire Protection Device

Sensor Ability
type: Class
comment: Sensory ability is referred to the brain's ability to receive, interpret, and effectively use the information provided by the senses in human beings such as touch, hear, smell, vision, etc.
subclass of: Ability

Injured
type: NamedIndividual
comment: This instance is used to express when someone is not fit and has some injuries.

Vertical Passage
type: Class
comment: A type of passage that connects spatial elements located on different storey or floor.
subclass of: Passage

Intensity
type: Class
comment: The measurable amount of a property, such as force, brightness, or a magnetic field (Oxford Dictionary of English).

Notification Preference
type: ObjectProperty
comment: A notification preference for any kind of social unit.
domain: Social Unit
range: Description

Player
type: ObjectProperty
comment: It express an agent that plays a role in a specific context.
domain: Role In Context
range: Person

Scooting
type: NamedIndividual
comment: A type of movement usually performed while sitting in (or riding on) an automatic or mechical device, such as electrical wheelchair, electric scooter, etc.

Lead To
type: SymmetricProperty
type: ObjectProperty
comment: Be a means of access to a particular space or point.
domain: Class
  union of: Point Of Interest
  union of: Route Element
  union of: Space
range: Class
  union of: Point Of Interest
  union of: Route Element
  union of: Space

Multi-objective Navigation
type: NamedIndividual
comment: A type of navigation in which multiple point of interests are supposed to be visited by a person.

Event Severity
type: Class
comment: A parameter to express the severity of an event for a specific person (or type of persons) in terms of potential severity levels.
subclass of: Parameter
subclass of: Restriction
  cardinality: 1
  on property: Of Event
subclass of: Restriction
  cardinality: 1
  on property: Has Severity
subclass of: Restriction
  all values from: Event
  on property: Of Event
subclass of: Restriction
  all values from: Severity
  on property: Has Severity
subclass of: Restriction
  all values from: Social Unit
  on property: For Person

Value
type: FunctionalProperty
type: DatatypeProperty
comment: Provides a value that is a direct representation of an entity.
domain: Thing
range: float

Alzheimer's Diseased Person
type: Class
comment: A person having an Alzheimer's disease.
subclass of: Mental Impaired Person

Social Unit
type: Class
comment: An individual, or a group or community, considered as a discrete constituent of a society or larger group (Oxford Dictionary of English).

Has Description
type: ObjectProperty
comment: Expresses a descriptive information about any specific space, point, activiy, event or device.
domain: Class
  union of: Activity
  union of: Device
  union of: Event
  union of: Route
  union of: Route Element
  union of: Space
range: Description

Corridor Entrance
type: Class
comment: A logical point that is used to represent the entrance to a corridor.
subclass of: Entrance

Mobility Ability
type: Class
comment: This ability is used to represent all kinetic abilities a person may have.
subclass of: Ability

Active Fire Protection Device
type: Class
comment: It is an integral part of the fire protection used as a first response to minimize the spread of fire and related effects.
subclass of: Fire Protection Device

Chemical Spill
type: Class
comment: A hazardous event that happens due to the spillage or leakge of any toxic chemical in the building.
subclass of: Incident

Display Screen
type: Class
comment: A display screen is an output device to represent the information in visual or tactile form.
subclass of: Device

Textual Description
type: Class
comment: A type of description in which only text or writings are used to provide the information about any entity.
subclass of: Description

Attic
type: Class
comment: the part of a building, especially of a house, directly under a roof; garret.
subclass of: Room

Visit
type: Class
comment: An activity that represents an act of going to see a person or place as a guest, tourist or a spectator. Normally, this type of activity is considered as a leasiure or recreational activity.
subclass of: Activity

Static Description
type: DatatypeProperty
comment: A static or a fix information about any activity, event, space, social unit, or point of interest.
domain: Class
  union of: Activity
  union of: Event
  union of: Point Of Interest
  union of: Social Unit
  union of: Space
range: string

Meeting Room
type: Class
comment: A type of room designated for social gathering of people, especially professional meetings.
subclass of: Room

SBEO: Smart Building Evacuation Ontology
type: Ontology
rights: gpl.html
creator: Qasim Khalid
description: Smart Building Evacuation Ontology (SBEO) is an ontology that couples the information about any building with its occupants such that it can be used in many useful ways. For example, indoor localization of people, detection of any hazard, a recommendation of normal routes such as shopping or stadium seating routes, or safe and feasible emergency evacuation routes or both of them all together. The core SBEO covers the concepts related to the geometry of building, devices and components of the building, route graphs correspondent to the building topology, users' characteristics and preferences, situational awareness of both building (hazard detection, status of routes in terms of availability and occupancy) and users (tracking, management of groups, status in terms of fitness), and emergency evacuation.
language: en
version info: 0.1

Responsible To
type: TransitiveProperty
type: ObjectProperty
comment: Having an obligation to do something, or having control over or care for someone, as part of one's role (Oxford Dictionary of English).
domain: Person
range: Person
sub property of: Acquaintance Of

Point Of Interest
type: Class
comment: Any physical or virtual location or object, which may be of interest to a user and may serve as a navigation destination (e.g., room, water dispenser, waiting zone, assembly point, shop, seat, etc).
subclass of: Route Point

Emergency Exit
type: Class
comment: Emergency exit is logical point that is only used in case of any emergency conditions such as fire, etc.
subclass of: Exit

Has Quality
type: ObjectProperty
comment: A property to express a quality of something in terms of different levels. For example, good, bad, medium, perfect, mild, and so forth.
domain: Person Ability
range: Quality

Person
type: Class
comment: It represents a single individual of any age and having any type of characteristics.
subclass of: Social Unit

Installed In
type: ObjectProperty
comment: Place or fix (equipment or machinery) in position ready for use (Oxford Dictionary of English).
domain: Device
range: Class
  union of: Point Of Interest
  union of: Route
  union of: Route Element
  union of: Space

Has Deviation State
type: ObjectProperty
comment: A deviation status of a person depending on how ofthen one deviates from the proposed route.
domain: Social Unit
range: Deviation State

Stairs
type: Class
comment: A construction designed to bridge a large vertical distance by dividing it into smaller vertical distances, called steps.
subclass of: Building Space
subclass of: Vertical Passage

Shopping Route
type: Class
comment: A type of route in which the specific points of interest are mentioned in the form of connected spaces, according to the preferences or interests of a one or more individuals.
subclass of: Visit Route

Travel Time
type: DatatypeProperty
comment: A specific period of time required to move from one place to another.
domain: Class
  union of: Passage
  union of: Route
range: float

Route Preference
type: ObjectProperty
comment: Route preference of a social unit to perform an activity.
domain: Social Unit
range: Route

Graph-Based Route
type: Class
comment: A graph-based route is a graphical way of representing a route in terms of nodes (sometimes called vertices) and edges (sometimes called arcs).
subclass of: Route
equivalent class: Class
  one of: Shortest Path
  one of: Simplest Path

Apartment
type: Class
comment: A suite of rooms usually on one floor of an apartment house (Cambridge English Dictionary).
subclass of: Building Space

Impact
type: Class
comment: An impact is a long-lasting effect of an event (or activity), that continues to exist after the event (or activity) has taken place.

observes
type: ObjectProperty
comment: Relation between a Sensor and an ObservableProperty that it is capable of sensing.
domain: Sensor
range: Observable Property
domain includes: Sensor
range includes: Observable Property

Footpath
type: Class
comment: A path for pedestrians in a built-up area; a pavement.
subclass of: Thoroughfare
subclass of: Horizontal Passage

has slot
type: ObjectProperty
comment: A slot in an ordered list.
domain: Ordered List
range: Slot

Room Entrance
type: Class
comment: A logical point that is used to represent the entrance to a room.
subclass of: Entrance

This instance is used to express when someone is in the process of evacuating some space.
type: NamedIndividual
label: Evacuating

Deviation State
type: Class
comment: It models the user's deviation state from one's proposed route. For example, NoDeviate, RareDeviate, OftenDeviate, and TooOftenDeviate.
equivalent class: Class
  one of: No Deviate
  one of: Often Deviate
  one of: Rare Deviate
  one of: Too Often Deviate

Room
type: Class
comment: A room in a building space enclosed by surfaces, this could also be modelled as role of space, not subclass of the space itself.
subclass of: Building Space

Navigation
type: Class
comment: The process or activity of accurately ascertaining one's position and planning and following a route (Oxford Dictionary of English).
subclass of: Activity
equivalent class: Class
  one of: Assisted Navigation
  one of: Autonomous Navigation
  one of: Collaborative Navigation
  one of: Multi-objective Navigation

Autonomous Mobility Person
type: Class
comment: A person who can walk on his/her with a help of a non-motorised device, e.g. crutches.
subclass of: Motor Impaired Person

Floor Exit
type: Class
comment: A logical point that is used to represent the exit of a specific floor and that leads to different floors of a building.
subclass of: Exit

Time Duration
type: DatatypeProperty
comment: The length of time during which any activity or event lasts.
domain: Class
  union of: Activity
  union of: Event
range: float

Has Activity Status
type: ObjectProperty
comment: The status of an activity being performed by a social unit.
domain: Social Unit
range: Activity Status

Of Space
type: ObjectProperty
comment: A property to express a sbeo:Space in a n-ary relation for sbeo:Parameter.
domain: Parameter
range: Class
  union of: Route Element
  union of: Space

Office
type: Class
comment: A room, set of rooms, or building where the business of a commercial or industrial organization or of a professional person is conducted.
subclass of: Room

Vertical Moving Pavement
type: Class
comment: A slow-moving conveyor mechanism that transports people across an inclined plane over a short to medium distance.
subclass of: Vertical Passage
subclass of: Moving Pavement

Low Vision Person
type: Class
comment: A person whose visual acuity is 20/70 or poorer in the better-seeing eye and cannot be corrected or improved with regular eyeglasses.
subclass of: Visually Impaired Person

Hearing Impaired Person
type: Class
comment: It is a partial or total unability to hear. It is also known as Hearing loss.
subclass of: Sensory Impairmed Person

Assembly Building
type: Class
comment: places used for people gathering for entertainment, worship, and eating or drinking. Examples: churches, restaurants.
subclass of: Non-Residential Building

Visit Route
type: Class
comment: A type of route created for visiting purposes within an indoor environment.
subclass of: Route

Open Area Exit
type: Class
comment: A logical point that is used to represent the exit from a specifc open space.
subclass of: Exit

Elevator
type: Class
comment: Elevator is used to transport people between different floors.
subclass of: Room
subclass of: Vertical Passage

Industrial Building
type: Class
comment: Buildings used for industrial production, e.g. factories, workshops, slaughterhouses, breweries, assembly plants, etc.
subclass of: Non-Residential Building

Familiar With
type: ObjectProperty
comment: States the familiarity of any social unit with a physical space or point of interest.
domain: Person
range: Class
  union of: Point Of Interest
  union of: Route
  union of: Route Element
  union of: Space

Living Room
type: Class
comment: Living Room is the main room of daytime activity.
subclass of: Room

Hotel Building
type: Class
comment: A building that contains rooms, apartments or suites where people stay for a specific time period.
subclass of: Residential Building

Activity Status
type: Class
comment: It expresses the status of a specific activity being performed by a person.
equivalent class: Class
  one of: This instance is used to mention when a person has been evacuated successfully.
  one of: This instance is used to express when someone is in the process of evacuating some space.
  one of: Picking Up Dependents
  one of: Visiting

Ability To See
type: Class
comment: An ability to hear.
subclass of: Sensor Ability

Passive Fire Protection
type: Class
comment: It is an integral component installed in the building while construction to resist the fire.
subclass of: Fire Protection Device

Utility Room
type: Class
comment: Room for other special utilities and hobbies.
subclass of: Room

Ordered List
type: Class
comment: An ordered list with a given length an indexed items.
subclass of: Restriction
  cardinality: 1
  on property: Length

Performed by
type: ObjectProperty
comment: Expresses an activity carried out by a social unit.
domain: Activity
range: Social Unit

Too Often Deviate
type: NamedIndividual
comment: This instance is used to express when someone is deviating frequently while following the provided path.

Incident Protection Device
type: Class
comment: Device that is used to avoid and minimize the effects of potentially danger events for the occupants of the building as well as for the structure of building itself.
subclass of: Device

Context
type: ObjectProperty
comment: The circumstances that form the setting for an event, statement, or idea, and in terms of which it can be fully understood and assessed (Oxford Dictionary of English).
domain: Role In Context
range: Class
  union of: Activity
  union of: Event
  union of: Social Unit

has ordered list
type: FunctionalProperty
type: ObjectProperty
comment: An ordered list of an slot.
domain: Slot
range: Ordered List
inverse of: has slot

Has Severity
type: ObjectProperty
comment: A property to express a sbeo:Severity in a n-ary relation for sbeo:ActivitySeverity or sbeo:EventSeverity.
domain: Class
  union of: Activity Severity
  union of: Event Severity
range: Severity

Assisted Navigation
type: NamedIndividual
comment: A type of navigation in which a person is assisted by a person or a machine to perform a specific activity.

Building Space
type: Class
comment: A Space is a 3D volume bounded by surfaces. It represents the physical spaces of the building.
subclass of: Space

Tree house
type: Class
comment: A work or office space set up in a person's home and used exclusively for business on a regular basis.
subclass of: Office

Exit Route
type: Class
comment: A type of route in which the ending point represents the exit of a specific space.
subclass of: Route

Started At Time
type: DatatypeProperty
comment: Start is when an activity is deemed to have been started by an entity, known as trigger.
domain: Class
  union of: Activity
  union of: Event
range: float

Standing
type: NamedIndividual
comment: Having or maintaining an upright position, supported by one's feet (Oxford Dictionary of English).

Role
type: Class
comment: The function assumed or part played by a person or thing in a particular situation (Oxford Dictionary of English).

At Time
type: DatatypeProperty
comment: The time at which an activity or event occurred.
domain: Class
  union of: Activity
  union of: Device
  union of: Event
  union of: Social Unit
range: float

Motion State
type: Class
comment: It describes the movement of a person.
equivalent class: Class
  one of: Rolling
  one of: Running
  one of: Scooting
  one of: Standing
  one of: Walking

Available
type: NamedIndividual
comment: Obtainable or accessible and ready for use or service.

Has Intensity
type: ObjectProperty
comment: A property to express the intensity of a particular sbeo:Activity or sbeo:Event.
domain: Class
  union of: Activity
  union of: Event
range: Intensity

Building Entrance
type: Class
comment: A logical point that is used to represent the entrance to a building.
subclass of: Entrance

Institutional Building
type: Class
comment: Institutions such as hospitals providing medical and surgical treatment and nursing care for ill or injured people.
subclass of: Non-Residential Building

Corridor
type: Class
comment: A gallery or passage connecting parts of a building; hallway.
subclass of: Lobby
subclass of: Horizontal Passage

Dining Room
type: Class
comment: A room in which meals are eaten, as in a home or hotel, especially the room in which the major or more formal meals are eaten.
subclass of: Room

Speed Factor
type: DatatypeProperty
comment: A multiplying factor that may affect the speed of person while passing through a specific space.
domain: Class
  union of: Route Element
  union of: Space
range: float

Floor Entrance
type: Class
comment: A logical point that is used to represent the entrance to a floor.
subclass of: Entrance

Kitchen
type: Class
comment: Kitchen is a room used mainly for cooking and possibly eating.
subclass of: Room

Moderate Hearing Impaired Person
type: Class
comment: A person who cannot hear sounds that are less than 40-75 dB.
subclass of: Hearing Impaired Person

Exit
type: Class
comment: Exit represents a logical representation for escaping or releasing from a specific phsyical space. Generally, an exit is as same as an entrance.
subclass of: Transition Point

Alerting Device For Impaired Person
type: Class
comment: An alerting device that is used to assist or notify people with impairments during a specific circumstance.
subclass of: Alerting Device

Simplest Path
type: NamedIndividual
comment: A type of route having minimum complexity in terms of the amount of information required to negotiate each decision point, such as turning points.

Ability To Touch
type: Class
comment: An ability to touch.
subclass of: Sensor Ability

Route Point
type: Class
comment: Any spatial element that is part of a path and traversable by persons. In addition, it may be used as a logic representation of physical passages to represent a node (or a vertex) in a route graph.
subclass of: Route Element

Ability To Walk
type: Class
comment: An ability of a person to walk. A person who is using crutches is also considered to have this ability.
subclass of: Mobility Ability

Ability To Hear
type: Class
comment: An ability to hear.
subclass of: Sensor Ability

Means of Notification
type: ObjectProperty
comment: A method of notifying a social unit.
domain: Social Unit
range: Class
  union of: Alerting Device
  union of: Display Screen
  union of: Handheld Device
  union of: Telephone

Cinema Building
type: Class
comment: A building in which movies are shown.
subclass of: Assembly Building

Has Availability Status
type: ObjectProperty
comment: The status of something in terms of availability. For example, available or unavailable.
domain: Class
  union of: Device
  union of: Route
  union of: Space
range: Availability Status

Width
type: FunctionalProperty
type: DatatypeProperty
comment: The measurement or extent of something from side to side (Oxford Dictionary of English).
domain: Class
  union of: Passage
  union of: Space
range: float

Fire Door
type: Class
comment: A type of door used to minimize the spread of fire and related effects by isolating two connected spaces or sections in the building.
subclass of: Passive Fire Protection

has previous
type: InverseFunctionalProperty
type: ObjectProperty
comment: Associates the previous slot in an ordered list
domain: Slot
range: Slot

Non-Residential Building
type: Class
comment: A non-residential building is a building at least half of which is used for other than residential purposes.
subclass of: Building

Door
type: Class
comment: the large flat piece of wood, glass etc that you move when you go into or out of a building, room, vehicle etc, or when you open a cupboard (Longman Dictionary of Contemporary English Online)
subclass of: Horizontal Passage

Lower
type: InverseFunctionalProperty
type: ObjectProperty
comment: Associates the lower storey in a building.
domain: Building Storey
range: Building Storey
inverse of: Upper

Upper
type: FunctionalProperty
type: ObjectProperty
comment: Associates the upper storey in a building.
domain: Building Storey
range: Building Storey

Located In
type: ObjectProperty
comment: States the location of any social unit, activity, event, physical space, or a point of interest at any other physical space.
domain: Class
  union of: Activity
  union of: Event
  union of: Point Of Interest
  union of: Route Element
  union of: Social Unit
  union of: Space
range: Class
  union of: Route
  union of: Route Element
  union of: Space

has item
type: ObjectProperty
comment: An item of a slot in an ordered list.
domain: Slot

Suite
type: Class
comment: A suite of rooms usually on one floor of an apartment house (Cambridge English Dictionary). This term is normally used in hotels, resorts, guesthouses, etc.
subclass of: Building Space

Greenhouse
type: Class
comment: A building, room, or zone, usually chiefly of glass, in which the temperature is maintained within a desired range, used for cultivating tender plants or growing plants out of season.
subclass of: Building Space

Rare Deviate
type: NamedIndividual
comment: This instance is used to express when someone rarely deviates while following the provided path.

Event Impact
type: Class
comment: A parameter to express the impact of an event on a specific person (or type of persons) in terms of any specific value or a type.
subclass of: Parameter
subclass of: Restriction
  cardinality: 1
  on property: Of Event
subclass of: Restriction
  cardinality: 1
  on property: Has Impact
subclass of: Restriction
  all values from: Event
  on property: Of Event
subclass of: Restriction
  all values from: Impact
  on property: Has Impact
subclass of: Restriction
  all values from: Social Unit
  on property: For Person

Availability Status
type: Class
comment: It expresses the status of something that is either available or not.
equivalent class: Class
  one of: Available
  one of: Unavailable

Sensor Event
type: Class
comment: This concept is used to express an event detected by any sensor.
subclass of: Event

Horizontal Moving Pavement
type: Class
comment: A slow-moving conveyor mechanism that transports people across a horizontal plane over a short to medium distance.
subclass of: Moving Pavement
subclass of: Horizontal Passage
disjoint with: Vertical Moving Pavement

Building Exit
type: Class
comment: A logical point that is used to represent the exit of a building.
subclass of: Exit

Moving Pavement
type: Class
comment: A slow-moving conveyor mechanism that transports people across a horizontal or inclined plane over a short to medium distance (Oxford Dictionary of English).
subclass of: Building Space

Bedroom
type: Class
comment: Bedroom is used mainly for sleeping.
subclass of: Room

Space
type: Class
comment: A physical, three dimensional, and one of the most important elements in the design of architecture that can further be divided to create more spaces from it.
subclass of: Restriction
  on class: Availability Status
  on property: Has Availability Status
  qualified cardinality: 1

Fire Escape Ladder
type: Class
comment: A type of ladder which is used to make an emergency exit through the window out of fire accident site.
subclass of: Passive Fire Protection

Handheld Device
type: Class
comment: A smart device or a computer that is small enough to be used while holding it in the hands.
subclass of: Device

Entrance
type: Class
comment: Entrance represents a space or a door that is used to enter into a building. Normally, it is also used as an exit.
subclass of: Transition Point

Earthquake
type: Class
comment: A sudden violent shaking of the ground, typically causing great destruction, as a result of movements within the earth's crust or volcanic action (Oxford Dictionary of English). It may cause a sudden panic among the occupants of the building.
subclass of: Incident

Quality
type: Class
comment: A degree or grade of excellence or worth.

Open Area Entrance
type: Class
comment: A logical point that is used to represent the entrance to an open area.
subclass of: Entrance

Space Saftey
type: Class
comment: A parameter to express the safety of any space for a specific person (or type of persons) in terms of some value.
subclass of: Parameter
subclass of: Restriction
  cardinality: 1
  on property: Value
subclass of: Restriction
  all values from: float
  on property: Value
subclass of: Restriction
  cardinality: 1
  on property: Of Space
subclass of: Restriction
  all values from: Person
  on property: For Person
subclass of: Restriction
  on property: Of Space
  some values from: Class
    union of: Route Element
    union of: Space

Length
type: FunctionalProperty
type: DatatypeProperty
comment: The measurement or extent of something from end to end (Oxford Dictionary of English).
domain: Class
  union of: Ordered List
  union of: Group
  union of: Passage
  union of: Space
range: float

Ability To Use Stairs
type: Class
comment: An ability to use the stairs. Note that the people on the wheelchair are not considered to have this ability no matter the stairs have a stairlift and a ramp.
subclass of: Mobility Ability

Rolling
type: NamedIndividual
comment: A type of movement by turning over and over on an axis, usually performed by a person using a wheelchair,

Description
type: Class
comment: A representation and detail of a person, object, or event. It is used to describe the details of anything.

Family
type: Class
comment: A group of two or more persons having family ties between them.
subclass of: Group

Mental Impaired Person
type: Class
comment: A person having mental impairment in which one's mind is damaged or is not working properly and one have issues such as consciousness, orientation, concentration.
subclass of: Impaired Person

Visiting Group
type: Class
comment: A group of two or more people that has the same objective of visiting any space.
subclass of: Group

When someone is deviating from the provided path.
type: NamedIndividual
label: Deviating From Path

Has Number
type: DatatypeProperty
comment: A number assigned to anything.
domain: Thing
range: integer

Emergency Activity
type: Class
comment: An activity that is done with an urgency and highest priority.
subclass of: Activity

Lobby
type: Class
comment: An entrance hall, corridor, or vestibule, as in a public building, often serving as an anteroom; foyer.
subclass of: Building Space

Picking Up Dependents
type: NamedIndividual
comment: This instance is used to express when someone is picking up the dependent member of one's group.

Assigned Route
type: ObjectProperty
comment: A set of connected spaces(normally in the form of rdf:list) assigned to a social unit.
domain: Social Unit
range: Route

Low Stamina Person
type: Class
comment: It is the unability to sustain physical or mental activity to a normal level.
subclass of: Physically Impaired Person

Has Impact
type: ObjectProperty
comment: A property to express the impact of a particular sbeo:Activity or sbeo:Event.
domain: Class
  union of: Activity Impact
  union of: Event Impact
range: Impact

Slot
type: Class
comment: A slot in an ordered list with a fixed index.
subclass of: Restriction
  cardinality: 1
  on property: has index
subclass of: Restriction
  max cardinality: 1
  on property: has previous
subclass of: Restriction
  max cardinality: 1
  on property: has ordered list
subclass of: Restriction
  max cardinality: 1
  on property: has next

Age
type: FunctionalProperty
type: DatatypeProperty
comment: The age of the person.
domain: Person

Kids Area
type: Class
comment: A place where infants or young children can play which is surrounded by a boundary normally. It can be both indoor and outdoor.
subclass of: Building Space

Following Path
type: NamedIndividual
comment: This instance is used to express when someone is following one's provided path.

Navigational Point
type: Class
comment: It is a special type of point that connects more than two corridors or enforce change of direction to users or indicate the end of corridors.
subclass of: Route Point

Shopping Mall Building
type: Class
comment: A set of one or more buildings forming a complex of shops representing merchandisers, with interconnecting walkways enabling visitors to easily walk from unit to unit, along with a parking area.
subclass of: Mercantile Building

Ended At Time
type: DatatypeProperty
comment: The time at which an activity ended.
domain: Class
  union of: Activity
  union of: Event
range: float
property disjoint with: Started At Time

Room Segment
type: Class
comment: A traversable part in a room that is usually used to go the exit or the other part of the room.
subclass of: Horizontal Passage

First Name
type: DatatypeProperty
comment: The first name of the person.
domain: Person

Residential Building
type: Class
comment: A residential building is a building at least half of which is used for residential purposes.
subclass of: Building

Business Building
type: Class
comment: Places where services are provided. Examples: banks, insurance agencies.
subclass of: Non-Residential Building

Incident
type: Class
comment: An event or occurance that can be dangerous for the occupants of the building.
subclass of: Event
subclass of: Restriction
  on property: Has Intensity
  some values from: Intensity

Emergency Evacuation
type: Class
comment: It represents an immediate escape of people away from a particular area that has ongoing or imminent hazard to their lives or property.
subclass of: Emergency Activity

Person Ability
type: Class
comment: A parameter to express the quality of an ability a specific person (or type of persons) own.
subclass of: Parameter
subclass of: Restriction
  cardinality: 1
  on property: Has Quality
subclass of: Restriction
  cardinality: 1
  on property: Has Ability
subclass of: Restriction
  all values from: Quality
  on property: Has Quality
subclass of: Restriction
  all values from: Ability
  on property: Has Ability
subclass of: Restriction
  all values from: Person
  on property: For Person

Waiting Zone
type: Class
comment: A space (normally with seating), where people can wait to do some specific activity. During emergency condtions, it is also used for several purposes, such as unification of people with their family members, acquaintances or emergency rescue teams, etc.
subclass of: Route Point

Image Description
type: Class
comment: A type of description in which images are given to provide information about any entity.
subclass of: Description

Activity
type: Class
comment: A process that a person, group of persons, or machine does during a specific amount of time, such as visiting, shopping, etc.
subclass of: Restriction
  on property: Has Intensity
  some values from: Intensity

Mild Hearing Impaired Person
type: Class
comment: A person who is only able to hear the sounds that are between 25 and 40 dB.
subclass of: Hearing Impaired Person

Role In Context
type: Class
comment: A concept to express that an agent is playing a role in a given context.
subclass of: Restriction
  on class: Role
  on property: Role
  qualified cardinality: 1
subclass of: Restriction
  cardinality: 1
  on property: Context
subclass of: Restriction
  min qualified cardinality: 1
  on class: Person
  on property: Player
subclass of: Restriction
  all values from: Role
  on property: Role
subclass of: Restriction
  all values from: Person
  on property: Player
subclass of: Restriction
  on property: Context
  some values from: Thing

Gender
type: FunctionalProperty
type: DatatypeProperty
comment: The gender of a person. It is typically but not necessarily 'male' or 'female'.
domain: Person

Severity
type: Class
comment: The quality of being hard to endure, uninviting or formidable.

Route
type: Class
comment: A set of connected spaces represented by a starting and ending point, that ultimately leads to some specific position or place.
subclass of: Ordered List
subclass of: Restriction
  on class: Availability Status
  on property: Has Availability Status
  qualified cardinality: 1

Blind Person
type: Class
comment: A person who has lost the vision completly and can neither see naturally nor with the help of any device.
subclass of: Visually Impaired Person

Navigational State
type: Class
comment: It models the user's navigational state while following the path.
equivalent class: Class
  one of: When someone is deviating from the provided path.
  one of: Following Path

Emergency Evacuation Route
type: Class
comment: A type of route in which only those spaces are mentioned that are potentially safe for its users as well as the ending point of it must be an exit from a particular space.
subclass of: Exit Route

Emergency Evacuation Group
type: Class
comment: A group of two or more persons who are supposed to evacuate the building together.
subclass of: Group