Season
type: Class
comment: A season is a division of the year marked by changes in weather.
subclass of: Time Interval

symbolic location
type: FunctionalProperty
type: ObjectProperty
comment: It indicates to which symbolic location that POI corresponds to (if any), such as the home or the workplace of the user or a public place (e.g. a cinema).
domain: POI
range: Symbolic Location

country
type: FunctionalProperty
type: ObjectProperty
comment: It indicates the country of a Location.
domain: POI
range: Country

Very Warm
type: Temperature
type: NamedIndividual

respiration
type: FunctionalProperty
type: DatatypeProperty
comment: This property indicates the respiration of a PhysiologicalState (in breaths per minute).
domain: Physiological State
range: Datatype
  on datatype: int
  with restrictions:
    min exclusive: 0

Recommender System Context
type: Ontology
comment: This ontology represent context which may be interesting in providing recommendations to users.
license: http://creativecommons.org/licenses/by/3.0/
contributor: Aleksandra Karpus
contributor: Krzysztof Goczyla
creator: Iacopo Vagliano
issued: 2016-05-04
modified: 2017-01-17
publisher: Polytechnic University of Turin
preferred namespace prefix: rsctx
preferred namespace uri: http://softeng.polito.it/rsctx#
imports: WeatherOntology.owl
imports: time
imports: DUL.owl
imports: deliverycontext.owl
imports: v2#
imports: http://rdfs.co/juso/0.1.2
imports: http://gumo.org/2.0/
imports: http://xmlns.com/foaf/0.1/
imports: emoca
imports: rooms
version info: 1.2

good
type: Fitness
type: NamedIndividual

Home
type: Anchor Point
type: NamedIndividual

Tropical season
type: Class
comment: Season which occur in hot regions. It includes the rainy (or wet, or monsoon) season and the dry season, In some tropical areas, a cool or mild season is also present. WARNING This class has just the purpose to organize the seasons. It SHOULD NOT have instances.
subclass of: Season
equivalent class: Class
  one of: Mild Season
  one of: Wet Season
  one of: Dry Season

cognitive load
type: Mental State
type: NamedIndividual

transportation mean
type: ObjectProperty
comment: It indicates which TransportationMean the user is using or is going to use.
domain: Environment
range: Transportation Mean

worry
type: Emotional State
type: NamedIndividual

season
type: FunctionalProperty
type: ObjectProperty
comment: It indicates the season in which a Time is included in.
domain: Time
range: Season

in fit
type: Fitness
type: NamedIndividual

injured
type: Fitness
type: NamedIndividual

day of week
type: FunctionalProperty
type: ObjectProperty
comment: This property indicates the day of week of a Time.
domain: Time
range: Day Of Week

Taxi
type: Transportation Mean
type: NamedIndividual

Cold
type: Temperature
type: NamedIndividual

Region
type: Class
comment: A political or geographical region. WARNING dbpedia-owl represents regions too but it refer to broader sense of region which include any area which is possible to distinguish in geography. In this sense any other geographical unit defined in this ontology (such as country, province, etc.) is a region, while we intend only to represent geographical regions or specific administrative area named regions in some countries (e.g. Italy, France, Belgium).

has physiological state
type: FunctionalProperty
type: ObjectProperty
comment: This property indicates the phsysiological state of a user.
domain: User
range: Physiological State

tired
type: Fitness
type: NamedIndividual

Noise Level
type: Class
comment: This class represents the current level of noise. It is intended a symbolic level such as very noisy, silent, etc.

Pleasant
type: Temperature
type: NamedIndividual

Temperature
type: Class
comment: It represents the exterior temperature by means of a symbolic value, such as warm or cool. TODO Map the individuals with temperature ranges?
subclass of: WeatherPhenomenon
equivalent class: Class
  one of: Hot
  one of: Warm
  one of: Freezing
  one of: Very Cold
  one of: Mild
  one of: Cool
  one of: Cold
  one of: Pleasant
  one of: Very Warm

Night
type: Part of Day
type: NamedIndividual
comment: The period of time between the sunset and the sunrise when the Sun is below the horizon.The mapping with respect the hours is possible but not defined becaus it may vary with the location and the habits.

Spring
type: Season
type: NamedIndividual

relief
type: Emotional State
type: NamedIndividual

anxiety
type: Emotional State
type: NamedIndividual

region
type: FunctionalProperty
type: ObjectProperty
comment: It indicates the Region of a Location.
domain: POI
range: Region

shame
type: Emotional State
type: NamedIndividual

exterior temperature
type: FunctionalProperty
type: DatatypeProperty
comment: It indicates the exterior temperature in degree Celsius.
domain: WeatherState
range: decimal

lighting
type: FunctionalProperty
type: DatatypeProperty
comment: It indicates the light level in lux.
domain: Environment
range: Datatype
  on datatype: decimal
  with restrictions:
    min exclusive: 0

Mental State
type: Class
comment: A mental condition in which the qualities of a state are relatively constant even though the state itself may be dynamic, such as depression, cognitive load, nervousness. WARNING The possible values are represented as individuals while in the GUMO ontology are classes.
equivalent class: MentalState.700017
equivalent class: Class
  one of: trauma
  one of: time pressure
  one of: hypnosis
  one of: cognitive load
  one of: irritation
  one of: nervousness
  one of: trance
  one of: psychopathy
  one of: depression

Summer
type: Season
type: NamedIndividual

Symbolic Location
type: Class
comment: In general, it represents an abstract ideas of where an object is (e.g. next to a mailbox). In the context of the ontology, it can be an anchor point (i.e. a frequently visited location) or a public place or the anchor point of another user. WARNING Other kind of symbolic location such as bankomat, mailbox, or a train approaching Dublin are not considered.

is holiday
type: FunctionalProperty
type: DatatypeProperty
comment: This property indicates if a Time is holiday or a working day.
domain: Time
range: boolean

Freezing
type: Temperature
type: NamedIndividual

first level administrative division
type: FunctionalProperty
type: ObjectProperty
comment: It indicates the first level administrative division of a Location.
domain: POI
range: FirstLevelAdministrativeDivision

third level administrative division
type: FunctionalProperty
type: ObjectProperty
comment: It indicates the third level administrative division of a Location.
domain: POI
range: ThirdLevelAdministrativeDivision

perspiration
type: FunctionalProperty
type: DatatypeProperty
comment: This property indicates the perspiration (in liters per hours) of a PhysiologicalState.
domain: Physiological State
range: Datatype
  on datatype: decimal
  with restrictions:
    min exclusive: 0

hypnosis
type: Mental State
type: NamedIndividual

Nobody
type: Class
comment: The user is alone.
subclass of: Companion

street
type: FunctionalProperty
type: ObjectProperty
comment: It indicates the Street of a Location.
domain: POI
range: Site

Calendar Season
type: Class
comment: Season which is generally recognized in temperate and subpolar regions, include summer, spring, winter and fall (or autumn). WARNING This class has just the purpose to organize the seasons. It SHOULD NOT have instances.
subclass of: Season
disjoint with: Tropical season
equivalent class: Class
  one of: Spring
  one of: Fall
  one of: Summer
  one of: Winter

depression
type: Mental State
type: NamedIndividual

Colleague
type: Class
comment: The user is with one or more colleagues.
subclass of: Companion

Part of Day
type: Class
comment: This class represents the time intervals in which a day can be divided in.
subclass of: Time Interval
equivalent class: Class
  one of: Night
  one of: Evening
  one of: Afternoon
  one of: Morning

Companion
type: Class
comment: Companion class indicates which kind of company the user as at the moment. For example, it may be with family, friends or colleagues. WARNING Its subclasses not as individual, because the individual could be a person (e.g. Bob or Alice), and it is an istance also of one of companion sublasses to indicate which in kind of companion the individual is for the user in the current context (e.g. is family or colleagues or friend).

Warm
type: Temperature
type: NamedIndividual

Partner
type: Class
comment: The user is with her/his boyfriend/girlfriend or husband/wife.
subclass of: Companion

Purpose
type: Class
comment: The description of a situation that is desired by an Agent, and usually associated to a plan that describes how to actually achieve it. In the context of this ontology, it indicates the purpose of the item to be recommended. E.g. the user may be interested in receiving recommendation of movies for educating about a specific topic (for instance in the case of a teacher, which wants to show a movie in class) or for having fun (see a movie with some friends in the night).
comment: Purpose
equivalent class: Goal

Moderate
type: Traffic Level
type: NamedIndividual

floor
type: FunctionalProperty
type: ObjectProperty
comment: It indicates the Floor of a Location.
domain: POI
range: Floor

Administrative Region
type: Class
comment: A specific type of subnational entity in a number of countries, e.g. Belgium, Italy, France.
subclass of: Region

nervousness
type: Mental State
type: NamedIndividual

hate
type: Emotional State
type: NamedIndividual

time
type: FunctionalProperty
type: ObjectProperty
comment: It indicates the time associated to the Environment.
domain: Environment
range: Time
sub property of: time

district
type: FunctionalProperty
type: ObjectProperty
comment: It indicates the District of a Location.
domain: POI
range: District

has fitness
type: FunctionalProperty
type: ObjectProperty
comment: This property indicates the fitness of a user.
domain: User
range: Fitness

Public Place
type: Class
comment: A public place such as a cinema or a theatre. WARNING It is a class and not an individual because the individual can be a specific cinema or theatre (e.g. La Scala theatre in Milan).
subclass of: Symbolic Location

sadness
type: Emotional State
type: NamedIndividual

Bike
type: Transportation Mean
type: NamedIndividual
label: Bicycle

has purpose
type: ObjectProperty
comment: This property indicates the purpose of a user. WARNING schema:purpose has different domain (three possible classes) and different ranges (2 possible classes). Although one range is Thing, which would enable to consider this porperty as subproperty of schema.org we should add a class in domain, while for the scopes of this ontology only Environment as domain is proper.
domain: Environment
range: Purpose
sub property of: topObjectProperty

province
type: FunctionalProperty
type: ObjectProperty
comment: province
comment: It indicates the Proince of a Location.
domain: POI
range: Province

Time Interval
type: Class
comment: A period of time between two instants.
subclass of: ProperInterval

Geographical Region
type: Class
comment: A physical or historical region. Such as the Iberian peninsula or the Northwest European Atlantic Protestant Region (i.e. the European "source regions" in early American colonization efforts).
subclass of: Region

great
type: Fitness
type: NamedIndividual

hour
type: FunctionalProperty
type: ObjectProperty
comment: This property indicates the hour which a Time is included.
domain: Time
range: Hour

Wet Season
type: Season
type: NamedIndividual
label: Rainy Season
label: Monsoon Season

No transportation mean
type: Transportation Mean
type: NamedIndividual

Dry Season
type: Season
type: NamedIndividual

parish
type: FunctionalProperty
type: ObjectProperty
comment: parish
comment: It indicates the Parish of a Location.
domain: POI
range: Parish

noise level
type: FunctionalProperty
type: ObjectProperty
comment: It indicates a NoiseLevel
domain: Environment
range: Noise Level

device
type: FunctionalProperty
type: ObjectProperty
comment: The property associates a Device to a Context. WARNING It is useful only if we need the property being functional, otherwise prissma:device should be used.
domain: Context
range: Device
sub property of: device

blood preassure
type: FunctionalProperty
type: DatatypeProperty
comment: This property indicates the blood pressure (in mmHg) of a PhysiologicalState
domain: Physiological State
range: Datatype
  on datatype: int
  with restrictions:
    min exclusive: 0

satisfaction
type: Emotional State
type: NamedIndividual

body temperature
type: FunctionalProperty
type: DatatypeProperty
comment: This property indicates the temperature (in degree Celsius) of a PhysiologicalState.
domain: Physiological State
range: Datatype
  on datatype: decimal
  with restrictions:
    min exclusive: 0

irritation
type: Mental State
type: NamedIndividual

budget
type: FunctionalProperty
type: DatatypeProperty
comment: It indicates how much the user want or can spend (for example for a travel or a purchase or to go for a dinner in a restaurant).
domain: Environment
range: Datatype
  on datatype: decimal
  with restrictions:
    min exclusive: 0

Traffic Level
type: Class
comment: This class represents the current traffic situation.
equivalent class: Class
  one of: Moderate
  one of: Chaotic
  one of: Calm

joy
type: Emotional State
type: NamedIndividual

sleepy
type: Fitness
type: NamedIndividual

city
type: FunctionalProperty
type: ObjectProperty
comment: It indicates the city of a Location.
domain: POI
range: City

Car
type: Transportation Mean
type: NamedIndividual

address
type: FunctionalProperty
type: DatatypeProperty
comment: It indicates the address of a location
domain: POI
range: string

Winter
type: Season
type: NamedIndividual

psychopathy
type: Mental State
type: NamedIndividual

confusion
type: Emotional State
type: NamedIndividual

disgust
type: Emotional State
type: NamedIndividual

fatigue
type: FunctionalProperty
type: DatatypeProperty
comment: This property indicates the fatigue of a PhysiologicalState. It is represented as string because there are scales such as Samm-Perelli seven point scale and karolinska sleepiness scale with some numbers associated to a string.
domain: Physiological State
range: string

ill
type: Fitness
type: NamedIndividual

Kid
type: Class
comment: The user is with children, not necessarily his family: for example may be a teacher or a baby sitter.
label: Child
subclass of: Companion

Cool
type: Temperature
type: NamedIndividual

federated state
type: FunctionalProperty
type: ObjectProperty
comment: It indicates the FederatedState of a Location.
domain: POI
range: FederatedState

Afternoon
type: Part of Day
type: NamedIndividual
comment: The time of the day between noon and evening. The mapping with respect the hours is possible but not defined because it may vary with the location and the habits.

Weekend
type: Class
comment: This class indicates the days which made up the weekend (typically not working).
subclass of: Day Of Week
disjoint with: Weekday
equivalent class: Class
  one of: Sunday
  one of: Saturday

Weekday
type: Class
comment: This class includes the day of the week which are typically working (if is not holiday). Days from Monday to Friday are weekdays.
subclass of: Day Of Week
equivalent class: Class
  one of: Monday
  one of: Wednesday
  one of: Thursday
  one of: Friday
  one of: Tuesday

weak
type: Fitness
type: NamedIndividual

nourishment
type: FunctionalProperty
type: DatatypeProperty
comment: This property indicates the nourishment (in BMI) of a PhysiologicalState.
domain: Physiological State
range: Datatype
  on datatype: decimal
  with restrictions:
    min exclusive: 0

activity
type: ObjectProperty
comment: This property indicates the activity of a user. WARNING Useful only if need domain and ranges, otherwise it is enough to use ao:activity.
domain: Environment
range: Activity
sub property of: activity

pupil dilation
type: FunctionalProperty
type: DatatypeProperty
comment: This property indicates the pupil dilation (in mm) of a PhysiologicalState.
domain: Physiological State
range: Datatype
  on datatype: int
  with restrictions:
    min exclusive: 0

heartbeat
type: FunctionalProperty
type: DatatypeProperty
comment: This property indicates the heartbeat of a PhysiologicalState
domain: Physiological State
range: Datatype
  on datatype: int
  with restrictions:
    min exclusive: 0
sub property of: topDataProperty

Morning
type: Part of Day
type: NamedIndividual
comment: The period of time between midnight and noon or, more commonly, the interval between sunrise and noon.

Time
type: Class
comment: Time is an instant, i.e. a timestamp. Then it can be characterized by some TimeIntervals which it belongs to, such as winter, Monday and morning.
subclass of: Instant

time pressure
type: Mental State
type: NamedIndividual

Physiological State
type: Class
comment: The state of the body or bodily functions. WARNING The subclasses of PhysiologicalState in GUMO ontology are represented as datatype properties.
equivalent class: PhysiologicalState.700016

Supervisor
type: Class
comment: The user is with his boss. This may be a more formal situation that being with just the colleagues.
label: Superior
label: Manager
label: Chief
label: Boss
subclass of: Companion

anger
type: Emotional State
type: NamedIndividual

part of day
type: FunctionalProperty
type: ObjectProperty
comment: This property indicates part of the day in which a Time is included in.
domain: Time
range: Part of Day

room
type: FunctionalProperty
type: ObjectProperty
comment: It indicates the Room of a Location.
domain: POI
range: Room

Day Of Week
type: Class
comment: This class indicates the day of the week (such as Monday, Tuesday, etc.).
subclass of: DayOfWeek
subclass of: Time Interval

noise
type: FunctionalProperty
type: DatatypeProperty
comment: It indicates the noise in decibel.
domain: Environment
range: Datatype
  on datatype: decimal
  with restrictions:
    min exclusive: 0

Calm
type: Traffic Level
type: NamedIndividual

hope
type: Emotional State
type: NamedIndividual

Light Level
type: Class
comment: This class represent the current level of light. It is intended some symbolic level such as dark, sunlight, etc.

Hour
type: Class
comment: The hours of a day.
subclass of: Time Interval
equivalent class: Class
  one of: http://softeng.polito.it/rsctx#18
  one of: http://softeng.polito.it/rsctx#19
  one of: http://softeng.polito.it/rsctx#14
  one of: http://softeng.polito.it/rsctx#15
  one of: http://softeng.polito.it/rsctx#16
  one of: http://softeng.polito.it/rsctx#17
  one of: http://softeng.polito.it/rsctx#10
  one of: http://softeng.polito.it/rsctx#11
  one of: http://softeng.polito.it/rsctx#12
  one of: http://softeng.polito.it/rsctx#13
  one of: http://softeng.polito.it/rsctx#07
  one of: http://softeng.polito.it/rsctx#08
  one of: http://softeng.polito.it/rsctx#09
  one of: http://softeng.polito.it/rsctx#20
  one of: http://softeng.polito.it/rsctx#03
  one of: http://softeng.polito.it/rsctx#04
  one of: http://softeng.polito.it/rsctx#05
  one of: http://softeng.polito.it/rsctx#06
  one of: http://softeng.polito.it/rsctx#21
  one of: http://softeng.polito.it/rsctx#00
  one of: http://softeng.polito.it/rsctx#22
  one of: http://softeng.polito.it/rsctx#01
  one of: http://softeng.polito.it/rsctx#23
  one of: http://softeng.polito.it/rsctx#02

postal code
type: FunctionalProperty
type: DatatypeProperty
comment: It indicates the ZIP code of a Location.
domain: POI
label: ZIP code
range: string

trauma
type: Mental State
type: NamedIndividual

environment
type: FunctionalProperty
type: ObjectProperty
comment: The property associates an Environment to a Context. WARNING It is useful only if we need the property being functional, otherwise prissma:device should be used.
domain: Context
range: Environment
sub property of: environment

arousal
type: FunctionalProperty
type: DatatypeProperty
comment: This property indicates the arousal of a PhysiologicalState.
domain: Physiological State
range: string

fear
type: Emotional State
type: NamedIndividual

Motion
type: Class
comment: This class indicates if the user is moving and how, e.g. if he is walking or running.
equivalent class: Motion.700018

has emotional state
type: ObjectProperty
comment: This property indicates the emotional state of a user.
domain: User
range: Emotional State

light level
type: FunctionalProperty
type: ObjectProperty
comment: It indicates a LightLevel.
domain: Environment
range: Light Level

Business Partner
type: Class
comment: The user is with a business partner, e.g. a business partner can be a customer or a member of another organizations with which the user is collaborating or a supplier.
subclass of: Companion

building
type: FunctionalProperty
type: ObjectProperty
comment: It indicates the building associated to a location.
domain: POI
range: Building

desk
type: FunctionalProperty
type: ObjectProperty
comment: It indicates the Desk of a Location.
domain: POI
range: Desk

Comapanion's Home
type: Class
comment: The home of a companion of the user, such as a freind's home or a colleague's home. WARNING This piece of information can be hard to obtained (unless explicitly asked to the user). It is a class and not an individual because the individual is the specific house (e.g. my friend Bob's house).
subclass of: Symbolic Location

Evening
type: Part of Day
type: NamedIndividual
comment: The period of time near the end of the day, from the end of afternoon (usually from 6 PM) to nighttime. The mapping with respect the hours is possible but not defined becaus it may vary with the location and the habits.

trance
type: Mental State
type: NamedIndividual

neighborhood
type: FunctionalProperty
type: ObjectProperty
comment: It indicates the Neighborhood of a Location.
domain: POI
range: Neighborhood

Transportation Mean
type: Class
comment: It represents the transportation mean the user is using or is going to use (e.g. to reach a restaurant or to visit a city), such as car, bike, public transport or none (he is going on foot).
equivalent class: Class
  one of: Car
  one of: Bike
  one of: Public Transport
  one of: Taxi
  one of: No transportation mean

Chaotic
type: Traffic Level
type: NamedIndividual

available time
type: FunctionalProperty
type: ObjectProperty
comment: It indicates how much time the user can spend (e.g. to visit a city or to go for lunch in lunch brek at work).
domain: Environment
range: Time Interval

Friend
type: Class
comment: The user is with one or more friends.
subclass of: Companion

Mild
type: Temperature
type: NamedIndividual

Very Cold
type: Temperature
type: NamedIndividual

Family
type: Class
comment: The user is with his family, not necessarely with children. For instance, this may includes being just with the sister or brother or the parents.
subclass of: Companion

municipality
type: FunctionalProperty
type: ObjectProperty
comment: It indicates the Municipality of a Location.
domain: POI
range: Municipality

traffic level
type: FunctionalProperty
type: ObjectProperty
comment: It indicates a TrafficLevel
domain: Environment
range: Traffic Level

Emotional State
type: Class
comment: The state of a person's emotions (especially with regard to pleasure or dejection). WARNING The possible values are represented as individuals while in the GUMO ontology are classes.
subclass of: Emotion
equivalent class: EmotionalState.700014
equivalent class: Class
  one of: hope
  one of: confusion
  one of: satisfaction
  one of: pride
  one of: anxiety
  one of: relief
  one of: joy
  one of: excitement
  one of: dread
  one of: sadness
  one of: anger
  one of: disgust
  one of: shame
  one of: hate
  one of: happiness
  one of: fear
  one of: boredom
  one of: love
  one of: worry

exhaust
type: Fitness
type: NamedIndividual

Anchor Point
type: Class
comment: It is a key location, such as our home and work place, that we consider as "anchor" in our understanding of the geographic environment where we live. In general, an anchor-point is a frequently visited location or a location where one spends a lot of time.
subclass of: Symbolic Location
equivalent class: Class
  one of: Work Place
  one of: Home

has temperature
type: FunctionalProperty
type: ObjectProperty
comment: This property indicates a symbolic value for the temperature (such as warm, cold, etc.). WARNING Although there was already a temperature class and a temperature property (hw:hasExteriorTemperature) in the WeatherOntology, temperature class has been redefined with values more general and not referred to the house (such as below room temperature). Thus this property has the redefined temperature class as a range.
domain: WeatherState
range: Temperature
sub property of: hasWeatherPhenomenon

weather
type: FunctionalProperty
type: ObjectProperty
comment: It indicates the weather associated to the current context.
domain: Environment
range: WeatherState

injury
type: DatatypeProperty
comment: This property indicates the injury of a PhysiologicalState
domain: Physiological State
range: string

dread
type: Emotional State
type: NamedIndividual

pride
type: Emotional State
type: NamedIndividual

site
type: FunctionalProperty
type: ObjectProperty
comment: It indicates the Site of a Location.
domain: POI

county
type: FunctionalProperty
type: ObjectProperty
comment: It indicates the county of a Location.
domain: POI
range: County

companion
type: ObjectProperty
comment: This property indicates who is the current companion of the user, e.g. a friend a family member or a colleague.
domain: Environment
range: Companion

has mental state
type: ObjectProperty
comment: This property indicates the mental state of a user.
domain: User
range: Mental State

second level administrative division
type: FunctionalProperty
type: ObjectProperty
comment: It indicates the second level administrative division of a Location.
domain: POI
range: SecondLevelAdministrativeDivision

fifth level administrative division
type: FunctionalProperty
type: ObjectProperty
comment: It indicates the Fifth Level Administrative DIvision of a Location.
domain: POI
range: FifthLevelAdministrativeDivision

excitement
type: Emotional State
type: NamedIndividual

love
type: Emotional State
type: NamedIndividual

user
type: FunctionalProperty
type: ObjectProperty
comment: The property associates a User to a Context. WARNING It is useful only if we need the property being functional, otherwise prissma:user should be used.
domain: Context
range: User
sub property of: user

Fall
type: Season
type: NamedIndividual
label: Autumn

boredom
type: Emotional State
type: NamedIndividual

happiness
type: Emotional State
type: NamedIndividual

has motion
type: FunctionalProperty
type: ObjectProperty
comment: This property indicates the motion of a user. WARNING Useful only if need domain and ranges, otherwise it is enough to use ao:activity.
domain: Environment
range: Motion
sub property of: string

poi
type: FunctionalProperty
type: ObjectProperty
comment: The property associates a POI to a prissma:Environment WARNING It is useful only if we need the property being functional, otherwise prissma:poi should be used.
domain: Environment
range: POI
sub property of: poi

fourth level administrative division
type: FunctionalProperty
type: ObjectProperty
comment: It indicates the fourth level administrative division of a Location.
domain: POI
range: FourthLevelAdministrativeDivision

Mild Season
type: Season
type: NamedIndividual
label: Cool season

Work Place
type: Anchor Point
type: NamedIndividual

Hot
type: Temperature
type: NamedIndividual

Fitness
type: Class
comment: It is a value partition which represents the health of the body, it can be seen as a summary of physiological state, since it is possible to map fitness values with physiological indicators ranges (e.g. ill if temperature greater than a certain threshold), although this is up to the designer which is using the ontology.
equivalent class: Class
  one of: good
  one of: great
  one of: exhaust
  one of: ill
  one of: sleepy
  one of: weak
  one of: in fit
  one of: tired
  one of: injured

Public Transport
type: Transportation Mean
type: NamedIndividual

floor section
type: FunctionalProperty
type: ObjectProperty
comment: It indicates the FloorSection of a Location.
domain: POI
range: FloorSection