ownership relation has source
type: ObjectProperty
comment: Connects an Ownership Relation to a Person, Group or Position that is involved as an owner.
domain: Ownership Relation
range: Class
  union of: Group
  union of: Person
  union of: Position
sub property of: authority relation has source
inverse of: agent is source of ownership relation

has or had name
type: ObjectProperty
comment: Connects a Thing to one of its past or present Names.
domain: Thing
range: Name
sub property of: has or had appellation
inverse of: is or was name of
change note: changed the IRI, label, inverse property IRI, textual definition, super property IRI (the name of this property in RiC-O 0.1 was "hasName").
  date: 2021-01-22

agent or activity is target of provenance relation
type: ObjectProperty
comment: Connects an Agent or Activity that is the provenance of a Record resource or Instantiation, to a Provenance Relation
domain: Class
  union of: Activity
  union of: Agent
range: Provenance Relation
sub property of: thing is target of relation
inverse of: provenance relation has target

Authority record
type: Documentary Form Type
type: Concept
type: NamedIndividual
definition: This category can be used for records that describe an entity.
in scheme: Documentary Form Types

scope and content
type: DatatypeProperty
comment: Summary of the scope (such as time periods, geography) and content (such as subject matter, administrative processes) of the Record Resource. It should highlight the information conveyed in the Record Resource, why it was created, received, and/or maintained, and the Agents connected to it. Scope and Content provides a more complete summary of the informational content of the Record Resource. It may include description of relations with agents, activities, dates and places, or with other record resources. It is not to be confused with the History attribute which focuses on the origination and subsequence changes to a Record Resource.
domain: Record Resource
range: Literal
change note: Text definition updated. Examples added. Objective: to make RiC-O compliant with RiC-CM v0.2.
  date: 2020-11-01
example: Se hace referencia a construcción del Gran Hotel, iniciada en 1899 bajo el nombre de Casa Celestino. Tras su interrupción en 1902, continuó la obra ya con su nombre actual. @es
example: Includes a detailed list of the lands and villages given by the King to the Abbey.
example: Among the witnesses, the duke of Normandy.
example: Letter from Vlad the Impaler (Dracula) to the Council of Kronstadt asking them to send military support against the Ottomans, within the framework of their alliance treaty.
example: The author explains why he does not agree with the decision made and adds that it cannot be applied.
RiC-CM corresponding component: Corresponds to RiC-A38 (Scope and Content attribute)

Provenance Relation
type: Class
comment: Specifies the provenance or origin of at least one Record Resource or Instantiation, for example the relation between a Record Resource and the Agent which created it or the Activity from which it resulted.
subclass of: Relation
subclass of: Restriction
  min qualified cardinality: 1
  on class: Class
    union of: Activity
    union of: Agent
  on property: provenance relation has target
subclass of: Restriction
  min qualified cardinality: 1
  on class: Class
    union of: Instantiation
    union of: Record Resource
  on property: provenance relation has source
scope note: This relation stands for organic and for functional provenance.

is or was leader of
type: ObjectProperty
comment: Connects a Person to the Group that Person leads or led in the past.
domain: Person
range: Group
sub property of: is or was controller of
inverse of: has or had leader
property chain axiom: person is source of leadership relation
property chain axiom: leadership relation has target
change note:
  value: changed the IRI, label, inverse property IRI, super property IRI, textual definition (changed made in order to make RiC-O compliant with RiC-CM 0.2; the name of this property in RiC-O 0.1 was "isLeaderOf").
  date: 2021-01-22
RiC-CM corresponding component: RiC-R042 ('is or was leader of' relation)

has or had language
type: ObjectProperty
comment: Connects an Agent or Record Resource to a Language that it uses or used.
domain: Class
  union of: Agent
  union of: Record
  union of: Record Part
range: Language
sub property of: is related to
inverse of: is or was language of
change note: changed the IRI, label, inverse property IRI and textual definition (the name of this property in RiC-O 0.1 was "hasLanguage").
  date: 2021-01-22

Concept
type: Class
comment: An idea, unit of thought, abstract cultural object or category
subclass of: Thing

Record Resource Genetic Relation
type: Class
comment: Connects two to more Record Resources when there is a genetic relation between them. Genetic in this sense is as defined by diplomatics, i.e. the process by which a Record Resource is developed.
subclass of: Record Resource to Record Resource Relation
subclass of: Restriction
  min qualified cardinality: 2
  on class: Record Resource
  on property: record resource genetic relation connects
RiC-CM corresponding component: Class implementation of RiC-R023 and RiC-023i relations

date qualifier
type: DatatypeProperty
comment: Indicates the precision of a date. It specifies if, and to what extent, the value is an estimation.
domain: Date
range: Literal
change note: examples added. Objective: to make RiC-O compliant with RiC-CM v0.2.
  date: 2020-11-01
example: during
example: exact
example: circa
RiC-CM corresponding component: Corresponds to RiC-A13 (Date Qualifier attribute)

agent is source of agent temporal relation
type: ObjectProperty
comment: Connects a predecessor Agent to an Agent Temporal Relation
domain: Agent
range: Agent Temporal Relation
sub property of: thing is source of temporal relation
sub property of: agent is connected to agent relation
inverse of: agent temporal relation has source

has receiver
type: ObjectProperty
comment: Connects a Record Resource or an Instantiation to the Agent that receives it in the course of its activities.
domain: Class
  union of: Instantiation
  union of: Record Resource
range: Agent
sub property of: has accumulator
inverse of: is receiver of
change note: changed the IRI, label, inverse property IRI, super property IRI (changed made in order to make RiC-O compliant with RiC-CM 0.2; the name of this property in RiC-O 0.1 was "receivedBy").
  date: 2021-01-22
RiC-CM corresponding component: RiC-R029 ('has receiver' relation)

is or was title of
type: ObjectProperty
comment: Connects a Title to a Record Resource, Instantiation or Rule that it designated or designates.
domain: Title
range: Class
  union of: Instantiation
  union of: Record Resource
  union of: Rule
sub property of: is or was name of
inverse of: has or had title
change note: changed the IRI, label, inverse property IRI, text definition, super property IRI (the name of this property in RiC-O 0.1 was "isTitleOf").
  date: 2021-01-22

record resource is source of record resource to instantiation relation
type: ObjectProperty
comment: Connects a Record Resource (that was instantiated) to a Record Resource To Instantiation Relation
domain: Record Resource
range: Record Resource to Instantiation Relation
sub property of: thing is source of relation
inverse of: record resource to instantiation relation has source

has or had corporate body type
type: ObjectProperty
comment: Connects a Corporate Body to a Corporate Body Type which categorizes or categorized it.
domain: Corporate Body
range: Corporate Body Type
sub property of: has or had category
inverse of: is or was corporate body type of
change note: changed the IRI, label, inverse property IRI, textual definition (the name of this property in RiC-O 0.1 was "hasCorporateBodyType").
  date: 2021-01-22

is carrier type of
type: ObjectProperty
comment: Connects a Carrier Type to an Instantiation whose carrier it categorizes.
domain: Carrier Type
range: Instantiation
sub property of: is or was category of
inverse of: has carrier type
change note: Changed the super property IRI.
  date: 2021-01-22

technical characteristics
type: DatatypeProperty
comment: Describes any relevant physical or software feature of any device involved in the creation or management of a Record Resource.
domain: Mechanism
range: Literal
change note: Scope note and examples added. Objective: to make RiC-O compliant with RiC-CM v0.2.
  date: 2020-11-01
example: Hubble Space Telescope had until 2002 a flawed mirror that introduced severe spherical aberration for the images.
scope note: Does not include references to the workflow that the Mechanism is involved in which is described under the Activity entity. It emphasizes those features that provide a better understanding of the impact of the Mechanism on the records.
RiC-CM corresponding component: Corresponds to RiC-A41 (Technical Characteristics attribute)

is or was responsible for enforcing
type: ObjectProperty
comment: Inverse of 'is or was enforced by' object property.
domain: Agent
range: Rule
sub property of: is associated with rule
inverse of: is or was enforced by
change note:
  value: changed the IRI, label, inverse property IRI, text definition, corresponding CM component name (changed made in order to make RiC-O compliant with RiC-CM 0.2; the name of this property in RiC-O 0.1 was "isResponsibleForEnforcing").
  date: 2021-01-22
RiC-CM corresponding component: RiC-R066i ('is or was responsible for enforcing' relation)

Position Holding Relation
type: Class
comment: Connects at least one Person, and at least one Position that the Person occupies.
subclass of: Agent Relation
subclass of: Restriction
  min qualified cardinality: 1
  on class: Position
  on property: position holding relation has target
subclass of: Restriction
  min qualified cardinality: 1
  on class: Person
  on property: position holding relation has source
RiC-CM corresponding component: Class implementation of RiC-R054 and RiC-R054i relations

has derived instantiation
type: ObjectProperty
comment: Connects an Instantiation to an Instantiation that is derived from it.
domain: Instantiation
range: Instantiation
sub property of: precedes in time
sub property of: is instantiation associated with instantiation
inverse of: is derived from instantiation
property chain axiom: instantiation is source of derivation relation
property chain axiom: derivation relation has target
RiC-CM corresponding component: RiC-R014 ('has derived instantiation' relation)

record resource or instantiation is source of agent origination relation
type: ObjectProperty
comment: Connects a Record Resource or Instantiation (that is created, sent or accumulated) to an Agent Origination Relation.
domain: Class
  union of: Instantiation
  union of: Record Resource
range: Agent Origination Relation
sub property of: record resource or instantiation is source of provenance relation
inverse of: agent origination relation has source

descendance relation has target
type: ObjectProperty
comment: Connects a Descendance Relation to one of the descendant Persons
domain: Descendance Relation
range: Person
sub property of: family relation connects
sub property of: agent temporal relation has target
inverse of: person is target of descendance relation

creation with role
type: ObjectProperty
comment: Connects a Creation Relation to the Role Type that the creator Agent(s) has in the creation process
domain: Creation Relation
range: Role Type
sub property of: relation has context
inverse of: role is context of creation relation

functional equivalence relation connects
type: ObjectProperty
comment: Connects a Functional Equivalence Relation to one of the functionally equivalent Instantiations.
domain: Functional Equivalence Relation
range: Instantiation
sub property of: instantiation to instantiation relation connects
inverse of: instantiation is connected to functional equivalence relation

has or had position
type: ObjectProperty
comment: Inverse of 'exists or existed in' object property.
domain: Group
range: Position
sub property of: is agent associated with agent
inverse of: exists or existed in
change note:
  value: changed the IRI, label, inverse property IRI, text definition, corresponding CM component name (changed made in order to make RiC-O compliant with RiC-CM 0.2; the name of this property in RiC-O 0.1 was "hasPosition").
  date: 2021-01-22
RiC-CM corresponding component: RiC-R056i ('has or had position' relation)

child relation has source
type: ObjectProperty
comment: Connects a Child Relation to a parent Person
domain: Child Relation
range: Person
sub property of: descendance relation has source
inverse of: person is source of child relation

has content of type
type: ObjectProperty
comment: Connects a Record or a Record Part to a Content Type which categorizes its content.
domain: Class
  union of: Record
  union of: Record Part
range: Content Type
sub property of: has or had category
inverse of: is content type of
change note: changed the text definition and superproperty IRI.
  date: 2021-01-22

issued by
type: ObjectProperty
comment: Connects a Rule to the Agent that issued or published the Rule.
domain: Rule
range: Agent
sub property of: is rule associated with
inverse of: is responsible for issuing
RiC-CM corresponding component: RiC-R065 ('issued by' relation)

is derived from instantiation
type: ObjectProperty
comment: Inverse of 'has derived instantiation' object property.
domain: Instantiation
range: Instantiation
sub property of: follows in time
sub property of: is instantiation associated with instantiation
inverse of: has derived instantiation
RiC-CM corresponding component: RiC-R014i ('is derived from instantiation' relation)

is collector of
type: ObjectProperty
comment: Inverse of 'has collector' object property.
domain: Agent
range: Class
  union of: Instantiation
  union of: Record Resource
sub property of: is accumulator of
inverse of: has collector
change note:
  value: changed the IRI, label, inverse property and super property IRI, text definition, domain (changed made in order to make RiC-O compliant with RiC-CM 0.2; the name of this property in RiC-O 0.1 was "collects").
  date: 2021-01-22
RiC-CM corresponding component: RiC-R030i ('is collector of' relation)

Leadership Relation
type: Class
comment: Connects at least one Person and at least one Group, when the first one leads the second one.
subclass of: Agent Control Relation
subclass of: Restriction
  max qualified cardinality: 1
  on class: Position
  on property: leadership with position
subclass of: Restriction
  min qualified cardinality: 1
  on class: Group
  on property: leadership relation has target
subclass of: Restriction
  min qualified cardinality: 1
  on class: Person
  on property: leadership relation has source
RiC-CM corresponding component: Class implementation of RiC-R042 and RiC-R042i relations

has accumulator
type: ObjectProperty
comment: Connects a Record Resource or an Instantiation to the Agent that accumulates it, be it intentionally (collecting) or not (receiving in the course of its activities).
domain: Class
  union of: Instantiation
  union of: Record Resource
range: Agent
sub property of: has provenance
inverse of: is accumulator of
property chain axiom: record resource or instantiation is source of accumulation relation
property chain axiom: accumulation relation has target
change note:
  value: changed the IRI, label, inverse property IRI, text definition and corresponding CM component (changed made in order to make RiC-O compliant with RiC-CM 0.2; the name of this property in RiC-O 0.1 was "accumulatedBy").
  date: 2021-01-22
RiC-CM corresponding component: RiC-R028 ('has accumulator' relation)

includes or included
type: ObjectProperty
comment: Connects a Record Set to a Record or Record Set it aggregates, or aggregated in the past.
domain: Record Set
range: Class
  union of: Record
  union of: Record Set
sub property of: is record resource associated with record resource
inverse of: is or was included in
change note: changed the IRI, label, inverse property IRI, text definition (changed made in order to make RiC-O compliant with RiC-CM 0.2; the name of this property in RiC-O 0.1 was "includes").
  date: 2021-01-22
scope note: A Record or Record Set can be aggregated in one or many Record Sets simultaneously or through time
RiC-CM corresponding component: RiC-R024 ('includes or included' relation)

has unit of measurement
type: ObjectProperty
comment: Connects an Extent to a Unit Of Measurement
domain: Extent
range: Unit Of Measurement
sub property of: is related to
inverse of: is unit of measurement of
change note: Object property created along with Extent and UnitOfMeasurement classes, in order to provide methods for handling extent accurately.
  date: 2020-10-28

has beginning date
type: ObjectProperty
comment: Inverse of 'is beginning date of' object property
domain: Thing
range: Date
sub property of: is associated with date
inverse of: is beginning date of
RiC-CM corresponding component: RiC-R069i ('has beginning date' relation)

Finding aid
type: Documentary Form Type
type: Concept
type: NamedIndividual
definition: This documentary form type can be used for records that aggregate and organizes metadata on some record(s) or record set(s).
in scheme: Documentary Form Types

Language
type: Class
comment: A spoken or written human language represented in the Record or Record Part, or used by the Agent.
subclass of: Concept
change note: Scope note from RiC-CM : deleted.
  date: 2020-10-23
change note: Changed the definition (skos:comment annotation); so that it conforms to the RiC-CM one.
  date: 2020-12-28
RiC-CM corresponding component: Corresponds to RiC-A25 (Language attribute)

is or was location of
type: ObjectProperty
comment: Connects a Place to a Thing that is or was located in the Place.
domain: Place
range: Thing
sub property of: is place associated with
inverse of: has or had location
change note: changed the IRI, label, inverse property IRI, textual definition (changed made in order to make RiC-O compliant with RiC-CM 0.2; the name of this property in RiC-O 0.1 was "isLocationOf").
  date: 2021-01-22
RiC-CM corresponding component: RiC-R075 ('is or was location of' relation)

geodesic system
type: DatatypeProperty
comment: Reference system used for geographical coordinates.
domain: Coordinates
range: Literal
sub property of: reference system

record resource or instantiation is source of activity documentation relation
type: ObjectProperty
comment: Connects a Record Resource or Instantiation (that documents an Activity) to an Activity Documentation Relation.
domain: Class
  union of: Instantiation
  union of: Record Resource
range: Activity Documentation Relation
sub property of: record resource or instantiation is source of provenance relation
inverse of: activity documentation relation has source

position is context of leadership relation
type: ObjectProperty
comment: Connects a Position to a Leadership Relation (the leading Person occupies that Position).
domain: Position
range: Leadership Relation
sub property of: thing is context of relation
inverse of: leadership with position

sibling relation connects
type: ObjectProperty
comment: Connects a Sibling Relation to one of the siblings involved.
domain: Sibling Relation
range: Person
sub property of: family relation connects
inverse of: person has sibling relation

has death date
type: ObjectProperty
comment: Inverse of 'is death date of' object property
domain: Person
range: Date
sub property of: has end date
inverse of: is death date of
RiC-CM corresponding component: RiC-R072i ('has death date' relation)

date
type: DatatypeProperty
comment: Chronological information associated with an entity that contributes to its identification and contextualization.
domain: Thing
range: Literal
scope note: Provided for usability reasons, like its subproperties. May be deprecated and removed later on. Use only if you don't use Date classes for handling dates.
RiC-CM corresponding component: Data property implementation of RiC-E18 (Date entity)

regulates or regulated
type: ObjectProperty
comment: Connects a Rule to a Thing that it regulates or regulated.
domain: Rule
range: Thing
sub property of: is rule associated with
inverse of: is or was regulated by
change note: changed the IRI, label, inverse property IRI (changed made in order to make RiC-O compliant with RiC-CM 0.2; the name of this property in RiC-O 0.1 was "regulates").
  date: 2021-01-22
RiC-CM corresponding component: RiC-R063 ('regulates or regulated' relation)

Group
type: Class
comment: Two or more Agents that act together as an Agent.
subclass of: Agent
disjoint with: Position
disjoint with: Person
disjoint with: Mechanism
change note: Scope note: made separate paragraphs plus very few changes. Disjoint with: enriched.
  date: 2020-10-23
scope note: Group is a kind of Agent. A Group has a socially recognized identity. Each member of the Group plays a particular role or roles (that is has a particular Position) in the coordinated activity of the Group. Corporate bodies and families are kinds of groups, though other kinds of groups are possible. For example, the “electorate” -- all of the voters in a given election. Complex, large groups may be subdivided into other groups.
RiC-CM corresponding component: Corresponds to RiC-E09 (Group Entity)

has or had intellectual property rights holder
type: ObjectProperty
comment: Inverse of 'is or was holder of intellectual property rights of' object property.
domain: Class
  union of: Instantiation
  union of: Record Resource
range: Class
  union of: Group
  union of: Person
  union of: Position
sub property of: is or was under authority of
inverse of: is or was holder of intellectual property rights of
property chain axiom: record resource or instantiation is target of intellectual property rights relation
property chain axiom: intellectual property rights relation has source
change note:
  value: changed the IRI, label, inverse property IRI, textual definition (changed made in order to make RiC-O compliant with RiC-CM 0.2; the name of this property in RiC-O 0.1 was "intellectualPropertyRightsHeldBy").
  date: 2021-01-22
RiC-CM corresponding component: RiC-R040i ('has or had intellectual property rights holder ' relation)

birth date
type: DatatypeProperty
comment: Date at which a Person was born.
domain: Person
range: Literal
sub property of: beginning date
scope note: Provided for usability reasons. May be deprecated and removed later on. Use only if you don't use Date classes for handling dates.
RiC-CM corresponding component: Data property specialized implementation of RiC-E18 (Date entity)

has copy
type: ObjectProperty
comment: Connects a Record Resource to a copy of that Record Resource.
domain: Record Resource
range: Record Resource
sub property of: has genetic link to record resource
sub property of: precedes in time
inverse of: is copy of
RiC-CM corresponding component: RiC-R012 ('has copy' relation)

is end date of
type: ObjectProperty
comment: Connects a Date to a Thing whose existence ended on that Date.
domain: Date
range: Thing
sub property of: is date associated with
inverse of: has end date
RiC-CM corresponding component: RiC-R071 ('is end date of')

Group Subdivision Relation
type: Class
comment: Connects a Group and at least another Group, when the first one as the second one(s) among its subdivisions.
subclass of: Whole Part Relation
subclass of: Agent Hierarchical Relation
subclass of: Restriction
  on class: Group
  on property: group subdivision relation has source
  qualified cardinality: 1
subclass of: Restriction
  min qualified cardinality: 1
  on class: Group
  on property: group subdivision relation has target
RiC-CM corresponding component: Class implementation of RiC-R005 and RiC-R005i relations

Relation state
type: DatatypeProperty
comment: Used to qualify the state of a Relation (e. g. present, past, ongoing, unknown).
domain: Relation
range: Literal

is or was documentary form type of some members of
type: ObjectProperty
comment: Connects a Documentary Form Type and a Record Set whose some past or present Record or Record Part members have that Documentary Form Type.
domain: Documentary Form Type
range: Record Set
sub property of: is or was category of some members of
inverse of: has or had some members with documentary form type
change note:
  value: Object property added for handling the case where a Record Set is described as having all or some members that belong to some category (see RiC-CM 0.2 attributes section, #4.4 on Record Set, Record and Record Part attributes).
  date: 2020-12-28

Position
type: Class
comment: The functional role of a Person within a Group.
subclass of: Agent
change note: Scope note: made separate paragraphs and updated. Disjoint with: enriched. Objective: to make RiC-O compliant with RiC-CM v0.2.
  date: 2020-10-23
scope note: Position is a kind of Agent. Position is the intersection of a Person and a Group. Position exists independently of the Person that holds the Position within a Group. More than one Person may hold a Position. Position is commonly defined in a Mandate, often called a position description or job description. The Mandate may specify the work to be performed (Activity) as well as the competencies for performing the Activity. A Position is often given a Name. A Position may be tied to a project or to a set of tasks and thus have a defined duration. A Position may change over time, as the Group that establishes it changes over time. Position is not to be confused with Occupation or Activity. Within the records created by a Corporate Body, a Position may be used to identify the record sets resulting from activities performed by one or more persons holding the Position over time, without necessarily identifying or describing the Person or persons, or identifying which records were created by each Person.
RiC-CM corresponding component: Corresponds to RiC-E12 (Position entity)

derivation relation has target
type: ObjectProperty
comment: Connects a Derivation Relation to one of the derived Instantiations
domain: Derivation Relation
range: Instantiation
sub property of: temporal relation has target
sub property of: instantiation to instantiation relation connects
inverse of: instantiation is target of derivation relation

temporal relation has source
type: ObjectProperty
comment: Connects a Temporal Relation to a Thing that precedes other Thing(s) in time.
domain: Temporal Relation
range: Thing
sub property of: sequential relation has source
inverse of: thing is source of temporal relation

Content Type
type: Class
comment: The fundamental form of communication in which a Record is expressed and the human sense through which it is intended to be perceived.
subclass of: Type
subclass of: Restriction
  all values from: Record Resource
  on property: is content type of
change note: Scope note: added (quite the same as RiC-CM definition).
  date: 2020-10-23
scope note: Should not be confused with Representation Type or Carrier Type of a related Instantiation since the form of communication can be independent of the representation or carrier, for example, a map (Content Type: cartographic image) can be represented as a sketch (Representation Type: graphic) or as a GIS-coded elements (Representation Type: computer).
RiC-CM corresponding component: Corresponds to RiC-A10 (Content Type attribute)

is or was subevent of
type: ObjectProperty
comment: Inverse of 'has or had subevent' object property.
domain: Event
range: Event
sub property of: is event associated with
sub property of: is associated with event
sub property of: is or was part of
inverse of: has or had subevent
change note:
  value: changed the IRI, label, inverse property IRI, text definition, super property URI (changed made in order to make RiC-O compliant with RiC-CM 0.2; the name of this property in RiC-O 0.1 was "isSubEventOf").
  date: 2021-01-22
RiC-CM corresponding component: RiC-R006i ('is or was subevent of' relation)

is or was subdivision of
type: ObjectProperty
comment: Inverse of 'has or had subdivision' object property.
domain: Group
range: Group
sub property of: is or was part of
sub property of: is or was subordinate to
inverse of: has or had subdivision
property chain axiom: group is target of group subdivision relation
property chain axiom: group subdivision relation has source
change note:
  value: changed the IRI, label, inverse property IRI, text definition, super property IRIs (changed made in order to make RiC-O compliant with RiC-CM 0.2; the name of this property in RiC-O 0.1 was "isSubdivisionOf").
  date: 2021-01-22
RiC-CM corresponding component: RiC-R005i ('is or was subdivision' relation)

rule relation has source
type: ObjectProperty
comment: Connects a Rule Relation to a Rule.
domain: Rule Relation
range: Rule
sub property of: relation has source
inverse of: rule is source of rule relation

sequential relation has target
type: ObjectProperty
comment: Connects a Sequential Relation to a Thing that follows other Thing(s) in the sequence.
domain: Sequential Relation
range: Thing
sub property of: relation has target
inverse of: thing is target of sequential relation

structure
type: DatatypeProperty
comment: Information about the intellectual arrangement and composition of a Record Resource or the physical arrangement and composition of an Instantiation. For Record and Record Part, it encompasses information about the intellectual composition of the record, the presence of record parts and their functions. For Record Set, it encompasses information about the methodology or criteria used for arranging the Record Set members or Record members within the containing Record Set. For Instantiation, it may comprise information about the composition of the physical elements of the instantiation
domain: Class
  union of: Instantiation
  union of: Record Resource
range: Literal
change note: Text definition updated. Objective: to make RiC-O compliant with RiC-CM v0.2.
  date: 2020-11-01
scope note: Use only if you cannot use the subproperties (particularly if the same free text is being used in your current metadata for describing the record resource and the instantiation structure).
RiC-CM corresponding component: Corresponds to RiC-A40 (Structure attribute)

authority relation has source
type: ObjectProperty
comment: Connects an Authority Relation to an Agent that has the authority
domain: Authority Relation
range: Agent
sub property of: relation has source
inverse of: agent is source of authority relation

results or resulted in
type: ObjectProperty
comment: Connects an Event to a Thing that results or resulted from the Event.
domain: Event
range: Thing
sub property of: is event associated with
inverse of: results or resulted from
change note: changed the IRI, label, inverse property IRI, text definition (changed made in order to make RiC-O compliant with RiC-CM 0.2; the name of this property in RiC-O 0.1 was "resultsIn").
  date: 2021-01-22
RiC-CM corresponding component: RiC-R061 ('results or resulted in' relation)

has or had main subject
type: ObjectProperty
comment: Connects a Record Resource to a Thing that is or was its main subject.
domain: Record Resource
range: Thing
sub property of: has or had subject
inverse of: is or was main subject of
change note: changed the IRI, label, inverse property IRI and textual definition (changed made in order to make RiC-O compliant with RiC-CM 0.2; the name of this property in RiC-O 0.1 was "hasMainSubject").
  date: 2021-01-22
scope note: Use for specifying, for example, that a Record Set of type personal file has main subject some person, which would help end users to retrieve the main archival resources about this person.
RiC-CM corresponding component: RiC-R020 ('has or had main subject' relation)

agent relation connects
type: ObjectProperty
comment: Connects an Agent Relation to one of the involved Agents
domain: Agent Relation
range: Agent
sub property of: relation connects
inverse of: agent is connected to agent relation

management relation has target
type: ObjectProperty
comment: Connects a Management Relation to a Record Resource or Instantiation that is involved as a managed thing.
domain: Management Relation
range: Class
  union of: Instantiation
  union of: Record Resource
sub property of: authority relation has target
inverse of: record resource or instantiation is target of management relation

group is target of group subdivision relation
type: ObjectProperty
comment: Connects a Group that is a subdivision, to a Group Subdivision Relation
domain: Group
range: Group Subdivision Relation
sub property of: thing is target of whole part relation
sub property of: agent is target of agent hierarchical relation
inverse of: group subdivision relation has target

has or had legal status
type: ObjectProperty
comment: Connects an Agent or Record Resource to a Legal Status which categorized or categorizes it.
domain: Class
  union of: Agent
  union of: Record
  union of: Record Part
range: Legal Status
sub property of: has or had category
inverse of: is or was legal status of
change note: changed the IRI, label, inverse property IRI and textual definition (the name of this property in RiC-O 0.1 was "hasLegalStatus").
  date: 2021-01-22

knows of
type: ObjectProperty
comment: Connects a Person to another Person they have some knowledge of through time or space.
domain: Person
range: Person
sub property of: is agent associated with agent
inverse of: known by
property chain axiom: person is source of knowing of relation
property chain axiom: knowing of relation has target
RiC-CM corresponding component: RiC-R050 ('knows of' relation)

width
type: DatatypeProperty
comment: Horizontal dimension of an entity.
domain: Thing
range: Literal
sub property of: measure

Agent Origination Relation
type: Class
comment: Connects at least one Record Resource or an Instantiation to at least one Agent that creates or accumulates the Record Resource, receives it, or sends it.
subclass of: Provenance Relation
subclass of: Restriction
  min qualified cardinality: 1
  on class: Agent
  on property: agent origination relation has target
subclass of: Restriction
  min qualified cardinality: 1
  on class: Class
    union of: Instantiation
    union of: Record Resource
  on property: agent origination relation has source
RiC-CM corresponding component: Class implementation of RiC-R026 and RiC-R026i relations

mandate is source of mandate relation
type: ObjectProperty
comment: Connects a Mandate to a Mandate Relation.
domain: Mandate
range: Mandate Relation
sub property of: rule is source of rule relation
inverse of: mandate relation has source

agent is connected to agent relation
type: ObjectProperty
comment: Connects an Agent to an Agent Relation
domain: Agent
range: Agent Relation
sub property of: thing is connected to relation
inverse of: agent relation connects

is or was participant in
type: ObjectProperty
comment: Inverse of 'has or had participant' object property.
domain: Thing
range: Event
sub property of: is associated with event
inverse of: has or had participant
change note: changed the IRI, label, inverse property IRI, textual definition (changed made in order to make RiC-O compliant with RiC-CM 0.2; the name of this property in RiC-O 0.1 was "involvedIn").
  date: 2021-01-22
RiC-CM corresponding component: RiC-R058i ('is or was participant in' relation)

Single Date
type: Class
comment: Chronological information associated with an entity that contributes to its identification and contextualization, related to a single point in time.
subclass of: Date
RiC-CM corresponding component: Corresponds to RiC-E19 (SingleDate entity)

Occupation Type
type: Class
comment: Categorization of a profession, trade, or craft pursued by a person in fulfilment of an Activity.
subclass of: Activity Type
subclass of: Demographic Group
subclass of: Restriction
  all values from: Person
  on property: is or was occupation type of
change note: scope note: added.
  date: 2020-10-23
scope note: Occupation Type should not be confused with Position where, for example, an Agent with the Occupation Type “lawyer” holds the Position of “legal counsel” in an agency. Occupation Type is related to, but should not be confused with the domain or field of Activity (Actvitity Type), such as an archivist who works in the domain of archival science. Occupation Type is a kind of Demographic Group.
RiC-CM corresponding component: Corresponds to RiC-A30 (Occupation Type attribute)

expressed date
type: DatatypeProperty
comment: Natural language expression of a Date.
domain: Date
range: Literal
sub property of: textual value
change note: examples added. Objective: to make RiC-O compliant with RiC-CM v0.2.
  date: 2020-11-01
example: 1925-1966
example: The Sunday before Christmas
example: October 24th, 1999
RiC-CM corresponding component: Corresponds to RiC-A19 (Expressed Date attribute)

place is source of place relation
type: ObjectProperty
comment: Connects a Place (as associated to a Thing) to a Place Relation.
domain: Place
range: Place Relation
sub property of: thing is source of relation
inverse of: place relation has source

overlaps or overlapped
type: SymmetricProperty
type: ObjectProperty
comment: Connects two Places that geographically overlap or overlapped. This object property is symmetric.
domain: Place
range: Place
sub property of: is associated with place
sub property of: is place associated with
change note: changed the IRI, label, text definition (changed made in order to make RiC-O compliant with RiC-CM 0.2; the name of this property in RiC-O 0.1 was "overlaps").
  date: 2021-01-22
RiC-CM corresponding component: RiC-R078 ('overlaps or overlapped' relation)

thing is target of place relation
type: ObjectProperty
comment: Connects a Thing (that is associated with a Place) to a Place Relation.
domain: Thing
range: Place Relation
sub property of: thing is target of relation
inverse of: place relation has target

has or had some members with legal status
type: ObjectProperty
comment: Connects a Record Set and a Legal Status that categorizes some of the Records or Record Parts that are or were included in the Record Set.
domain: Record Set
range: Legal Status
sub property of: has or had some members with category
inverse of: is or was legal status of some members of
change note:
  value: Object property added for handling the case where a Record Set is described as having all or some members that belong to some category (see RiC-CM 0.2 attributes section, #4.4 on Record Set, Record and Record Part attributes).
  date: 2020-12-28

is unit of measurement of
type: ObjectProperty
comment: Inverse of 'has unit of measurement' object property
domain: Unit Of Measurement
range: Extent
sub property of: is related to
inverse of: has unit of measurement
change note: Object property created along with Extent and UnitOfMeasurement classes, in order to provide methods for handling extent accurately.
  date: 2020-10-28

Record Resource Holding Relation
type: Class
comment: Connects at least one Agent, and one or more Record Resource or Instantiation that the Agent holds.
subclass of: Management Relation
subclass of: Restriction
  min qualified cardinality: 1
  on class: Class
    union of: Instantiation
    union of: Record Resource
  on property: record resource holding relation has target
subclass of: Restriction
  min qualified cardinality: 1
  on class: Agent
  on property: record resource holding relation has source
RiC-CM corresponding component: Class implementation of RiC-R039 and RiC-039i relations

person is source of child relation
type: ObjectProperty
comment: Connects a Person (as a parent) to a Child Relation.
domain: Person
range: Child Relation
sub property of: person is source of descendance relation
inverse of: child relation has source

agent is target of agent origination relation
type: ObjectProperty
comment: Connects one of the Agents that created or accumulated the Record resource or Instantiation, to an Agent Origination Relation
domain: Agent
range: Agent Origination Relation
sub property of: agent or activity is target of provenance relation
inverse of: agent origination relation has target

leadership relation has target
type: ObjectProperty
comment: Connects a Leadership Relation to a lead Group.
domain: Leadership Relation
range: Group
sub property of: agent control relation has target
inverse of: group is target of leadership relation

event relation has source
type: ObjectProperty
comment: Connects an Event Relation to an Event
domain: Event Relation
range: Event
sub property of: relation has source
inverse of: event is source of event relation

is or was part of
type: ObjectProperty
comment: Inverse of 'has or had part' relation.
domain: Thing
range: Thing
sub property of: is related to
inverse of: has or had part
property chain axiom: thing is target of whole part relation
property chain axiom: whole part relation has source
change note: changed the IRI, label, inverse property IRI, textual definition (changed made in order to make RiC-O compliant with RiC-CM 0.2; the name of this property in RiC-O 0.1 was "isPartOf").
  date: 2021-01-22
RiC-CM corresponding component: RiC-R002i (is or was part of relation)

instantiation is target of derivation relation
type: ObjectProperty
comment: Connects a derived Instantiation to a Derivation Relation.
domain: Instantiation
range: Derivation Relation
sub property of: thing is target of relation
sub property of: instantiation is connected to instantiation relation
sub property of: thing is target of temporal relation
inverse of: derivation relation has target

has child
type: ObjectProperty
comment: Connects a Person to one of their children.
domain: Person
range: Person
sub property of: has descendant
inverse of: is child of
property chain axiom: person is source of child relation
property chain axiom: child relation has target
change note: changed the inverse property IRI.
  date: 2021-01-22
RiC-CM corresponding component: RiC-R018 ('has child' relation)

has family association with
type: SymmetricProperty
type: ObjectProperty
comment: Connects two Persons that have some type of family link, i.e. belong to the same family. This relation is symmetric.
domain: Person
range: Person
sub property of: is agent associated with agent
property chain axiom: person has family relation
property chain axiom: family relation connects
change note: changed the IRI, label, textual definition (changed made in order to make RiC-O compliant with RiC-CM 0.2; the name of this property in RiC-O 0.1 was "hasFamilyLinkWith").
  date: 2021-01-22
RiC-CM corresponding component: RiC-R047 ('has family association with' relation)

has or had subevent
type: ObjectProperty
comment: Connects an Event to one of a series of Events that constitute the original, broader, past or ongoing Event.
domain: Event
range: Event
sub property of: is associated with event
sub property of: has or had part
sub property of: is event associated with
inverse of: is or was subevent of
change note:
  value: changed the IRI, label, inverse property IRI, text definition, super property IRI (changed made in order to make RiC-O compliant with RiC-CM 0.2; the name of this property in RiC-O 0.1 was "hasSubEvent").
  date: 2021-01-22
scope note: Since an Activity is a kind of Event, this Relation can also be used for Activity.
RiC-CM corresponding component: RiC-R006 ('has or had subevent' relation)

has end date
type: ObjectProperty
comment: Inverse of 'is end date of' object property.
domain: Thing
range: Date
sub property of: is associated with date
inverse of: is end date of
RiC-CM corresponding component: RiC-R071i ('has end date' relation)

is extent of
type: ObjectProperty
comment: Connects an Extent to a Record Resource or Instantiation
domain: Extent
range: Class
  union of: Instantiation
  union of: Record Resource
sub property of: is related to
inverse of: has extent
change note: Object property created along with the Extent class and its subclasses, in order to provide methods for handling extent accurately.
  date: 2020-10-28

group subdivision relation has source
type: ObjectProperty
comment: Connects a Group Subdivision Relation to the Group that has subdivisions
domain: Group Subdivision Relation
range: Group
sub property of: whole part relation has source
sub property of: agent hierarchical relation has source
inverse of: group is source of group subdivision relation

Title
type: Class
comment: A name that is used for a Record Resource or a Rule
subclass of: Name
RiC-CM corresponding component: Class implementation of a specialization of RiC-A28 (Name attribute)

agent is source of agent control relation
type: ObjectProperty
comment: Connects a controlling Agent to an Agent Control Relation
domain: Agent
range: Agent Control Relation
sub property of: agent is source of agent hierarchical relation
inverse of: agent control relation has source

Rule
type: Class
comment: Conditions that govern the existence or authority of an Agent or the performance of an Activity, or that contribute to the distinct characteristics of things created or managed by an Agent.
subclass of: Thing
subclass of: Restriction
  all values from: Rule Type
  on property: has or had rule type
change note: Scope note: made separate paragraphs and updated. Objective: to make RiC-O compliant with RiC-CM v0.2.
  date: 2020-10-23
change note: Updated the definition (rdfs:comment) and scope note, as they were recently changed in RiC-CM 0.2 full draft.
  date: 2021-02-11
scope note: Rule can be related directly to Agent, Activity, or anything created or managed by agents, such as a Record Resource or Instantiation. A Rule may be unwritten or written or otherwise documented. Unwritten rules may include though are not limited to the following: social mores, customs, or community expectations. Written rules may include though are not limited to the following: constitutions, legislation, acts (legal), statutes, legal codes, ordinances, charters, mission statements, regulations, policies, procedures, instructions, codes of conduct or ethics, professional standards, work assignments or work plans. The source or sources of some Rules are external to the Agent (for example, expressed in elections, social mores, customs, community expectations, laws, regulations, standards and best practice codes), while others are expressed within the Agent’s immediate context (for example, policies, or written or verbal instructions). The evidence for identifying Rules may be found in their entirety in one documentary source (for example, a law or regulation) or may be found in two or more sources. Rule should not be confused with the one or more documentary sources that serve as evidence of its identity. A documentary source is a Record.
RiC-CM corresponding component: Corresponds to RiC-E16 (Rule entity)

is or was subordinate to
type: ObjectProperty
comment: Inverse of 'has or had subordinate' object property.
domain: Agent
range: Agent
sub property of: is agent associated with agent
inverse of: has or had subordinate
property chain axiom: agent is target of agent hierarchical relation
property chain axiom: agent hierarchical relation has source
change note: changed the IRI, label, inverse property IRI (changed made in order to make RiC-O compliant with RiC-CM 0.2; the name of this property in RiC-O 0.1 was "isHierarchicallyInferiorTo").
  date: 2021-01-22
RiC-CM corresponding component: RiC-R045i ('is or was subordinate to' relation)

person has spouse relation
type: ObjectProperty
comment: Connects a Person to a Spouse Relation.
domain: Person
range: Spouse Relation
sub property of: person has family relation
inverse of: spouse relation connects

accumulation relation has target
type: ObjectProperty
comment: Connects an Accumulation Relation to one of the accumulating Agents
domain: Accumulation Relation
range: Agent
sub property of: agent origination relation has target
inverse of: agent is target of accumulation relation

has addressee
type: ObjectProperty
comment: Connects a Record Resource or an Instantiation to the Agent that it is addressed to.
domain: Class
  union of: Instantiation
  union of: Record Resource
range: Agent
sub property of: has provenance
inverse of: is addressee of
change note: added a scope note
  date: 2021-01-22
scope note: The identity of the addressee is (usually) evidenced by the Record Resource or Instantiation itself.
RiC-CM corresponding component: RiC-R032 ('has addressee' relation)

Unit Of Measurement
type: Class
comment: A definite magnitude of a quantity, defined and adopted by convention or by law, that is used as a standard for measurement of the same kind of quantity. Can be spacial units (cm, m), weigt (g, kg), time (s, h), storage (MB, TB) or more informal units used in the archival context like number of boxes, pages or words.
subclass of: Concept
change note: Class added in order to be able to handle units of measurement as full entities.
  date: 2020-10-28

certainty
type: DatatypeProperty
comment: Qualifies the level of certitude of the accuracy of a Date, an Event or a Relation.
domain: Class
  union of: Date
  union of: Event
  union of: Relation
range: Literal
change note: Text definition updated. Objective: to make RiC-O compliant with RiC-CM v0.2.
  date: 2020-11-01
RiC-CM corresponding component: Corresponds to RiC-A06 (Certainty attribute)

International Council on Archives Records in Contexts Ontology (ICA RiC-O) version 0.2
type: Vocabulary
type: Ontology
type: NamedIndividual
license: https://creativecommons.org/licenses/by/4.0/
contributor: Miia Herrala (National Archives of Finland), member of EGAD
contributor: Daniel Pitti (University of Virginia, USA), chair of EGAD
contributor: Tobias Wildi (Docuteam GmbH, Switzerland), member of EGAD
contributor: Aaron Rubinstein (University of Massachusetts Amherst, USA), member of EGAD
creator: Florence Clavaud (Archives nationales de France), member of EGAD, lead of EGAD RiC-O team
creator: International Council on Archives Expert Group on Archival Description (ICA EGAD)
publisher: International Council on Archives
rights: Copyright 2019-...., International Council on Archives (ICA)
abstract: RiC-O (Records in Contexts-Ontology) is an OWL ontology for describing archival record resources. As the second part of Records in Contexts standard, it is a formal representation of Records in Contexts Conceptual Model (RiC-CM). The current official version is v0.2; it is compliant with RiC-CM v0.2 full draft, that will be published in February or March 2021, and that is slightly different from RiC-CM v0.2 preview, that was published in December 2019. RiC-O provides a generic vocabulary and formal rules for creating RDF datasets (or generating them from existing archival metadata) that describe in a consistent way any kind of archival record resource. It can support publishing RDF datasets as Linked Data, querying them using SPARQL, and making inferences using the logic of the ontology.
contributor: http://www.isni.org/0000000039584825
creator: about
description: Introduction RiC-O (Records in Contexts-Ontology) is an OWL ontology for describing archival record resources. As the second part of Records in Contexts standard, it is a formal representation of Records in Contexts Conceptual Model (RiC-CM). This version, which is v0.2, is the current official release. It is compliant with RiC-CM v0.2, that will be published soon after the release of RiC-O v0.2. The following diagram shows the main RiC-CM v0.2 entities and a few relations between them: RiC-O design principles The following design principles were followed when developing RiC-O. RiC-O is a domain or reference ontology. It provides a generic vocabulary and formal rules for creating RDF datasets (or generating them from existing archival metadata) that describe in a consistent way any kind of archival record resource. It can support publishing RDF datasets as Linked Data, querying them using SPARQL, and making inferences using the logic of the ontology. While some projects have built some specific ontologies for describing archives, at this time no generic domain ontology exists for the specific needs of the archival community. This is why EGAD decided to develop RiC-O as the second part of RiC standard. Apart this first, main target, RiC-O also can help archival institutions and engineers to design and develop other technical implementations of RiC-CM that represent record resources and their layers of contexts as oriented, interconnected graphs. Of course, other technical implementations may be developed later on, including XML models, or (hopefully) new versions of EAD and EAC-CPF XML models. As RiC-O is a generic, domain ontology, it does not address by itself every specific need or expectation that may occur in every archival institution or project. It is rather a high level framework and a project can either limit itself to the use of a selection of components, or can add more subcomponents where needed. As a domain ontology, RiC-O, at this stage at least, does n…
publisher: Q1421986
preferred namespace prefix: rico
preferred namespace uri: https://www.ica.org/standards/RiC/ontology#
prior version: RiC-O v0-1.rdf
version info: Version 0.2 - 2021-02-12.
history note: A first beta version of RiC-O was developed in 2017 and used by the National Archives of France for building a proof of concept (https://piaaf.demo.logilab.fr). EGAD then continued to develop the ontology, and this process entered a very active period in 2019, while RiC-CM v0.2 was being designed and edited. From December 2018 to November 2019, about 65 persons that had applied to a call for reviewers, received successive beta versions of RiC-O and sent a few first comments. While EGAD RiC-O team could not answer to each of these comments, each was taken into account. In particular, it was decided to prepare and publish, along with RiC-O v0.1, a preview of RiC-CM v0.2. The goal of the preview release of RiC-CM v0.2 is to provide context for the classes, properties, and overall logic of RiC-O in support of the ontology’s first public release. RiC-O v0.1 was released on December 2019, 12. The Git repository that is used for handling RiC-O was made public in March 2020 (see https://github.com/ICA-EGAD/RiC-O), so that creating issues or comments, forking and making pull requests was made possible. In 2020, RiC-CM v0.2 preview was significantly updated: the textual definitions of many entities were changed, as well as the specifications of many attributes; and a lot of relations changed name, in order to take into account past situations and to adopt some simple naming rules. As a consequence, RiC-O had to be updated in order to remain compliant with RiC-CM. These changes could not be made before the end of 2020, when RiC-CM could be considered stable. EGAD also decided to make other changes in RiC-O, among which the most important are mentioned in bold in the following list. RiC-O 0.2 results from these updates and changes. It has been released a few weeks before RiC-CM 0.2 full draft, and is fully compliant with it. The following is a list of the changes made to RiC-O (this current version being RiC-O v0.2) since the release of RiC-O v0.1 in December 2019. The most imp…

Agent Control Relation
type: Class
comment: Connects at least one Agent, to at least another Agent, when the first one(s) control(s) in a way the activities of the second one(s).
subclass of: Authority Relation
subclass of: Agent Hierarchical Relation
subclass of: Restriction
  min qualified cardinality: 1
  on class: Agent
  on property: agent control relation has target
subclass of: Restriction
  min qualified cardinality: 1
  on class: Agent
  on property: agent control relation has source
RiC-CM corresponding component: Class implementation of RiC-R041 and RiC-R041i relations

is or was category of
type: ObjectProperty
comment: Connects a Type (a category) to a Thing that it categorizes or categorized.
domain: Type
range: Thing
sub property of: is related to
inverse of: has or had category
property chain axiom: type is source of type relation
property chain axiom: type relation has target
change note: changed the IRI, label, inverse property IRI, text definition (the name of this property in RiC-O 0.1 was "isCategoryOf").
  date: 2021-01-22

history
type: DatatypeProperty
comment: Summary of the development of an entity, since its origin until present time.
domain: Class
  union of: Activity
  union of: Agent
  union of: Event
  union of: Instantiation
  union of: Place
  union of: Record Resource
  union of: Rule
range: Literal
change note: Domains updated. Examples added. Objective: to make RiC-O compliant with RiC-CM v0.2.
  date: 2020-11-01
example: Nacido en Barbastro en 1892, donde realizó sus primeros estudios con los escolapios. Licenciado en Derecho por la Universidad de Zaragoza, aprobó las oposiciones al cuerpo nacional de notarios…(Person) @es
example: The manuscripts are part of the collections of Robert Harley (d 1724) and Edward Harley (d 1741), 1st and 2nd Earls of Oxford, that were brought by Parliament and transferred to the British Museum in 1753. Those materials were then separated into this collection and those for Harley Charters and Harley Rolls and became part of the collections of the British Library in 1972. (Record Set)
example: El primer sorteo de lotería se celebró el 13 de mayo de 1771, siendo desarrollado por la Real Lotería General de Nueva España… (Activity) @es
scope note: History can alternatively be represented by a series of related Events.
RiC-CM corresponding component: Corresponds to RiC-A21 (History attribute)

type is source of type relation
type: ObjectProperty
comment: Connects a Type (a category) to a Type Relation.
domain: Type
range: Type Relation
sub property of: thing is source of relation
inverse of: type relation has source

is or was name of
type: ObjectProperty
comment: Connects a Name to a Thing that it designated or designates.
domain: Name
range: Thing
sub property of: is or was appellation of
inverse of: has or had name
change note: changed the IRI, label, inverse property IRI, textual definition, super property IRI (the name of this property in RiC-O 0.1 was "isNameOf").
  date: 2021-01-22

is or was holder of
type: ObjectProperty
comment: Connects an Agent to a Record Resource or Instantiation that the Agent holds or held.
domain: Agent
range: Class
  union of: Instantiation
  union of: Record Resource
sub property of: is or was manager of
inverse of: has or had holder
property chain axiom: agent is source of record resource holding relation
property chain axiom: record resource holding relation has target
change note:
  value: changed the IRI, label, inverse property IRI, super property IRI and text definition (changed made in order to make RiC-O compliant with RiC-CM 0.2; the name of this property in RiC-O 0.1 was "isHolderOf").
  date: 2021-01-22
RiC-CM corresponding component: RiC-R039 ('is or was holder of' relation)

is content type of
type: ObjectProperty
comment: Connects a Content Type to a Record or Record Part whose content it categorizes.
domain: Content Type
range: Class
  union of: Record
  union of: Record Part
sub property of: is or was category of
inverse of: has content of type
change note: changed the text definition and super property IRI.
  date: 2021-01-22

has of had all members with legal status
type: ObjectProperty
comment: Connects a Record Set and a Legal Status that categorizes all the Records or Record Parts that are or were included in the Record Set.
domain: Record Set
range: Legal Status
sub property of: has or had all members with category
inverse of: is or was legal status of all members of
change note:
  value: Object property added for handling the case where a Record Set is described as having all or some members that belong to some category (see RiC-CM 0.2 attributes section, #4.4 on Record Set, Record and Record Part attributes).
  date: 2020-12-28

owner ship relation has target
type: ObjectProperty
comment: Connects an Ownership Relation to a Thing that is owned.
domain: Ownership Relation
range: Thing
sub property of: authority relation has target
inverse of: thing is target of ownership relation

is or was content type of some members of
type: ObjectProperty
comment: Connects a Content Type and a Record Set whose some past or present Record or Record Part members have that Content Type.
domain: Content Type
range: Record Set
sub property of: is or was category of some members of
inverse of: has or had some members with content type
change note:
  value: Object property added for handling the case where a Record Set is described as having all or some members that belong to some category (see RiC-CM 0.2 attributes section, #4.4 on Record Set, Record and Record Part attributes).
  date: 2020-12-28

place relation has source
type: ObjectProperty
comment: Connects a Place Relation to the Place concerned.
domain: Place Relation
range: Place
sub property of: relation has source
inverse of: place is source of place relation

series
type: Record Set Type
type: Concept
type: NamedIndividual
definition: Documents arranged in accordance with a filing system or maintained as a unit because they result from the same accumulation or filing process, or the same activity; have a particular form; or because of some other relationship arising out of their creation, receipt, or use. A series is also known as a records series. (From ICA ISAD(G))
in scheme: Record Set Types

has or had appellation
type: ObjectProperty
comment: Connects a Thing to an Appellation that is or was used for designating it.
domain: Thing
range: Appellation
sub property of: is related to
inverse of: is or was appellation of
property chain axiom: thing is target of appellation relation
property chain axiom: appellation relation has source
change note: changed the IRI, label, inverse property IRI, textual definition (the name of this property in RiC-O 0.1 was "hasAppellation").
  date: 2021-01-22

Descendance Relation
type: Class
comment: Connects at least one Person to at least another Person, when the first has/have descendant the second one(s).
subclass of: Family Relation
subclass of: Agent Temporal Relation
subclass of: Restriction
  min qualified cardinality: 1
  on class: Person
  on property: descendance relation has target
subclass of: Restriction
  min qualified cardinality: 1
  on class: Person
  on property: descendance relation has source
RiC-CM corresponding component: Class implementation of RiC-R017 and RiC-R017i relations

authorship relation has target
type: ObjectProperty
comment: Connects an Authorship Relation to one of the author Person, Group or Position.
domain: Authorship Relation
range: Class
  union of: Group
  union of: Person
  union of: Position
sub property of: creation relation has target
inverse of: agent is target of authorship relation
change note: Created following the addition of RiC-R079 relation in RiC-CM 0.2
  date: 2020-12-29

Record Resource Extent
type: Class
comment: The extent of the content of a Record Resource.
subclass of: Extent
change note: Changed a bit the definition and added change notes.
  date: 2020-11-21
change note: Class added in order to handle an accurate description of a record resource extent
  date: 2020-10-28
scope note: Countable characteristics of the content of the Record Resource expressed as a quantity.
RiC-CM corresponding component: Class implementation of RiC-A35 (Record Resource extent attribute)

Activity
type: Class
comment: The doing of something for some human purpose.
subclass of: Event
subclass of: Restriction
  all values from: Activity Type
  on property: has activity type
subclass of: Restriction
  all values from: Agent
  on property: is or was performed by
change note: Scope note: made separate paragraphs and updated. Objective: to make RiC-O compliant with RiC-CM v0.2.
  date: 2020-10-23
scope note: Activity is a kind of Event. Activity is specifically used to designate purposeful human activity. Activity may be understood from two perspectives. First it can be understood as leading to an end. The end is the purpose of the Activity, or why the Activity is performed. Second, it can be understood in terms of the processes that lead to achieving the end, how the end is realized through coordinated actions. Purpose and process are complementary understandings of Activity. Together the two perspectives address why the Activity is performed, the expected ends or outcomes; and how the Activity fulfills the purpose. While activity has an intended end, it also has unintended consequences and results, or side-effects. By and large, these may not be the focus of the description, but they are, unquestionably, context. |In a corporate or government context an Activity may also be called a 'function'. An Activity exists in a specific social and cultural context, and within that context is subject to change over time. An Activity may be composed of other Activities.
RiC-CM corresponding component: Corresponds to RiC-E15 (Activity entity)

person has knowing relation
type: ObjectProperty
comment: Connects a Person to a Knowing Relation.
domain: Person
range: Knowing Relation
sub property of: agent is connected to agent relation
inverse of: knowing relation connects

Family Type
type: Class
comment: Categorization of a Family.
subclass of: Type
subclass of: Restriction
  all values from: Family
  on property: is family type of
change note: Comment: slighty changed.
  date: 2020-10-23
scope note: Family Type encompasses a wide variety of familial groups related by consanguinity, affinity, cohabitation or other social conventions.
RiC-CM corresponding component: Corresponds to RiC-A20 (Family Type attribute)

is record set type of
type: ObjectProperty
comment: Connects a Record Set Type to a Record Set that it categorizes.
domain: Record Set Type
range: Record Set
sub property of: is or was category of
inverse of: has record set type
change note: changed the super property IRI.
  date: 2021-01-22

activity is source of performance relation
type: ObjectProperty
comment: Connects an Activity that is performed to a Performance Relation
domain: Activity
range: Performance Relation
sub property of: thing is source of relation
inverse of: performance relation has source

Person
type: Class
comment: A human being with a social identity or persona.
subclass of: Agent
subclass of: Restriction
  all values from: Occupation Type
  on property: has or had occupation of type
disjoint with: Position
change note: Scope note: made separate paragraphs and updated. Disjoint with: enriched. Objective: to make RiC-O compliant with RiC-CM v0.2.
  date: 2020-10-23
change note: Removed one Restriction.
  date: 2021-02-08
scope note: Person is a kind of Agent. Most commonly, a human being (biological person) has a single coeval social identity or persona. In everyday discourse, this is the “real person.” Less common though not rare, over the course of a lifetime, personae in addition to the coeval (or “original”) persona may be associated with the human being. Such “alternative personae” are most often created by the original person for specific purposes. Under some circumstances, an alternative persona might eclipse or replace the original person (Mark Twain eclipsing Samuel Clemens; John Wayne eclipsing Marion Mitchell Morrison), that is, the social (shared) alternative identity becomes the predominate identity. Less common is whentwo or more persons collaborate to create a shared persona. Persona shared by two or more Persons constitute a kind of Group. Within the archival context, the original Person generally will be the focus of the description, with alternative personae noted. Exceptionally, an alternative persona may displace the coeval persona.s.
RiC-CM corresponding component: Corresponds to RiC-E08 (Person entity)

thing is source of sequential relation
type: ObjectProperty
comment: Connects a Thing to a Sequential Relation, when this Thing precedes other Thing(s) in the sequence.
domain: Thing
range: Sequential Relation
sub property of: thing is source of relation
inverse of: sequential relation has source

carrier extent
type: DatatypeProperty
comment: Number of physical units and/or physical dimensions of the carrier of a record resource instantiation. Various carriers, depending on specific needs, may have more than one relevant dimension. In some cases, indicating the number of physical units may be sufficient, while in other case, relevant dimensions should be used in order to characterize the carrier.
domain: Instantiation
range: Literal
sub property of: physical or logical extent
change note: Text definition and scope note updated. Examples added. Objective: to make RiC-O compliant with RiC-CM v0.2.
  date: 2020-11-01
example: 2 pieces of parchment, 30 x 50 cm and 32,5 x 49 cm
example: 3GB USB key
example: 1 page
example: 17 x 34.5 cm
scope note: For electronic resources, it indicates the size of storage capacity (disk, tape, film etc.). Carrier Extent should not be confused with Record Resource Extent or Instantiation Extent. For a given Record Resource, the Instantiation Extent may vary, based on format, density of information on the carrier, etc. For example, 1500 words (Record Resource Extent) may have Instantiation Extent 3kb as a Word document and 5kb as a PDF file, and instantiations may be represented on a CD of 700mb (Carrier Extent). Use if you don't use CarrierExtent class and its properties for handling such information.
RiC-CM corresponding component: Corresponds to RiC-A04 (Carrier Extent attribute)

instantiation is connected to functional equivalence relation
type: ObjectProperty
comment: Connects an Instantiation to a Functional Equivalence Relation
domain: Instantiation
range: Functional Equivalence Relation
sub property of: instantiation is connected to instantiation relation
inverse of: functional equivalence relation connects

has identifier type
type: ObjectProperty
comment: Connects an Identifier and an Identifier Type that categorizes it.
domain: Identifier
range: Identifier Type
sub property of: has or had category
inverse of: is identifier type of
change note: Object property added along with IdentifierType class and isIdentifierTypeOf object property.
  date: 2020-10-19
change note: changed the superproperty IRI.
  date: 2021-01-22

agent has work relation
type: ObjectProperty
comment: Connects an Agent to a Work Relation
domain: Agent
range: Work Relation
sub property of: agent is connected to agent relation
inverse of: work relation connects

knowing of relation has source
type: ObjectProperty
comment: Connects a Knowing Of Relation to a 'knowing of' Person (a Person who has some knowledge of another one.)
domain: Knowing Of Relation
range: Person
sub property of: relation has source
sub property of: agent relation connects
inverse of: person is source of knowing of relation

has or had member
type: ObjectProperty
comment: Connects a Group to a Person that is or was a member of that Group.
domain: Group
range: Person
sub property of: is agent associated with agent
inverse of: is or was member of
property chain axiom: group is source of membership relation
property chain axiom: membership relation has target
change note: changed the IRI, label, inverse property IRI and textual definition (changed made in order to make RiC-O compliant with RiC-CM 0.2; the name of this property in RiC-O 0.1 was "hasMember").
  date: 2021-01-22
RiC-CM corresponding component: RiC-R055 ('has or had member' relation)

Authorship Relation
type: Class
comment: Connects at least one Record to at least one Person, Group or Position that is responsible for conceiving and formulating the information contained in the Record.
subclass of: Creation Relation
subclass of: Restriction
  min qualified cardinality: 1
  on class: Class
    union of: Group
    union of: Person
    union of: Position
  on property: authorship relation has target
subclass of: Restriction
  min qualified cardinality: 1
  on class: Record
  on property: authorship relation has source
change note: Created following the addition of RiC-R079 relation in RiC-CM 0.2
  date: 2020-12-29
RiC-CM corresponding component: Class implementation of RiC-R079 and RiC-R079i relations

Production Technique Type
type: Class
comment: Categorization of the method used in the representation of information on the Instantiation.
subclass of: Type
subclass of: Restriction
  all values from: Instantiation
  on property: is production technique type of
change note: Comment: updated. Objective: to make RiC-O compliant with RiC-CM v0.2.
  date: 2020-10-23
RiC-CM corresponding component: Class implementation of RiC-A33 (Production Technique attribute)

Agent Hierarchical Relation
type: Class
comment: Connects at least one Agent to at least another Agent, when the first one is hierarchically superior to the second one.
subclass of: Agent Relation
subclass of: Restriction
  min qualified cardinality: 1
  on class: Agent
  on property: agent hierarchical relation has target
subclass of: Restriction
  min qualified cardinality: 1
  on class: Agent
  on property: agent hierarchical relation has source
RiC-CM corresponding component: Class implementation of RiC-R045 and RiC-R045i relations

Carrier Type
type: Class
comment: Categorization of physical material in or on which information is represented.
subclass of: Type
subclass of: Restriction
  all values from: Instantiation
  on property: is carrier type of
change note: Scope note: updated (quite the same as RiC-CM definition). Objective: to make RiC-O compliant with RiC-CM v0.2.
  date: 2020-10-23
scope note: Carrier Type information is essential for assessing authenticity, conservation needs and the availability, access and use of Record Resources. Carrier Type determines the environmental conditions of storage and the prerequisites and possible ways to access and use of the records. Should not be confused with Content Type, that categorizes a Record Resource, nor with Representation Type that categorizes an Instantiation. The Carrier Type depends on the media type that is required to access the records and is independent of its content
RiC-CM corresponding component: Corresponds to RiC-A05 (Carrier Type attribute)

location
type: DatatypeProperty
comment: A delimitation of the physical territory of a place. This datatype property is used to describe basic human-readable text such as an address, a cadastral reference, or less precise information found in a record.
domain: Place
range: Literal
change note: Text definition and scope note updated. Examples added. Objective: to make RiC-O compliant with RiC-CM v0.2.
  date: 2020-11-01
example: « Montreal »
example: 25 rue Saint-Denis à Paris @fr
example: near the church
scope note: Use only if you don't use PhysicalLocation class with Place. Use the geographicalCoordinates property, or the Coordinates class, record the geographical coordinates of the Place.s
RiC-CM corresponding component: Corresponds to RiC-A27 (Location attribute)

is or was place type of
type: ObjectProperty
comment: Connects a Place Type to a Place that is or was categorized by it.
domain: Place Type
range: Place
sub property of: is or was category of
inverse of: has or had place type
change note: changed the IRI, label, inverse property IRI, text definition, super property IRI (the name of this property in RiC-O 0.1 was "isPlaceTypeOf").
  date: 2021-01-22

agent control relation has source
type: ObjectProperty
comment: Connects an Agent Control Relation to one of the controlling Agents
domain: Agent Control Relation
range: Agent
sub property of: authority relation has source
sub property of: agent hierarchical relation has source
inverse of: agent is source of agent control relation

is or was legal status of
type: ObjectProperty
comment: Connects a Legal Status to an Agent or Record Resource that it categorizes.
domain: Legal Status
range: Class
  union of: Agent
  union of: Record
  union of: Record Part
sub property of: is or was category of
inverse of: has or had legal status
change note: changed the IRI, label, inverse property IRI, textual definition (the name of this property in RiC-O 0.1 was "isLegalStatusOf").
  date: 2021-01-22
scope note: Connects a Legal Status to an Agent, Record or Record Part that it categorized or categorizes.

is death date of
type: ObjectProperty
comment: Connects a Date to a Person who died on that Date.
domain: Date
range: Person
sub property of: is end date of
inverse of: has death date
RiC-CM corresponding component: RiC-R072 ('is death date of' relation)

position to group relation has source
type: ObjectProperty
comment: Connects a Position to Group Relation to a Position (that exists in a Group).
domain: Position to Group Relation
range: Position
sub property of: relation has source
sub property of: agent relation connects
inverse of: position is source of position to group relation

record resource or instantiation is target of intellectual property rights relation
type: ObjectProperty
comment: Connects a Record Resource or Instantiation (on which some intellectual property rights are held) to an Intellectual Property Rights Relation.
domain: Class
  union of: Instantiation
  union of: Record Resource
range: Intellectual Property Rights Relation
sub property of: thing is target of authority relation
inverse of: intellectual property rights relation has target

record resource or instantiation is target of management relation
type: ObjectProperty
comment: Connects a Record Resource or Instantiation (that is managed by an Agent) to a Management Relation.
domain: Class
  union of: Instantiation
  union of: Record Resource
range: Management Relation
sub property of: thing is target of authority relation
inverse of: management relation has target

Extent Type
type: Class
comment: Categorization of the extent that is being measured
subclass of: Type
change note: Added to specify the dimension that is being measured
  date: 2020-11-01

is or was jurisdiction of
type: ObjectProperty
comment: Connects a Place to an Agent that has or had jurisdiction over the Place.
domain: Place
range: Agent
sub property of: is place associated with
inverse of: has or had jurisdiction
change note: changed the IRI, label, inverse property IRI, textual definition (changed made in order to make RiC-O compliant with RiC-CM 0.2; the name of this property in RiC-O 0.1 was "isJurisdictionOf").
  date: 2021-01-22
RiC-CM corresponding component: RiC-R076 ('is or was jurisdiction of' relation)

is place associated with
type: ObjectProperty
comment: Connects a Place to a Thing that Place is associated with the existence and lifecycle of.
domain: Place
range: Thing
sub property of: is related to
inverse of: is associated with place
property chain axiom: place is source of place relation
property chain axiom: place relation has target
RiC-CM corresponding component: RiC-R074 ('is place associated with' relation)

appellation relation has target
type: ObjectProperty
comment: Connects an Appellation Relation to one of the designated Things
domain: Appellation Relation
range: Thing
sub property of: relation has target
inverse of: thing is target of appellation relation

is addressee of
type: ObjectProperty
comment: Inverse of 'has addressee' object property.
domain: Agent
range: Class
  union of: Instantiation
  union of: Record Resource
sub property of: is provenance of
inverse of: has addressee
RiC-CM corresponding component: RiC-032i ('is addressee of' relation)

is or was identifier of
type: ObjectProperty
comment: Connects an Identifier to a Thing that it identified or identifies.
domain: Identifier
range: Thing
sub property of: is or was appellation of
inverse of: has or had identifier
change note: changed the IRI, label, inverse property IRI, text definition, super property IRI (the name of this property in RiC-O 0.1 was "identifies").
  date: 2021-01-22

is or was content type of all members of
type: ObjectProperty
comment: Connects a Content Type and a Record Set whose all past or present Record or Record Part members have that Content Type.
domain: Content Type
range: Record Set
sub property of: is or was category of all members of
inverse of: has of had all members with content type
change note:
  value: Object property added for handling the case where a Record Set is described as having all or some members that belong to some category (see RiC-CM 0.2 attributes section, #4.4 on Record Set, Record and Record Part attributes).
  date: 2020-12-28

Thing
type: Class
comment: Any idea, material thing, or event within the realm of human experience.
change note: made separate paragraphs in the scope note.
  date: 2020-10-23
scope note: Includes all RiC entities as well as any concept, material thing, or event that may be the subject of a Record Resource or associated with an Activity. Examples of entities not explicitly addressed in RiC includes but is not limited to the following: abstract concepts; cultural movements, named periods and events; named things, objects and works; legendary, mythical or fictitious figures, characters or beings.
RiC-CM corresponding component: Corresponds to RiC-E01 (Thing entity)

is successor of
type: ObjectProperty
comment: Inverse of 'has successor' object property.
domain: Agent
range: Agent
sub property of: is agent associated with agent
sub property of: follows in time
inverse of: has successor
property chain axiom: agent is target of agent temporal relation
property chain axiom: agent temporal relation has source
change note: changed the inverse property IRI and the text definition.
  date: 2021-01-22
RiC-CM corresponding component: RiC-R016i (is successor of)

is or was adjacent to
type: ObjectProperty
type: SymmetricProperty
comment: Connects two Places that are or were geographically adjacent. This is a symmetric object property.
domain: Place
range: Place
sub property of: is associated with place
sub property of: is place associated with
change note: changed the IRI, label, textual definition (changed made in order to make RiC-O compliant with RiC-CM 0.2; the name of this property in RiC-O 0.1 was "isAdjacentTo").
  date: 2021-01-22
RiC-CM corresponding component: RiC-R077 ('is or was adjacent to' relation)

Sequential Relation
type: Class
comment: Connects at least one Thing to at least one Thing that follows it in some sequence.
subclass of: Relation
subclass of: Restriction
  min qualified cardinality: 1
  on class: Thing
  on property: sequential relation has target
subclass of: Restriction
  min qualified cardinality: 1
  on class: Thing
  on property: sequential relation has source
RiC-CM corresponding component: Class implementation of RiC-R008 and RiC-R008i relations

is event type of
type: ObjectProperty
comment: Connects an Event Type to an Event that is categorizes.
domain: Event Type
range: Event
sub property of: is or was category of
inverse of: has event type
change note: changed the superproperty IRI.
  date: 2021-01-22

has ancestor
type: ObjectProperty
comment: Inverse of 'has descendant' object property.
domain: Person
range: Person
sub property of: has family association with
sub property of: is successor of
inverse of: has descendant
property chain axiom: person is target of descendance relation
property chain axiom: descendance relation has source
change note: changed the superproperty IRIs.
  date: 2021-01-22
RiC-CM corresponding component: RiC-R017i (has ancestor relation)

Date Range
type: Class
comment: Chronological information associated with an entity that contributes to its identification and contextualization, that implies or explicitly states a start date and end date.
subclass of: Date
subclass of: Restriction
  max qualified cardinality: 1
  on class: Single Date
  on property: has end date
subclass of: Restriction
  max qualified cardinality: 1
  on class: Single Date
  on property: has beginning date
RiC-CM corresponding component: Corresponds to RiC-E20 (Date Range entity)

Demographic Group
type: Class
comment: Categorization of a person according to characteristics such as age, gender, education, place of origin, ethnic/cultural identification, religion, etc.
subclass of: Type
change note: Comment: updated. Scope note: updated and made several paragraphs. Objective: to make RiC-O compliant with RiC-CM v0.2.
  date: 2020-10-23
change note: Removed the Restriction.
  date: 2021-02-08
scope note: Can be extended with any number of subclasses, e.g. Age or Religion. A demographic group may be defined as a subset of the general population. Individuals may belong to several demographic groups
RiC-CM corresponding component: Corresponds to RiC-A15 (Demographic Group attribute)

rule relation has target
type: ObjectProperty
comment: Connects a Rule Relation to a Thing (that is associated to a Rule).
domain: Rule Relation
range: Thing
sub property of: relation has target
inverse of: thing is target of rule relation

authority relation has target
type: ObjectProperty
comment: Connects an Authority Relation to a Thing over which the Authority is performed
domain: Authority Relation
range: Thing
sub property of: relation has target
inverse of: thing is target of authority relation

appellation is source of appellation relation
type: ObjectProperty
comment: Connects an Appellation to an Appellation Relation
domain: Appellation
range: Appellation Relation
sub property of: thing is source of relation
inverse of: appellation relation has source

Ownership Relation
type: Class
comment: Connects at least one Group, Person or Position, and at least a Thing that these Agent(s) own(s).
subclass of: Authority Relation
subclass of: Restriction
  min qualified cardinality: 1
  on class: Thing
  on property: owner ship relation has target
subclass of: Restriction
  min qualified cardinality: 1
  on class: Class
    union of: Group
    union of: Person
    union of: Position
  on property: ownership relation has source
scope note: Among other probably more rare use cases for archival description, can be used between agents (a person owns a corporate body, a corporate body owns a mechanism), or between agents and record resources
RiC-CM corresponding component: Class implementation of RiC-R037 and RiC-R037i relations

Performance Relation
type: Class
comment: Connects at least one Activity to at least one Agent, when the first is performed by the second one(s).
subclass of: Event Relation
subclass of: Restriction
  min qualified cardinality: 1
  on class: Agent
  on property: performance relation has target
subclass of: Restriction
  min qualified cardinality: 1
  on class: Activity
  on property: performance relation has source
RiC-CM corresponding component: Class implementation of RiC-R060 and RiC-R060i relations

has extent
type: ObjectProperty
comment: Connects a Record Resource or Instantiation to an Extent
domain: Class
  union of: Instantiation
  union of: Record Resource
range: Extent
sub property of: is related to
inverse of: is extent of
change note: Object property created along with the Extent class and its subclasses, in order to provide methods for handling extent accurately.
  date: 2020-10-28

follows or followed
type: ObjectProperty
comment: Inverse of 'precedesOrPreceded' object property.
domain: Thing
range: Thing
sub property of: is related to
inverse of: precedes or preceded
property chain axiom: thing is target of sequential relation
property chain axiom: sequential relation has source
change note:
  value: changed the IRI, label, inverse property IRI, text definition, corresponding CM component name (changed made in order to make RiC-O compliant with RiC-CM 0.2; the name of this property in RiC-O 0.1 was "follows").
  date: 2021-01-22
RiC-CM corresponding component: RiC-R008i ('follows or followed' relation)

has sibling
type: ObjectProperty
type: SymmetricProperty
comment: Connects two Persons that are siblings. This relation is symmetric.
domain: Person
range: Person
sub property of: has family association with
property chain axiom: person has sibling relation
property chain axiom: sibling relation connects
change note: changed the super property IRI.
  date: 2021-01-22
RiC-CM corresponding component: RiC-R048 ('has sibling' relation)

thing is target of whole part relation
type: ObjectProperty
comment: Connects a Thing to a Whole Part Relation, when this Thing is Part of another Thing.
domain: Thing
range: Whole Part Relation
sub property of: thing is target of relation
inverse of: whole part relation has target

has of had all members with record state
type: ObjectProperty
comment: Connects a Record Set and a Record State that categorizes all the Records or Record Parts that are or were included in the Record Set.
domain: Record Set
range: Record State
sub property of: has or had all members with category
inverse of: is or was record state of all members of
change note:
  value: Object property added for handling the case where a Record Set is described as having all or some members that belong to some category (see RiC-CM 0.2 attributes section, #4.4 on Record Set, Record and Record Part attributes).
  date: 2020-12-28

activity is context of relation
type: ObjectProperty
comment: Connects an Activity to an Agent Temporal Relation (when the Activity is transferred from an Agent to another one) or a Mandate Relation (the Mandate assigns the Activity to the Agent or defines it).
domain: Activity
range: Class
  union of: Agent Temporal Relation
  union of: Mandate Relation
sub property of: thing is context of relation
inverse of: as concerns activity

is or was record state of some members of
type: ObjectProperty
comment: Connects a Record State and a Record Set whose some past or present Record or Record Part members have that Record State.
domain: Record State
range: Record Set
sub property of: is or was category of some members of
inverse of: has or had some members with record state
change note:
  value: Object property added for handling the case where a Record Set is described as having all or some members that belong to some category (see RiC-CM 0.2 attributes section, #4.4 on Record Set, Record and Record Part attributes).
  date: 2020-12-28

Relation
type: Class
comment: The top level relation class. It connects at least two Things. An instance of a Relation may have some datatype and object properties : a descriptive note (datatype property) like any Thing ; certainty (for 'certain', 'quite probable', 'uncertain','unknown'); a date (use either the date datatype property or the Date class and isAssociatedWithDate object property ; a state (relationState) ; a location (use Place class and isAssociatedWithPlace object property) ; a source of information that can be used as an evidence for it (use either source datatype property or hasSource object property).
subclass of: Thing
change note: Removed the restrictions; completed the definition and scope note.
  date: 2021-02-08
scope note: Use when direct, binary object properties are not enough, e.g. when you need to record a date, a location or any other descriptive element for a relation (till RDF-Star becomes a W3C recommendation and provides a lighter method for doing so); or when the relation invloves more than two entities (n-ary relation). It is recommended to use the subclasses of the Relation class.

has or had teacher
type: ObjectProperty
comment: Connects a Person to another Person who is or was their student.
domain: Person
range: Person
sub property of: knows
inverse of: has or had student
property chain axiom: person is target of teaching relation
property chain axiom: teaching relation has source
change note: changed the IRI, label, inverse property IRI, text definition (changed made in order to make RiC-O compliant with RiC-CM 0.2; the name of this property in RiC-O 0.1 was "hasTeacher").
  date: 2021-01-22
RiC-CM corresponding component: RiC-R053 ('has or had teacher' relation)

is or was language of all members of
type: ObjectProperty
comment: Connects a Language and a Record Set whose all present or past Record or Record Part members use that Language.
domain: Language
range: Record Set
sub property of: is related to
inverse of: has of had all members with language
change note:
  value: Object property added for handling the case where a Record Set is described as having all or some members that belong to some category (see RiC-CM 0.2 attributes section, #4.4 on Record Set, Record and Record Part attributes).
  date: 2020-12-28

has or had category
type: ObjectProperty
comment: Connects a Thing to a Type that categorizes or categorized it.
domain: Thing
range: Type
sub property of: is related to
inverse of: is or was category of
property chain axiom: thing is target of type relation
property chain axiom: type relation has source
change note: changed the IRI, label, inverse property IRI, text definition (the name of this property in RiC-O 0.1 was "belongsToCategory").
  date: 2021-01-22

RiC-CM corresponding component
type: AnnotationProperty
comment: When it exists, specifies the identifier and name of RiC-CM component that corresponds to the annotated class or property.
sub property of: comment

has activity type
type: ObjectProperty
comment: Connects an Activity to an Activity Type that categorizes it.
domain: Activity
range: Activity Type
sub property of: has or had category
inverse of: is activity type of
change note: changed the superproperty IRI.
  date: 2021-01-22

instantiation is target of record resource to instantiation relation
type: ObjectProperty
comment: Connects an Instantiation of a Record Resource to the Record Resource to Instantiation Relation.
domain: Instantiation
range: Record Resource to Instantiation Relation
sub property of: thing is target of relation
inverse of: record resource to instantiation relation has target

agent origination relation has target
type: ObjectProperty
comment: Connects an Agent Origination Relation to one of the creating or accumulating Agents
domain: Agent Origination Relation
range: Agent
sub property of: provenance relation has target
inverse of: agent is target of agent origination relation

is or was holder of intellectual property rights of
type: ObjectProperty
comment: Connects an Agent to a Record Resource or Instantiation on which the Agent has or had some intellectual property rights.
domain: Class
  union of: Group
  union of: Person
  union of: Position
range: Class
  union of: Instantiation
  union of: Record Resource
sub property of: has or had authority over
inverse of: has or had intellectual property rights holder
property chain axiom: agent is source of intellectual property rights relation
property chain axiom: intellectual property rights relation has target
change note:
  value: changed the IRI, label, inverse property IRI and textual definition (changed made in order to make RiC-O compliant with RiC-CM 0.2; the name of this property in RiC-O 0.1 was "hasIntellectualPropertyRightsOn").
  date: 2021-01-22
RiC-CM corresponding component: RiC-R040 ('is or was holder of intellectual property rights of' relation)

used to date
type: DatatypeProperty
comment: Date until an Appellation was used.
domain: Appellation
range: Literal
sub property of: date
scope note: Provided for usability reasons. May be deprecated and removed later on. Use only if you don't use Date classes for handling dates.
RiC-CM corresponding component: Data property specialized implementation of RiC-E18 (Date entity)

Corporate Body
type: Class
comment: An organized group of persons that act together as an Agent, and that has a recognized legal or social status.
subclass of: Group
change note: scope note: updated. Objective: to make RiC-O compliant with RiC-CM v0.2.
  date: 2020-10-23
scope note: Corporate Body is a kind of Group.
RiC-CM corresponding component: Corresponds to RiC-E11 (Corporate Body entity)

agent is target of accumulation relation
type: ObjectProperty
comment: Connects one of the accumulating Agents to an Accumulation Relation
domain: Agent
range: Accumulation Relation
sub property of: agent is target of agent origination relation
inverse of: accumulation relation has target

as concerns activity
type: ObjectProperty
comment: Connects an Agent Temporal Relation or Mandate Relation, to an Activity that is, either transferred from an Agent to another one, or assigned by a Mandate to an Agent.
domain: Class
  union of: Agent Temporal Relation
  union of: Mandate Relation
range: Activity
sub property of: relation has context
inverse of: activity is context of relation

is or was legal status of all members of
type: ObjectProperty
comment: Connects a Legal Status and a Record Set whose all past or present Record or Record Part members have that Legal Status.
domain: Legal Status
range: Record Set
sub property of: is or was category of all members of
inverse of: has of had all members with legal status
change note:
  value: Object property added for handling the case where a Record Set is described as having all or some members that belong to some category (see RiC-CM 0.2 attributes section, #4.4 on Record Set, Record and Record Part attributes).
  date: 2020-12-28

relation has source
type: ObjectProperty
comment: Connects an n-ary Relation to a Thing that is its source.
domain: Relation
range: Thing
sub property of: relation connects
inverse of: thing is source of relation

event relation has target
type: ObjectProperty
comment: Connects an Event Relation to an associated Thing
domain: Event Relation
range: Thing
sub property of: relation has target
inverse of: thing is target of event relation

record resource or instantiation is source of accumulation relation
type: ObjectProperty
comment: Connects a Record Resource or Instantiation (that is accumulated) to an Accumulation Relation.
domain: Class
  union of: Instantiation
  union of: Record Resource
range: Accumulation Relation
sub property of: record resource or instantiation is source of agent origination relation
inverse of: accumulation relation has source

descriptive note
type: DatatypeProperty
comment: Descriptive information about an entity that is not otherwise addressed.
domain: Thing
range: Literal
RiC-CM corresponding component: Corresponds to RiC-A16 (Descriptive Note attribute)

is receiver of
type: ObjectProperty
comment: Inverse of 'received by' object property.
domain: Agent
range: Class
  union of: Instantiation
  union of: Record Resource
sub property of: is accumulator of
inverse of: has receiver
change note: changed the IRI, label, inverse property IRI, super property IRI (changed made in order to make RiC-O compliant with RiC-CM 0.2; the name of this property in RiC-O 0.1 was "receives").
  date: 2021-01-22
RiC-CM corresponding component: RiC-R029i ('is receiver of' relation)

has or had constituent
type: ObjectProperty
comment: Connects a Record to a Record Part that is or was a component of that Record.
domain: Record
range: Record Part
sub property of: is record resource associated with record resource
sub property of: has or had part
inverse of: is or was constituent of
change note: changed the IRI, label, inverse property IRI, textual definition (changed made in order to make RiC-O compliant with RiC-CM 0.2; the name of this property in RiC-O 0.1 was "hasConstituent").
  date: 2021-01-22
RiC-CM corresponding component: RiC-R003 ('has or had constituent' relation)

person is target of teaching relation
type: ObjectProperty
comment: Connects a Person (as a student) to a Teaching Relation.
domain: Person
range: Teaching Relation
sub property of: thing is target of relation
sub property of: person has knowing relation
inverse of: teaching relation has target

Corporate Body Type
type: Class
comment: Categorization of a Corporate Body.
subclass of: Type
subclass of: Restriction
  all values from: Corporate Body
  on property: is or was corporate body type of
RiC-CM corresponding component: Corresponds to RiC-A12 (Corporate Body Type attribute)

rule is source of rule relation
type: ObjectProperty
comment: Connects a Rule to a Rule Relation.
domain: Rule
range: Rule Relation
sub property of: thing is source of relation
inverse of: rule relation has source

agent is target of agent hierarchical relation
type: ObjectProperty
comment: Connects one of the hierarchically inferior Agents to an Agent Hierarchical Relation
domain: Agent
range: Agent Hierarchical Relation
sub property of: thing is target of relation
sub property of: agent is connected to agent relation
inverse of: agent hierarchical relation has target

Record Resource
type: Class
comment: A Record, Record Set, or Record Part produced or acquired and retained by an Agent in the course of Activity.
subclass of: Thing
subclass of: Restriction
  all values from: Instantiation
  on property: has instantiation
change note: Scope note: made separate paragraphs plus very few changes.
  date: 2020-10-23
change note: Removed one Restriction.
  date: 2021-02-08
scope note: Producing a record resource may imply either its newly creation or a reuse of previous existing information by combination, rearrangement, selecting, reformatting etc. Records, Record Sets, and Record Parts are all evidence of the activities of an Agent. More than one Agent may be involved in the creation of a Record Resource. The role of the Agent in creating the Record Resource may take different forms, for example, authoring of an individual record, accumulating a set of records, or forming a set of records. Though a Record, Record Set, and Record Part, under most circumstances, may be easily distinguished from one another, frequently identifying the boundary of each and how the “bounded information regions” interrelate, may present particular challenges. Documentary Forms provide the rules governing many Records, providing criteria for identifying its boundary, and identifying its essential Record Parts. Many Records, though, do not have well-established documentary forms, particularly electronic records, where it may be difficult to determine whether individual elements represented in separate bitstreams are record parts, records, or record sets. For example, is a photograph represented independently in a bitstream embedded in a text document a Record, or a Record Part ? Or is the same photograph attached to an email, maintaining its independent representation, a Record or a Record Part? When information is grouped for some purpose, for example, zip or tar “file compression” for saving storage space, presents a further challenge. One file comprises multiple bitstreams subjected to techniques that remove bits that can be losslessly recovered when decompressed. Under what circumstances is such a compressed bitstream a Record or a Record Set? Determining when an information object is a Record, Record Part, or Record Set is based on perspective and judgement exercised in a particular context. In one context, the Agent describing an information object may designate …
RiC-CM corresponding component: Corresponds to RiC-E02 (Record Resource entity)

last modification date
type: DatatypeProperty
comment: Date at which an entity was last updated.
domain: Thing
range: Literal
sub property of: modification date
scope note: Provided for usability reasons. May be deprecated and removed later on. Use only if you don't use Date classes for handling dates.
RiC-CM corresponding component: Data property specialized implementation of RiC-E18 (Date entity)

membership with position
type: ObjectProperty
comment: Connects a Membership Relation to the Position occupied by the member Person(s).
domain: Membership Relation
range: Position
sub property of: relation has context
inverse of: position is context of membership relation

Record
type: Class
comment: Information inscribed at least once by any method on any physical carrier in any persistent, recoverable form by an Agent in the course of life or work Activity.
subclass of: Record Resource
change note: Scope note: updated and made several paragraphs. Objective: to make RiC-O compliant with RiC-CM v0.2.
  date: 2020-10-23
change note: Removed the Restriction.
  date: 2021-02-08
scope note: Record is a kind of Record Resource. A Record must have or have had at least one Instantiation. A Record may have more than one Instantiation. A re-instantiation of the record may be considered the same record or a new record, depending on the context and of the functions that record serves. Such information may serve a variety of purposes, though it always documents or is evidence of Activity.
RiC-CM corresponding component: Corresponds to RiC-E04 (Record entity)

thing is target of appellation relation
type: ObjectProperty
comment: Connects a Thing (that is designated by an Appellation) to an Appellation Relation.
domain: Thing
range: Appellation Relation
sub property of: thing is target of relation
inverse of: appellation relation has target

is or was legal status of some members of
type: ObjectProperty
comment: Connects a Legal Status and a Record Set whose some past or present Record or Record Part members have that Legal Status.
domain: Legal Status
range: Record Set
sub property of: is or was category of some members of
inverse of: has or had some members with legal status
change note:
  value: Object property added for handling the case where a Record Set is described as having all or some members that belong to some category (see RiC-CM 0.2 attributes section, #4.4 on Record Set, Record and Record Part attributes).
  date: 2020-12-28

Record Resource structure
type: DatatypeProperty
comment: Information about the intellectual arrangement and composition of a Record Resource. For Record and Record Part, it encompasses information about the intellectual composition of the record, the presence of record parts and their functions. For Record Set, it encompasses information about the methodology or criteria used for arranging the Record Set members or Record members within the containing Record Set
domain: Record Resource
range: Literal
sub property of: structure
change note: Text definition updated. Examples added. Objective: to make RiC-O compliant with RiC-CM v0.2.
  date: 2020-11-01
example: The series have the files arranged according to the alphabetical order of the places concerned.
example: Inside each file, the records are arranged chronologically.
example: The database has 3 related tables: names, addresses, and passport numbers.
example: The record has 2 appendixes, comprising a full account of the income from car taxes and real estate taxes.
RiC-CM corresponding component: Specialization of RiC-A40 (Structure attribute)

type relation has source
type: ObjectProperty
comment: Connects a Type Relation to the Type (that categorizes the involved Thing(s)).
domain: Type Relation
range: Type
sub property of: relation has source
inverse of: type is source of type relation

was last updated at date
type: ObjectProperty
comment: Connects a Thing to the Date when it was last modified.
domain: Thing
range: Date
sub property of: has modification date
inverse of: is last update date of

Position to Group Relation
type: Class
comment: Connects at least one Position, and a Group, when the first one(s) exist(s) in/is defined within the second one.
subclass of: Agent Relation
subclass of: Restriction
  on class: Group
  on property: position to group relation has target
  qualified cardinality: 1
subclass of: Restriction
  min qualified cardinality: 1
  on class: Position
  on property: position to group relation has source
RiC-CM corresponding component: Class implementation of RiC-R056 and RiC-R056i relations

is equivalent to
type: SymmetricProperty
type: ObjectProperty
comment: Connects two Things that are considered equivalent.
domain: Thing
range: Thing
sub property of: is related to

physical characteristics
type: DatatypeProperty
comment: Information about the physical features of the Instantiation. Includes information about the physical nature and condition such as conservation status.
domain: Instantiation
range: Literal
change note: Text definition updated. Examples added. Objective: to make RiC-O compliant with RiC-CM v0.2.
  date: 2020-11-01
example: watermarked
example: emulsion flaking
example: carrier heavily foxed
example: British Library binding
RiC-CM corresponding component: Corresponds to RiC-A31 (Physical Characteristics attribute)

identifier
type: DatatypeProperty
comment: A word, number, letter, symbol, or any combination of these used to uniquely identify or reference an individual instance of an entity within a specific information domain. Includes Global Persistent Identifiers (globally unique and persistently resolvable identifier for the entity) and/or Local Identifiers.
domain: Thing
range: Literal
change note: Text definition and scope note updated. Examples added. Objective: to make RiC-O compliant with RiC-CM v0.2.
  date: 2020-11-01
example: SNAC ID: 83847206
example: ISNI : 0000000073572182
example: BUD-01-F002 [example of a classification number from a corporate file plan]
example: NAS1/A/1.1 [example of local identifier for a Record]
example: F 1204 [example of a local identifier for a Record Set assigned by a repository]
example: Ark ID: w6tz44ht
scope note: Use only if you don't use Identifier class for handling identifiers. Within a given domain (a closed system), identifiers are used to uniquely reference instances of an entity. Identifiers are instruments of control that facilitate management of the entities within the domain. The formulation of identifiers commonly is based on rules.
RiC-CM corresponding component: Corresponds to RiC-A22 (Identifier attribute)

person is source of position holding relation
type: ObjectProperty
comment: Connects a Person (who occupies a Position) to a Position Holding Relation.
domain: Person
range: Position Holding Relation
sub property of: thing is source of relation
sub property of: agent is connected to agent relation
inverse of: position holding relation has source

has or had some members with documentary form type
type: ObjectProperty
comment: Connects a Record Set and a Documentary Form Type that categorizes some of the Records or Record Parts that are or were included in the Record Set.
domain: Record Set
range: Documentary Form Type
sub property of: has or had some members with category
inverse of: is or was documentary form type of some members of
change note:
  value: Object property added for handling the case where a Record Set is described as having all or some members that belong to some category (see RiC-CM 0.2 attributes section, #4.4 on Record Set, Record and Record Part attributes).
  date: 2020-12-28

is or was manager of
type: ObjectProperty
comment: Connects an Agent to a Record Resource or Instantiation that the Agent managed or manages.
domain: Agent
range: Class
  union of: Instantiation
  union of: Record Resource
sub property of: has or had authority over
inverse of: has or had manager
property chain axiom: agent is source of management relation
property chain axiom: management relation has target
change note:
  value: changed the IRI, label, inverse property IRI, super property IRI, textual definition (changed made in order to make RiC-O compliant with RiC-CM 0.2; the name of this property in RiC-O 0.1 was "isManagerOf").
  date: 2021-01-22
RiC-CM corresponding component: RiC-R038 ('is or was manager of' relation)

has or had controller
type: ObjectProperty
comment: Inverse of 'is or was controller of' object property.
domain: Agent
range: Agent
sub property of: is or was under authority of
sub property of: is or was subordinate to
inverse of: is or was controller of
property chain axiom: agent is target of agent control relation
property chain axiom: agent control relation has source
change note:
  value: changed the IRI, label, inverse property IRI, text definition, corresponding CM component name (changed made in order to make RiC-O compliant with RiC-CM 0.2; the name of this property in RiC-O 0.1 was "controlledBy").
  date: 2021-01-22
RiC-CM corresponding component: RiC-R041i ('has or had controller' relation)

place relation has target
type: ObjectProperty
comment: Connects a Place Relation to a Thing that is associated to the Place.
domain: Place Relation
range: Thing
sub property of: relation has target
inverse of: thing is target of place relation

is original of
type: ObjectProperty
comment: Connects the original version of a Record to a copy or a later version.
domain: Class
  union of: Record
  union of: Record Part
range: Class
  union of: Record
  union of: Record Part
sub property of: precedes in time
sub property of: has genetic link to record resource
inverse of: has original
scope note: There may be zero to many intermediate Records, ignored or unknown, between the two connected Records
RiC-CM corresponding component: RiC-R010 (is original of relation)

activity documentation relation has target
type: ObjectProperty
comment: Connects an Activity Documentation Relation to one of the documented Activities
domain: Activity Documentation Relation
range: Activity
sub property of: provenance relation has target
inverse of: activity is target of activity documentation relation

measure
type: DatatypeProperty
comment: The extent, quantity, amount, or degree of an entity, as determined by measurement or calculation.
domain: Thing
range: Literal

has or had jurisdiction
type: ObjectProperty
comment: Inverse of 'is or was jurisdiction of' object property.
domain: Agent
range: Place
sub property of: is associated with place
inverse of: is or was jurisdiction of
change note: changed the IRI, label, inverse property IRI and textual definition (changed made in order to make RiC-O compliant with RiC-CM 0.2; the name of this property in RiC-O 0.1 was "hasJurisdiction").
  date: 2021-01-22
RiC-CM corresponding component: RiC-R076i ('has or had jurisdiction' relation)

is or was physical location of
type: ObjectProperty
comment: Connects a Physical Location to a Place, when it is or was its location.
domain: Physical Location
range: Place
sub property of: is associated with place
inverse of: has or had physical location
change note: changed the IRI, label, inverse property IRI, textual definition (the name of this property in RiC-O 0.1 was "isPhysicalLocationOf").
  date: 2021-01-22
change note: Property made a subproperty of 'isAssociatedWithPlace".
  date: 2021-02-01

Agent Temporal Relation
type: Class
comment: Connects at least one Agent, to at least another Agent, that succeeds it chronologically for, for instance, fullfilling some functions or performing some activities.
subclass of: Temporal Relation
subclass of: Agent Relation
subclass of: Restriction
  min qualified cardinality: 1
  on class: Agent
  on property: agent temporal relation has target
subclass of: Restriction
  min qualified cardinality: 1
  on class: Agent
  on property: agent temporal relation has source
subclass of: Restriction
  all values from: Activity
  on property: as concerns activity
RiC-CM corresponding component: Class implementation of RiC-R016 and RiC-016i relations

Rule Type
type: Class
comment: Categorization of a Rule.
subclass of: Type
subclass of: Restriction
  all values from: Rule
  on property: is or was rule type of
change note: Class added along with hasRuleType and isRuleTypeOf object properties.
  date: 2020-10-19
scope note: For example, for rules that can be applied to record resources : access rule, use rule, etc.

Authority Relation
type: Class
comment: Connects at least one Agent, and at least one Thing over which the Agent has some authority.
subclass of: Relation
subclass of: Restriction
  min qualified cardinality: 1
  on class: Thing
  on property: authority relation has target
subclass of: Restriction
  min qualified cardinality: 1
  on class: Agent
  on property: authority relation has source
scope note: Would probably rarely be used as such (use its sub-categories)
RiC-CM corresponding component: Class implementation of RiC-R036 and RiC-R036i relations

has draft
type: ObjectProperty
comment: Inverse of 'is draft of' object property.
domain: Class
  union of: Record
  union of: Record Part
range: Class
  union of: Record
  union of: Record Part
sub property of: follows in time
sub property of: has genetic link to record resource
inverse of: is draft of
RiC-CM corresponding component: RiC-011i ('has draft' relation)

Record Set
type: Class
comment: One or more records that are associated by categorization and/or physical aggregation by the creator or other Agent.
subclass of: Record Resource
subclass of: Restriction
  all values from: Record Set Type
  on property: has record set type
change note: comment: updated. Scope note: updated and made several paragraphs. Objective: to make RiC-O compliant with RiC-CM v0.2.
  date: 2020-10-23
scope note: Record Set is a kind of Record Resource. The Record members in a Record Set may physically reside together, though physical proximity is not essential. In a particular context, an Agent (e.g. administrator, records manager, archivist, end-user, etc.) may select the Record members of a Record Set based on a shared attribute or attributes, or a shared Relation or Relations. The grouping of the Records serves a purpose or purposes specific to the context of the Agent. All Record members of a Record Set may share the attribute of having been accumulated by the same Agent, or all share the same Documentary Form Type and are created over time by the same Activity. A Record Set may represent the act of classifying the Records in accordance with a formal classification scheme that may be based on Activity, subject, organizational structure, or other criteria; an act of archival arrangement (e.g. based on common provenance); or some other selection and grouping that fulfils a particular purpose or purposes (e.g. a classification that reflects or supports the purposes of a researcher). By exception, some Records are brought together based on their not belonging in the context of selection to other designated groups: a ‘Miscellaneous’ series, for example. A Record Set accumulated by an Agent in the course of life or work Activity should be kept in a manner that preserves context and evidential value. Records Sets may also contain other Records Sets. Both a Record Set and a Record may simultaneously be a member of more than one Record Set, and over the course of its existence, a Record Set or Record may be a member of an indeterminate number of Record Sets in an indeterminate number of contexts. Record Sets and Records contained within a Record Set may be ordered into a sequence based on a common property or relation, or common properties or relations (e.g. alphabetical by Agent or related Place name; chronological order by an allocated Date); or some other criterion (e.g. an i…
RiC-CM corresponding component: Corresponds to RiC-E03 (Record Set entity)

whole part relation has target
type: ObjectProperty
comment: Connects a Whole Part Relation to a Thing that is a part.
domain: Whole Part Relation
range: Thing
sub property of: relation has target
inverse of: thing is target of whole part relation

has source
type: ObjectProperty
comment: Connects a Record Resource or Relation to a Record Resource or Agent that is used as a source of information for identifying or describing it.
domain: Class
  union of: Record Resource
  union of: Relation
range: Class
  union of: Agent
  union of: Record Resource
sub property of: is related to
inverse of: is source of

thing is target of sequential relation
type: ObjectProperty
comment: Connects a Thing (that follows other Thing(s) in a sequence) to a Sequential Relation.
domain: Thing
range: Sequential Relation
sub property of: thing is target of relation
inverse of: sequential relation has target

has or had location
type: ObjectProperty
comment: Inverse of 'is or was location of' object property.
domain: Thing
range: Place
sub property of: is associated with place
inverse of: is or was location of
change note: changed the IRI, label, inverse property IRI and textual definition (changed made in order to make RiC-O compliant with RiC-CM 0.2; the name of this property in RiC-O 0.1 was "hasLocation").
  date: 2021-01-22
RiC-CM corresponding component: RiC-R075i ('has or had location' relation)

Place
type: Class
comment: Bounded, named geographic area or region.
subclass of: Thing
subclass of: Restriction
  all values from: Physical Location
  on property: has or had physical location
change note: Comment: updated. Scope note: updated and made several paragraphs. Objective: to make RiC-O compliant with RiC-CM v0.2.
  date: 2020-10-23
scope note: A Place may be a jurisdiction, a manmade structure, or a natural feature. A manmade structure or natural feature may also be a jurisdiction. A Place may be referenced to a Physical Location on the earth, or (if you don't want to use the PhysicalLocation class) directly to geographic coordinates. Both jurisdictions and natural features are historical entities. A Place thus may have begin and end dates, and changing boundaries that result from human or natural events. A Jurisdiction is the bounded geographic area within which an Agent has the authority to perform specified activities constrained by rules.
RiC-CM corresponding component: Corresponds to RiC-E22 (Place entity)

documented by
type: ObjectProperty
comment: Inverse of 'documents' object property.
domain: Activity
range: Class
  union of: Instantiation
  union of: Record Resource
sub property of: results or resulted in
inverse of: documents
change note: changed the inverse property IRI, the superproperty IRI and the corresponding CML component name
  date: 2021-01-22
RiC-CM corresponding component: RiC-R033i ('documented by' relation)

has or had owner
type: ObjectProperty
comment: Inverse of 'is or was owner of' object property.
domain: Thing
range: Class
  union of: Group
  union of: Person
  union of: Position
sub property of: is or was under authority of
inverse of: is or was owner of
property chain axiom: thing is target of ownership relation
property chain axiom: ownership relation has source
change note: changed the IRI, label, inverse property IRI, text definition, super property IRI (changed made in order to make RiC-O compliant with RiC-CM 0.2; the name of this property in RiC-O 0.1 was "ownedBy").
  date: 2021-01-22
RiC-CM corresponding component: RiC-R037i ('has or had owner' relation)

has of had all members with content type
type: ObjectProperty
comment: Connects a Record Set and a Content Type that categorizes all the Records or Record Parts that are or were included in the Record Set.
domain: Record Set
range: Content Type
sub property of: has or had all members with category
inverse of: is or was content type of all members of
change note:
  value: Object property added for handling the case where a Record Set is described as having all or some members that belong to some category (see RiC-CM 0.2 attributes section, #4.4 on Record Set, Record and Record Part attributes).
  date: 2020-12-28

Proxy
type: Class
comment: A Proxy represents (stands for) a Record Resource as it exists in a specific Record Set.
subclass of: Concept
subclass of: Restriction
  on class: Record Set
  on property: proxy in
  qualified cardinality: 1
subclass of: Restriction
  on class: Record Resource
  on property: proxy for
  qualified cardinality: 1
scope note: Useful for handling in RDF the sequencing of records or records sets in the context of a Record set. A Record Resource has only one Proxy in the context of one specific Record Set. It may have many Proxies simultaneously or through time.
close to: ORE Proxy (http://www.openarchives.org/ore/terms/Proxy)

has instantiation
type: ObjectProperty
comment: Connects a Record Resource to one of its Instantiations.
domain: Record Resource
range: Instantiation
sub property of: is related to
inverse of: is instantiation of
property chain axiom: record resource is source of record resource to instantiation relation
property chain axiom: record resource to instantiation relation has target
change note: changed the inverse property IRI.
  date: 2021-01-22
RiC-CM corresponding component: RiC-R025 ('has instantiation' relation)

teaching relation has source
type: ObjectProperty
comment: Connects a Teaching Relation to a Person (who is a teacher).
domain: Teaching Relation
range: Person
sub property of: relation has source
sub property of: knowing relation connects
inverse of: person is source of teaching relation

person is source of teaching relation
type: ObjectProperty
comment: Connects a Person (as a teacher) to a Teaching Relation.
domain: Person
range: Teaching Relation
sub property of: thing is source of relation
sub property of: person has knowing relation
inverse of: teaching relation has source

has or had occupation of type
type: ObjectProperty
comment: Connects a Person to an Occupation Type that categorized or categorizes his/her occupation (profession, trade or craft).
domain: Person
range: Occupation Type
sub property of: has or had demographic group
inverse of: is or was occupation type of
change note: changed the IRI, label, inverse property IRI, textual definition, super property IRI (the name of this property in RiC-O 0.1 was "hasOccupationOfType").
  date: 2021-01-22

has creator
type: ObjectProperty
comment: Connects a Record Resource or an Instantiation to an Agent that is either responsible for all or some of the content of the Record Resource or is a contributor to the genesis or production of an Instantiation.
domain: Class
  union of: Instantiation
  union of: Record Resource
range: Agent
sub property of: has provenance
inverse of: is creator of
change note: changed the IRI and label (changed made in order to make RiC-O compliant with RiC-CM 0.2; the name of this property in RiC-O 0.1 was "createdBy").
  date: 2021-01-22
scope note: Covers the definition of author in diplomatics, and any contribution to the intellectual content of a Record Resource.
RiC-CM corresponding component: RiC-R027 ('has creator' relation)

agent control relation has target
type: ObjectProperty
comment: Connects an Agent Control Relation to one of the controlled Agents
domain: Agent Control Relation
range: Agent
sub property of: agent hierarchical relation has target
sub property of: authority relation has target
inverse of: agent is target of agent control relation
RiC-CM corresponding component: s

authorizing agent
type: ObjectProperty
comment: Connects a Mandate Relation to an Agent that assigns the Mandate.
domain: Mandate Relation
range: Agent
sub property of: relation has context
inverse of: is authorizing agent in mandate relation

has or had physical location
type: ObjectProperty
comment: Connects a Place to one of its past or present Physical Location.
domain: Place
range: Physical Location
sub property of: is place associated with
inverse of: is or was physical location of
change note: changed the IRI, label, inverse property IRI, textual definition (the name of this property in RiC-O 0.1 was "hasPhysicalLocation").
  date: 2021-01-22
change note: Property made a subproperty of 'isPlaceAssociatedWith".
  date: 2021-02-01

height
type: DatatypeProperty
comment: Vertical dimension of an entity.
domain: Thing
range: Literal
sub property of: measure

has family type
type: ObjectProperty
comment: Connects a Family to a Family Type that categorizes it.
domain: Family
range: Family Type
sub property of: has or had category
inverse of: is family type of
change note: changed the superproperty IRI.
  date: 2021-01-22

close to
type: AnnotationProperty
comment: An annotation property for recording a possible mapping to a component in another model or ontology
sub property of: comment

Family Relation
type: Class
comment: Connects at least two Persons, when they have some family link, i.e. belong to the same family.
subclass of: Agent Relation
subclass of: Restriction
  min qualified cardinality: 2
  on class: Person
  on property: family relation connects
RiC-CM corresponding component: Class implementation of RiC-R047 and RiC-R047i relations

person is target of descendance relation
type: ObjectProperty
comment: Connects a Person (as a descendant) to a Descendance Relation.
domain: Person
range: Descendance Relation
sub property of: person has family relation
sub property of: agent is target of agent temporal relation
inverse of: descendance relation has target

person is target of knowing of relation
type: ObjectProperty
comment: Connects a Person (of which another Person has some knowledge) to a Knowing Of Relation.
domain: Person
range: Knowing Of Relation
sub property of: thing is target of relation
sub property of: agent is connected to agent relation
inverse of: knowing of relation has target

describes or described
type: ObjectProperty
comment: Connects a Record Resource to a Thing that it describes.
domain: Record Resource
range: Thing
sub property of: has or had subject
inverse of: is or was described by
change note:
  value: changed the IRI, label, inverse property IRI, text definition, corresponding CM component name (changed made in order to make RiC-O compliant with RiC-CM 0.2; the name of this property in RiC-O 0.1 was "describes").
  date: 2021-01-22
scope note: Can be used, among other situations, for specifying that some finding aid (a Record that has Documentary Form Type Finding Aid) describes some Record Set.
RiC-CM corresponding component: RiC-R021 (describes or described)

isPublisherOf
type: ObjectProperty
comment: Connects an Agent to a Record Resource that it published.
domain: Agent
range: Record Resource
sub property of: is related to
inverse of: hasPublisher
change note: changed the IRI, label, inverse property IRI (the name of this property in RiC-O 0.1 was "publishes").
  date: 2021-01-22

position to group relation has target
type: ObjectProperty
comment: Connects a Position to Group Relation to a Group (in which a Position exists).
domain: Position to Group Relation
range: Group
sub property of: relation has target
sub property of: agent relation connects
inverse of: group is target of position to group relation

Temporal Relation
type: Class
comment: Connects at least one Thing to at least one Thing that follows it in chronological order.
subclass of: Sequential Relation
subclass of: Restriction
  min qualified cardinality: 1
  on class: Thing
  on property: temporal relation has target
subclass of: Restriction
  min qualified cardinality: 1
  on class: Thing
  on property: temporal relation has source
RiC-CM corresponding component: Class implementation of RiC-R009 and RiC-R009i relations

is authorizing agent in mandate relation
type: ObjectProperty
comment: Connects an Agent that assigns the Mandate, to a Mandate Relation.
domain: Agent
range: Mandate Relation
sub property of: thing is context of relation
inverse of: authorizing agent

calendar
type: DatatypeProperty
comment: Used system of reckoning time in which the beginning, length, and divisions of a year are defined, sometimes along with multiyear cycles.
domain: Date
range: Literal
sub property of: date standard
RiC-CM corresponding component: Specialization of RiC-A14 (Date Standard attribute)

exists or existed in
type: ObjectProperty
comment: Connects a Position to a Group in which that Position exists or existed, or that is defined by that Group�s organizational structure.
domain: Position
range: Group
sub property of: is agent associated with agent
inverse of: has or had position
property chain axiom: position is source of position to group relation
property chain axiom: position to group relation has target
change note:
  value: changed the IRI, label, inverse property IRI, text definition, corresponding CM component name (changed made in order to make RiC-O compliant with RiC-CM 0.2; the name of this property in RiC-O 0.1 was "existsIn").
  date: 2021-01-22
RiC-CM corresponding component: RiC-R056 ('exists or existed in' relation)

agent temporal relation has source
type: ObjectProperty
comment: Connects an Agent Temporal Relation to one of the predecessor Agents
domain: Agent Temporal Relation
range: Agent
sub property of: temporal relation has source
sub property of: agent relation connects
inverse of: agent is source of agent temporal relation

beginning date
type: DatatypeProperty
comment: Date at which something began.
domain: Thing
range: Literal
sub property of: date
scope note: Provided for usability reasons. May be deprecated and removed later on. Use only if you don't use Date classes for handling dates.
RiC-CM corresponding component: Data property specialized implementation of RiC-E18 (Date entity)

is or was constituent of
type: ObjectProperty
comment: Inverse of 'has or had constituent' object property.
domain: Record Part
range: Record
sub property of: is or was part of
sub property of: is record resource associated with record resource
inverse of: has or had constituent
change note: changed the IRI, label, inverse property IRI, text definition (changed made in order to make RiC-O compliant with RiC-CM 0.2; the name of this property in RiC-O 0.1 was "isConstituentOf").
  date: 2021-01-22
RiC-CM corresponding component: RiC-R003i ('is or was constituent of' relation)

has or had identifier
type: ObjectProperty
comment: Connects a Thing to one of its past or present Identifiers.
domain: Thing
range: Identifier
sub property of: has or had appellation
inverse of: is or was identifier of
change note: changed the IRI, label, inverse property IRI, text definition, super property IRI (the name of this property in RiC-O 0.1 was "identifiedBy").
  date: 2021-01-22

is creator of
type: ObjectProperty
comment: Inverse of 'has creator' object property.
domain: Agent
range: Class
  union of: Instantiation
  union of: Record Resource
sub property of: is provenance of
inverse of: has creator
property chain axiom: agent is target of creation relation
property chain axiom: creation relation has source
change note: change the inverse property IRI.
  date: 2021-01-22
RiC-CM corresponding component: RiC-R027i ('is creator of 'relation')

Documentary Form Type
type: Class
comment: Categorization of the document with respect to its extrinsic and intrinsic elements that together communicate its content, administrative and documentary context, and authority
subclass of: Type
subclass of: Restriction
  all values from: Class
    union of: Record
    union of: Record Part
  on property: is documentary form type of
change note: Comment: updated. Scope note: made several paragraphs. Objective: to make RiC-O compliant with RiC-CM v0.2.
  date: 2020-10-23
scope note: Documentary Form Type plays an important role in determining the type of information a Record may comprise, its status of perfection, and its authenticity and reliability. Documentary form types exist in a specific social and cultural context, and within that context, are subject to change over time
RiC-CM corresponding component: Corresponds to RiC-A17 (Documentary Form Type attribute)

record resource genetic relation connects
type: ObjectProperty
comment: Connects a Record Resource Genetic Relation to one of the associated Record Resources.
domain: Record Resource Genetic Relation
range: Record Resource
sub property of: record resource relation connects
inverse of: record resource is connected to record resource genetic relation

Mandate
type: Class
comment: Delegation of authority by an Agent to another Agent to perform an Activity.
subclass of: Rule
subclass of: Restriction
  all values from: Agent
  on property: authorizes
change note: Scope note: made separate paragraphs and updated. Objective: to make RiC-O compliant with RiC-CM v0.2.
  date: 2020-10-23
scope note: Mandate is a kind of Rule. A Mandate confers the authority or competencies of Agents to perform a specified Activity. In addition to assigning an Activity and delegating authority to perform the Activity to an Agent, a Mandate commonly limits the Place (jurisdiction) and Date (time period) within which an Agent may perform the Activity (where and when). Mandates exist in a specific social and cultural context, and within that context are subject to change over time. While a Mandate may be tacit, in whole or part, it may be explicitly expressed in a variety of documentary sources (for example, constitutions, legislation, (legal) acts, statutes, legal codes, ordinances, charges, charters, or mission statements). The evidence for identifying a Mandate may be found in its entirety in one documentary source (for example, a law or regulation), or may be found in two or more sources. A Mandate should not be confused with the one or more documentary sources that serve as evidence of its identity. A documentary source is a Record.
RiC-CM corresponding component: Corresponds to RiC-E17 (Mandate entity)

record resource is connected to record resource relation
type: ObjectProperty
comment: Connects a Record Resource to a Record Resource Relation.
domain: Record Resource
range: Record Resource to Record Resource Relation
sub property of: thing is connected to relation
inverse of: record resource relation connects

record resource or instantiation is source of creation relation
type: ObjectProperty
comment: Connects a Record Resource or Instantiation (that is created) to a Creation Relation.
domain: Class
  union of: Instantiation
  union of: Record Resource
range: Creation Relation
sub property of: record resource or instantiation is source of agent origination relation
inverse of: creation relation has source

proxy in
type: ObjectProperty
comment: Connects a Proxy to the Record Set in which it stands for (represents) another Record Resource.
domain: Proxy
range: Record Set
sub property of: is related to

Coordinates
type: Class
comment: Longitudinal and latitudinal information of a Place.
subclass of: Thing
subclass of: Restriction
  all values from: Physical Location
  on property: is or was coordinates of
change note: Removed the cardinality Restrictions when the range is a datatype property
  date: 2021-02-08
RiC-CM corresponding component: Class implementation of RiC-A11 (Coordinates attribute)

publication date
type: DatatypeProperty
comment: Date of the publication of a Record Resource.
domain: Record Resource
range: Literal
sub property of: date
scope note: Provided for usability reasons. May be deprecated and removed later on. Use only if you don't use Date classes for handling dates.
RiC-CM corresponding component: Data property specialized implementation of RiC-E18 (Date entity)

Extent
type: Class
comment: Countable characteristics of the content of an entity expressed as a quantity.
subclass of: Thing
change note: Class added together with three subclasses and hasExtent and isExtentOf Object properties
  date: 2020-10-28
scope note: Physical or logical extent of a resource

Legal Status
type: Class
comment: A status defined by law.
subclass of: Type
RiC-CM corresponding component: Corresponds to RiC-A26 (Legal Status attribute)

has collector
type: ObjectProperty
comment: Connects a Record Resource or an Instantiation to the Agent that collects it intentionally (is a collector).
domain: Class
  union of: Instantiation
  union of: Record Resource
range: Agent
sub property of: has accumulator
inverse of: is collector of
change note:
  value: changed the IRI, label, inverse property and super property IRI, text definition, domain (changed made in order to make RiC-O compliant with RiC-CM 0.2; the name of this property in RiC-O 0.1 was "collectedBy").
  date: 2021-01-22
RiC-CM corresponding component: RiC-R030 ('has collector' relation)

creation date
type: DatatypeProperty
comment: Date at which an entity was created.
domain: Thing
range: Literal
sub property of: beginning date
scope note: Provided for usability reasons. May be deprecated and removed later on. Use only if you don't use Date classes for handling dates.
RiC-CM corresponding component: Data property specialized implementation of RiC-E18 (Date entity)

has extent type
type: ObjectProperty
comment: Connects an Extent to an Extent Type that categorizes what is being measured.
domain: Extent
range: Extent Type
sub property of: has or had category
inverse of: is extent type of
change note: Object property added along with the Extent Type class.
  date: 2020-11-01

Record Set Type
type: Class
comment: A broad categorization of the type of Record Set.
subclass of: Type
subclass of: Restriction
  all values from: Record Set
  on property: is record set type of
change note: scope note: updated. Objective: to make RiC-O compliant with RiC-CM v0.2.
  date: 2020-10-23
scope note: Four instances of Record Set Type are included for now in RiC-O; they also are instances of skos:Concept and, as such, part of a SKOS vocabulary. Record Set Type may also be used to categorize types of Record Set that have not traditionally been considered archival, e.g. search result list.
RiC-CM corresponding component: Corresponds to RiC-A36 (Record Set Type attribute)

fonds
type: Record Set Type
type: Concept
type: NamedIndividual
definition: The whole of the records, regardless of form or medium, organically created and/or accumulated and used by a particular person, family, or corporate body in the course of that creator's activities and functions. (From ICA ISAD(G))
in scheme: Record Set Types

has or had subject
type: ObjectProperty
comment: Connects a Record Resource to a Thing that is or was its subject.
domain: Record Resource
range: Thing
sub property of: is related to
inverse of: is or was subject of
change note: changed the IRI, label, inverse property IRI, text definition (changed made in order to make RiC-O compliant with RiC-CM 0.2; the name of this property in RiC-O 0.1 was "hasSubject").
  date: 2021-01-22
RiC-CM corresponding component: RiC-R019 ('has or had subject' relation)

is or was corporate body type of
type: ObjectProperty
comment: Connects a Corporate Body Type to a Corporate Body that it categorizes or categorized.
domain: Corporate Body Type
range: Corporate Body
sub property of: is or was category of
inverse of: has or had corporate body type
change note: changed the IRI, label, inverse property IRI, text definition (the name of this property in RiC-O 0.1 was "isCorporateBodyTypeOf").
  date: 2021-01-22

modification date
type: DatatypeProperty
comment: Date of the modification of an entity.
domain: Thing
range: Literal
sub property of: date
scope note: Provided for usability reasons. May be deprecated and removed later on. Use only if you don't use Date classes for handling dates.
RiC-CM corresponding component: Data property specialized implementation of RiC-E18 (Date entity)

thing is source of whole part relation
type: ObjectProperty
comment: Connects a Thing to a Whole Part Relation, when this Thing has Part other Thing(s).
domain: Thing
range: Whole Part Relation
sub property of: thing is source of relation
inverse of: whole part relation has source

authorizes
type: ObjectProperty
comment: Connects a Mandate to the Agent that the Mandate gives the authority or competencies to act.
domain: Mandate
range: Agent
sub property of: is rule associated with
inverse of: authorized by
property chain axiom: mandate is source of mandate relation
property chain axiom: mandate relation has target
change note: fixed the CM corresponding component name.
  date: 2021-01-22
RiC-CM corresponding component: RiC-R067 ('authorizes' relation)

Derivation Relation
type: Class
comment: Connects an Instantiation to at least one Instantiation that is derived from it.
subclass of: Temporal Relation
subclass of: Instantiation to Instantiation Relation
subclass of: Restriction
  on class: Instantiation
  on property: derivation relation has source
  qualified cardinality: 1
subclass of: Restriction
  min qualified cardinality: 1
  on class: Instantiation
  on property: derivation relation has target
RiC-CM corresponding component: Class implementation of RiC-R014 and RiR014i relations

has or had holder
type: ObjectProperty
comment: Inverse of 'is or was holder of' object property.
domain: Class
  union of: Instantiation
  union of: Record Resource
range: Agent
sub property of: has or had manager
inverse of: is or was holder of
property chain axiom: record resource or instantiation is target of record resource holding relation
property chain axiom: record resource holding relation has source
change note: changed the IRI, label, inverse property IRI, text definition, super property IRI (changed made in order to make RiC-O compliant with RiC-CM 0.2; the name of this property in RiC-O 0.1 was "heldBy").
  date: 2021-01-22
RiC-CM corresponding component: RiC-R039i ('has or had holder' relation)

is or was controller of
type: ObjectProperty
comment: Connects an Agent to another Agent it controls or controlled via Activities, i.e. controls by function.
domain: Agent
range: Agent
sub property of: has or had subordinate
sub property of: has or had authority over
inverse of: has or had controller
property chain axiom: agent is source of agent control relation
property chain axiom: agent control relation has target
change note:
  value: changed the IRI, label, inverse property IRI, text definition, corresponding CM component name (changed made in order to make RiC-O compliant with RiC-CM 0.2; the name of this property in RiC-O 0.1 was "controls").
  date: 2021-01-22
RiC-CM corresponding component: RiC-R041 ('is or was controller of' relation)

Management Relation
type: Class
comment: Connects at least one Agent, and at least one Record Resource or Instantiation that the Agent manages.
subclass of: Authority Relation
subclass of: Restriction
  min qualified cardinality: 1
  on class: Class
    union of: Instantiation
    union of: Record Resource
  on property: management relation has target
subclass of: Restriction
  min qualified cardinality: 1
  on class: Agent
  on property: management relation has source
RiC-CM corresponding component: Class implementation of RiC-R038 and RiC-R038i relations

Mechanism
type: Class
comment: A process or system created by a Person or Group that performs an Activity.
subclass of: Agent
disjoint with: Person
disjoint with: Position
change note: scope note: made separate paragraphs. Disjoint with: enriched.
  date: 2020-10-23
scope note: Mechanism is a kind of Agent. A Mechanism may have both mechanical and software components, or may be exclusively software. A Mechanism acts in the world producing physical or social effects, and frequently generates or modifies Records.
RiC-CM corresponding component: Corresponds to RiC-E13 (Mechanism entity)

is or was rule type of
type: ObjectProperty
comment: connects a Rule Type to a Rule that it categorized or categorizes.
domain: Rule Type
range: Rule
sub property of: is or was category of
inverse of: has or had rule type
change note: Object property added along with RuleType class and hasRuleType object property.
  date: 2020-10-19
change note: changed the IRI, label, inverse property IRI, text definition, super property URI (the name of this property in RiC-O 0.1 was "isRuleTypeOf").
  date: 2021-01-22

is or was regulated by
type: ObjectProperty
comment: Inverse of the 'regulates or regulated' object property.
domain: Thing
range: Rule
sub property of: is associated with rule
inverse of: regulates or regulated
change note: changed the IRI, label, inverse property IRI (changed made in order to make RiC-O compliant with RiC-CM 0.2; the name of this property in RiC-O 0.1 was "regulatedBy").
  date: 2021-01-22
RiC-CM corresponding component: RiC-R063i ('is or was regulated by' relation)

derivation relation has source
type: ObjectProperty
comment: Connects a Derivation Relation to the Instantiation from which one or more Instantiations is derived.
domain: Derivation Relation
range: Instantiation
sub property of: temporal relation has source
sub property of: instantiation to instantiation relation connects
inverse of: instantiation is source of derivation relation

reference system
type: DatatypeProperty
comment: Framework or standard used to represent an information.
domain: Thing
range: Literal

has original
type: ObjectProperty
comment: Inverse of 'is original of' object property.
domain: Class
  union of: Record
  union of: Record Part
range: Class
  union of: Record
  union of: Record Part
sub property of: has genetic link to record resource
sub property of: follows in time
inverse of: is original of
RiC-CM corresponding component: RiC-R010i (is original of relation)

is or was place name of
type: ObjectProperty
comment: Connects a Place Name to a Place that was or is designated by it.
domain: Place Name
range: Place
sub property of: is or was name of
inverse of: has or had place name
change note: changed the IRI, label, inverse property IRI, text definition, super property IRI (the name of this property in RiC-O 0.1 was "isPlaceNameOf").
  date: 2021-01-22

relation has target
type: ObjectProperty
comment: Connects an n-ary Relation to a Thing that is its target.
domain: Relation
range: Thing
sub property of: relation connects
inverse of: thing is target of relation

Event
type: Class
comment: Something that happens in time and space.
subclass of: Thing
subclass of: Restriction
  all values from: Event Type
  on property: has event type
change note: Scope note: made separate paragraphs and some changes.
  date: 2020-10-23
scope note: An event may be natural, human, or a combination of natural and human. Events have temporal and spatial boundaries. An event may actively involve some agent(s) and affect any entity. An event may be discrete, happening at a specific moment in time, or may occur over an extended period of time. Events may have events as parts, and events may precede or follow one another. Multiple agents may participate in the same event, and in different roles.
RiC-CM corresponding component: Corresponds to RiC-E14 (Event entity)
close to: LODE Event class (http://linkedevents.org/ontology/#term-Event)

Appellation Relation
type: Class
comment: The relation between an Appellation and at least one Thing that the Appellation designates.
subclass of: Relation
subclass of: Restriction
  on class: Appellation
  on property: appellation relation has source
  qualified cardinality: 1
subclass of: Restriction
  min qualified cardinality: 1
  on class: Thing
  on property: appellation relation has target

is event associated with
type: ObjectProperty
comment: Connects an Event to a Thing that is associated with the existence and lifecycle of the Event.
domain: Event
range: Thing
sub property of: is related to
inverse of: is associated with event
property chain axiom: event is source of event relation
property chain axiom: event relation has target
RiC-CM corresponding component: RiC-R057 ('is event associated with' relation)

sequential relation has source
type: ObjectProperty
comment: Connects a Sequential Relation to a Thing that precedes other Thing(s) in the sequence.
domain: Sequential Relation
range: Thing
sub property of: relation has source
inverse of: thing is source of sequential relation

agent is target of creation relation
type: ObjectProperty
comment: Connects a creator Agent to a Creation Relation
domain: Agent
range: Creation Relation
sub property of: agent is target of agent origination relation
inverse of: creation relation has target

Correspondence Relation
type: Class
comment: Connects at least two Persons, when they correspond to each other.
subclass of: Knowing Relation
subclass of: Restriction
  min qualified cardinality: 2
  on class: Person
  on property: correspondence relation connects
RiC-CM corresponding component: Class implementation of RiC-R052 and Ri052i relations

used from date
type: DatatypeProperty
comment: Date at which an Appellation was first used.
domain: Appellation
range: Literal
sub property of: date
scope note: Provided for usability reasons. May be deprecated and removed later on. Use only if you don't use Date classes for handling dates.
RiC-CM corresponding component: Data property specialized implementation of RiC-E18 (Date entity)

membership relation has source
type: ObjectProperty
comment: Connects a Membership Relation to the Group that has member(s).
domain: Membership Relation
range: Group
sub property of: relation has source
sub property of: agent relation connects
inverse of: group is source of membership relation

Place Name
type: Class
comment: A label, title or term designating a Place in order to make it distinguishable from other similar entities.
subclass of: Name
RiC-CM corresponding component: Class implementation of a specialization of RiC-A28 (Name attribute)

is related to
type: SymmetricProperty
type: ObjectProperty
comment: The most generic object property. Connects an Thing to any other Thing This is a symmetric object property.
domain: Thing
range: Thing
RiC-CM corresponding component: RiC-R001 (is related to relation)

Type
type: Class
comment: A superclass for any category of some thing. A type characterizes an entity.
subclass of: Concept

agent hierarchical relation has source
type: ObjectProperty
comment: Connects an Agent Hierarchical Relation to one of the hierarchically superior Agents
domain: Agent Hierarchical Relation
range: Agent
sub property of: relation has source
sub property of: agent relation connects
inverse of: agent is source of agent hierarchical relation

is or was occupied by
type: ObjectProperty
comment: Inverse of 'occupies or occupied' object property.
domain: Position
range: Person
sub property of: is agent associated with agent
inverse of: occupies or occupied
property chain axiom: position is target of position holding relation
property chain axiom: position holding relation has source
change note: changed the IRI, label, inverse property IRI, text definition (changed made in order to make RiC-O compliant with RiC-CM 0.2; the name of this property in RiC-O 0.1 was "occupiedBy").
  date: 2021-01-22
RiC-CM corresponding component: RiC-R054i ('is or was occupied by' relation)

knowing relation connects
type: ObjectProperty
comment: Connects Knowing Relation to any known Person involved.
domain: Knowing Relation
range: Person
sub property of: agent relation connects
inverse of: person has knowing relation

is or was coordinates of
type: ObjectProperty
comment: Connects an instance of Coordinates to a Physical Location it locates or located on earth, according to some reference system.
domain: Coordinates
range: Physical Location
sub property of: is related to
inverse of: has coordinates
change note: changed the IRI, label, inverse property IRI, text definition (the name of this property in RiC-O 0.1 was "isCoordinatesOf").
  date: 2021-01-22

Mandate Relation
type: Class
comment: Connects at least one Mandate, and at least one Agent, when the first gives the second one the authority or competencies to act. May also involve one to many Activities that the Mandate(s) assign(s) to the Agent(s).
subclass of: Rule Relation
subclass of: Restriction
  min qualified cardinality: 1
  on class: Mandate
  on property: mandate relation has source
subclass of: Restriction
  min qualified cardinality: 1
  on class: Activity
  on property: as concerns activity
subclass of: Restriction
  all values from: Agent
  on property: authorizing agent
subclass of: Restriction
  min qualified cardinality: 1
  on class: Agent
  on property: mandate relation has target
RiC-CM corresponding component: Class implementation of RiC-R067 and RiC-R067i relations

relation has context
type: ObjectProperty
comment: Connects an n-ary Relation to a Thing that is a secondary, contextual entity during the existence of the Relation.
domain: Relation
range: Thing
sub property of: relation connects
inverse of: thing is context of relation
scope note: The secondary entity may be, for instance, a Position or a Role Type.

Representation Type
type: Class
comment: Categorization of the method of recording the content type of a Record Resource.
subclass of: Type
subclass of: Restriction
  all values from: Instantiation
  on property: is representation type of
change note: Comment and scope note: updated. Objective: to make RiC-O compliant with RiC-CM v0.2.
  date: 2020-10-23
scope note: Representation Type can be unmediated (which allows humans to receive the message communicated without an intermediation of a device) and mediated (which needs a device to decode the message). A lot of contemporary mediated types are digital. Each Representation Type may present specific features: bit rate for audio, resolution for digital images, encoding format for video etc. Depending of the type, properties may thus be needed to describe their characteristics. Not be confused with Content Type or Carrier Type since the form of representation can be independent of the communication or carrier.
RiC-CM corresponding component: Corresponds to RiC-A37 (Representation Type attribute)

Family
type: Class
comment: Two or more persons related by birth, or through marriage, adoption, civil union, or other social conventions that bind them together as a socially recognized familial group.
subclass of: Group
change note: Scope note: made separate paragraphs and some changes.
  date: 2020-10-23
scope note: Family is a kind of Group. “Family” is used here as a general term that encompasses a wide variety of familial groups. Other types of familial groups include Dynasty, Clan, House, Tribe and others. Though family may be a recognized legal group in specific contexts, the term may also be used for groups that are socially recognized as families. A family may be a group of persons related either by consanguinity or affinity or cohabitation or other social conventions. In some context, a Family may be legally recognized as Corporate Body. For example, certain North American peoples (tribes) retain self-government rights and have jurisdiction over defined tribal lands.
RiC-CM corresponding component: Corresponds to RiC-E10 (Family entity)

Agent Name
type: Class
comment: A label, title or term designating an Agent in order to make it distinguishable from other similar entities.
subclass of: Name
RiC-CM corresponding component: Class implementation of a specialization of RiC-A28 (Name attribute)

agent is source of ownership relation
type: ObjectProperty
comment: Connects an owner Agent to an Ownership Relation
domain: Class
  union of: Group
  union of: Person
  union of: Position
range: Ownership Relation
sub property of: agent is source of authority relation
inverse of: ownership relation has source

work relation connects
type: ObjectProperty
comment: Connects a Work Relation to an Agent.
domain: Work Relation
range: Agent
sub property of: agent relation connects
inverse of: agent has work relation

is agent associated with agent
type: ObjectProperty
type: SymmetricProperty
comment: Connects two Agents. This object property is symmetric.
domain: Agent
range: Agent
sub property of: is related to
property chain axiom: agent is connected to agent relation
property chain axiom: agent relation connects
scope note: Use to connect two Agents only if it is not possible to be more accurate and use a narrower Agent to Agent relation, e.g. ‘has work relation with’.
RiC-CM corresponding component: RiC-R044 ('is agent associated with agent' relation)

is documentary form type of
type: ObjectProperty
comment: Connects a Documentary Form Type to a Record or Record Part that it categorizes.
domain: Documentary Form Type
range: Class
  union of: Record
  union of: Record Part
sub property of: is or was category of
inverse of: has documentary form type
change note: changed the superproperty IRI.
  date: 2021-01-22

longitude
type: DatatypeProperty
comment: Distance in degrees east or west of a prime meridian.
domain: Coordinates
range: Literal
sub property of: measure
scope note: Property of the Coordinates class. If you don't use this class, use geographicalCoordinates property, a property of Place class.

conditions of access
type: DatatypeProperty
comment: Terms and circumstances affecting the availability of a Record Resource for consultation. Such conditions may originate in laws, regulations and policies, including those pertaining to privacy and security concerns or restrictions; they may concern a specific Instantiation of a Record Resource, for example, conditions that require preservation treatment; or they may specify the software or hardware necessary to access the Instantiation.
domain: Class
  union of: Instantiation
  union of: Record Resource
range: Literal
change note: Text definition and scope note updated. Examples added. Objective: to make RiC-O compliant with RiC-CM v0.2.
  date: 2020-11-01
example: Acceso libre a través de los terminales de consulta @es
example: Recognita software, min. version 3.0, is needed in order to open the file.
example: the Archives cannot provide VHS reader to access the content of the tape.
example: closed as awaiting conservation treatment
example: open
example: closed under data protection legislation
scope note: This property provides information about the accessibility of a Record Resource, as well as the physical, technical or legal limitations that exist for providing access to it.
RiC-CM corresponding component: Corresponds to RiC-A08 (Conditions of Access attribute)

Record Part
type: Class
comment: Part of a Record with discrete information content that contributes to the Record's physical or intellectual completeness.
subclass of: Record Resource
change note: comment: updated. Scope note: made several paragraphs. Objective: to make RiC-O compliant with RiC-CM v0.2.
  date: 2020-10-23
change note: Removed the Restriction.
  date: 2021-02-08
scope note: Record Part is a kind of Record Resource. A Record Part may itself have Record Parts.
RiC-CM corresponding component: Corresponds to RiC-E05 (Record Part entity)

is extent type of
type: ObjectProperty
comment: Connects an Extent Type to an Extent that it categorizes.
domain: Extent Type
range: Extent
sub property of: is or was category of
inverse of: has extent type
change note: Added a rdfs:comment.
  date: 2020-11-21
change note: Object property added along with the Extent Type class.
  date: 2020-11-01

Agent
type: Class
comment: A Person, or Group, or an entity created by a Person or Group (Mechanism), or a Position, that acts in the world.
subclass of: Thing
change note: removed the Restrictions
  date: 2021-02-08
change note: Comment: updated. Scope note: updated and made several paragraphs. Objective: to make RiC-O compliant with RiC-CM v0.2.
  date: 2020-10-23
scope note: An Agent may have one or more identities; an identity is a constellation of properties or relations that together “identify” the Agent. A Person or Group commonly has one identity, though each also may have one or more alternative identities. Such alternative identities may be shared by more than one Person or Group. Alternative identities include but are not limited to pseudonyms, heteronyms, DBA (Doing Business As), and trade identities. An alternative identity should not be confused with a Position in a Group, for example, presidents, prime ministers, governors, popes, royalty, or bishops. Nor should an alternative identity be confused with a variant name or identifier of the same identity. Agent also includes entities created by a Person or Group that act on behalf of the creating Agent in an autonomous or semi-autonomous manner. Examples of a Mechanism include software agents, robots, and space and underwater probes that generate data (records) in the course of Activity assigned to and in conformance with the instructions given to them by the creating Person or Group.
RiC-CM corresponding component: Corresponds to RiC-E07 (Agent entity)

is or was affected by
type: ObjectProperty
comment: Inverse of 'affects or affected' object property.
domain: Thing
range: Event
sub property of: is or was participant in
inverse of: affects or affected
change note:
  value: changed the IRI, label, inverse property IRI, text definition and corresponding CM component (changed made in order to make RiC-O compliant with RiC-CM 0.2; the name of this property in RiC-O 0.1 was "affectedBy").
  date: 2021-01-22
RiC-CM corresponding component: RiC-R059i ('is or was affected by' relation)

group is source of group subdivision relation
type: ObjectProperty
comment: Connects the Group that has at least a subdivision, to a Group Subdivision Relation
domain: Group
range: Group Subdivision Relation
sub property of: thing is source of whole part relation
sub property of: agent is source of agent hierarchical relation
inverse of: group subdivision relation has source

is or was main subject of
type: ObjectProperty
comment: Inverse of 'has or had main subject' object property.
domain: Thing
range: Record Resource
sub property of: is or was subject of
inverse of: has or had main subject
change note:
  value: changed the IRI, label, inverse property IRI, super property IRI, textual definition (changed made in order to make RiC-O compliant with RiC-CM 0.2; the name of this property in RiC-O 0.1 was "isMainSubjectOf").
  date: 2021-01-22
RiC-CM corresponding component: RiC-R020i (is or was main subject of)

Record Resource extent
type: DatatypeProperty
comment: The quantity of information content as human experienced represented in the Record Resource. The method and precision of expressing the quantity of information represented in a Record Resource will vary by the kind of Record Resource being described as well as by processing economy constraints. For record sets, quantity may be expressed as number of records, or, for analogue records in particular, by the physical storage dimensions of the Record members. For individual records or record parts, quantity may be expressed in more precise terms. Use if you don't use RecordResourceExtent class and its properties for handling such information.
domain: Record Resource
range: Literal
sub property of: physical or logical extent
change note: Text definition and scope note updated. Examples added. Objective: to make RiC-O compliant with RiC-CM v0.2.
  date: 2020-11-01
change note: Updated the scope note, as a RecordResourceExtent class has been created.
  date: 2020-11-21
example: 6 photographs
example: 34 poems
example: 2 films
example: 6 maps
example: 2.065.735 characters
example: 1,500 words
example: 3 minutes and 24 seconds
scope note: The number, size or duration of the information content unit(s) remains the same even if the information is instantiated in various carriers. For example, a file of 1500 words (Record Resource Extent) may have Instantiation Extent 3kb as a Word document and 5kb as a PDF file, and instantiations may be represented on a CD of 700mb (Carrier Extent). Use if you don't use RecordResourceExtent class and its properties for handling such information.
RiC-CM corresponding component: Corresponds to RiC-A35 (Record Resource extent attribute)

is source of
type: ObjectProperty
comment: Connects a Record Resource or an Agent to a Record Resource or Relation, when the first is used as a source of information for identifying or describing the second one.
domain: Class
  union of: Agent
  union of: Record Resource
range: Class
  union of: Record Resource
  union of: Relation
sub property of: is related to
inverse of: has source

is or was described by
type: ObjectProperty
comment: Inverse of 'describes or described' object property.
domain: Thing
range: Record Resource
sub property of: is or was subject of
inverse of: describes or described
change note:
  value: changed the IRI, label, inverse property IRI, text definition, corresponding CM component name (changed made in order to make RiC-O compliant with RiC-CM 0.2; the name of this property in RiC-O 0.1 was "describedBy").
  date: 2021-01-22
RiC-CM corresponding component: RiC-R021i ('is or was described by' relation)

has production technique type
type: ObjectProperty
comment: Connects an Instantiation to a Production Technique Type that categorizes its production technique.
domain: Instantiation
range: Production Technique Type
sub property of: has or had category
inverse of: is production technique type of
change note: changed the super property IRI.
  date: 2021-01-22

is copy of
type: ObjectProperty
comment: Inverse of 'has copy' object property.
domain: Record Resource
range: Record Resource
sub property of: follows in time
sub property of: has genetic link to record resource
inverse of: has copy
RiC-CM corresponding component: RiC-R012i ('is copy of' relation)

agent is target of performance relation
type: ObjectProperty
comment: Connects an Agent to a Performance Relation
domain: Agent
range: Performance Relation
sub property of: thing is target of relation
inverse of: performance relation has target

death date
type: DatatypeProperty
comment: Date at which a Person died.
domain: Person
range: Literal
sub property of: end date
scope note: Provided for usability reasons. May be deprecated and removed later on. Use only if you don't use Date classes for handling dates.
RiC-CM corresponding component: Data property specialized implementation of RiC-E18 (Date entity)

provenance relation has source
type: ObjectProperty
comment: Connects a Provenance Relation to a Record Resource or Instantiation.
domain: Provenance Relation
range: Class
  union of: Instantiation
  union of: Record Resource
sub property of: relation has source
inverse of: record resource or instantiation is source of provenance relation

is or was member of
type: ObjectProperty
comment: Inverse of 'has or had member' object property.
domain: Person
range: Group
sub property of: is agent associated with agent
inverse of: has or had member
property chain axiom: person is target of membership relation
property chain axiom: membership relation has source
change note: changed the IRI, label, inverse property IRI, textual definition (changed made in order to make RiC-O compliant with RiC-CM 0.2; the name of this property in RiC-O 0.1 was "isMemberOf").
  date: 2021-01-22
RiC-CM corresponding component: RiC-R055i ('is or was member of' relation)

has descendant
type: ObjectProperty
comment: Connects a Person to one of their descendants.
domain: Person
range: Person
sub property of: has family association with
sub property of: has successor
inverse of: has ancestor
property chain axiom: person is source of descendance relation
property chain axiom: descendance relation has target
change note: changed the superproperties IRIs.
  date: 2021-01-22
RiC-CM corresponding component: RiC-R017 ('has descendant' relation)

has sender
type: ObjectProperty
comment: Connects a Record Resource or an Instantiation to the Agent that sends it
domain: Class
  union of: Instantiation
  union of: Record Resource
range: Agent
sub property of: has provenance
inverse of: is sender of
RiC-CM corresponding component: RiC-R031 ('has sender' relation)

agent is target of agent control relation
type: ObjectProperty
comment: Connects one of the controlled Agents to an Agent Control Relation
domain: Agent
range: Agent Control Relation
sub property of: thing is target of authority relation
sub property of: agent is target of agent hierarchical relation
inverse of: agent control relation has target

thing is target of ownership relation
type: ObjectProperty
comment: Connects a Thing (that is owned by a Group, a Person or a Position) to an Ownership Relation.
domain: Thing
range: Ownership Relation
sub property of: thing is target of authority relation
inverse of: owner ship relation has target

Instantiation structure
type: DatatypeProperty
comment: Information about the physical arrangement and composition of an Instantiation.
domain: Instantiation
range: Literal
sub property of: structure
change note: Text definition fixed. Objective: to make RiC-O compliant with RiC-CM v0.2.
  date: 2020-11-01
RiC-CM corresponding component: Specialization of RiC-A40 (Structure attribute)

has documentary form type
type: ObjectProperty
comment: Connects a Record or Record Part to its Documentary Form Type.
domain: Class
  union of: Record
  union of: Record Part
range: Documentary Form Type
sub property of: has or had category
inverse of: is documentary form type of
change note: changed the superproperty IRI.
  date: 2021-01-22

has successor
type: ObjectProperty
comment: Connects an Agent to another Agent that succeeds it chronologically.
domain: Agent
range: Agent
sub property of: is agent associated with agent
sub property of: precedes in time
inverse of: is successor of
property chain axiom: agent is source of agent temporal relation
property chain axiom: agent temporal relation has target
change note: changed the IRI and label (changed made in order to make RiC-O compliant with RiC-CM 0.2; the name of this property in RiC-O 0.1 was "isAntecedentOf").
  date: 2021-01-22
scope note: There may be zero to many intermediate Agents , ignored or unknown, between the two connected Agents. Can be used when there is a transfer of function from the first Agent to the second Agent.
RiC-CM corresponding component: RIC-R016 ('has successor' relation)

has representation type
type: ObjectProperty
comment: Connects an Instantiation to a Representation Type that categorizes its representation type.
domain: Instantiation
range: Representation Type
sub property of: has or had category
inverse of: is representation type of
change note: changed the super property IRI.
  date: 2021-01-22

teaching relation has target
type: ObjectProperty
comment: Connects a Teaching Relation to a Person (who is a student).
domain: Teaching Relation
range: Person
sub property of: relation has target
sub property of: knowing relation connects
inverse of: person is target of teaching relation

agent is target of authorship relation
type: ObjectProperty
comment: Connects a Person, Group or Position to an Authorship Relation.
domain: Class
  union of: Group
  union of: Person
  union of: Position
range: Authorship Relation
sub property of: agent is target of creation relation
inverse of: authorship relation has target
change note: Created following the addition of RiC-R079 relation in RiC-CM 0.2
  date: 2020-12-29

is associated with place
type: ObjectProperty
comment: Inverse of 'is place associated with' object property.
domain: Thing
range: Place
sub property of: is related to
inverse of: is place associated with
property chain axiom: thing is target of place relation
property chain axiom: place relation has source
RiC-CM corresponding component: RiC-R074i ('is associated with place' relation)

proxy for
type: ObjectProperty
comment: Connects a Proxy to the Record Resource it stands for in the specific context of a Record Set.
domain: Proxy
range: Record Resource
sub property of: is related to

Date Set
type: Class
comment: Non-contiguous single dates or date ranges.
subclass of: Date
change note: Comment: updated. Objective: to make RiC-O compliant with RiC-CM v0.2.
  date: 2020-10-23
scope note: Primarily used in the description of Record Sets to describe dates of member Records
RiC-CM corresponding component: Corresponds to RiC-E21 (Date Set entity)

has or had correspondent
type: SymmetricProperty
type: ObjectProperty
comment: Connects two Persons that correspond or have corresponded with each other. This relation is symmetric.
domain: Person
range: Person
sub property of: knows
property chain axiom: person has correspondence relation
property chain axiom: correspondence relation connects
change note: changed the IRI, label, textual definition (changed made in order to make RiC-O compliant with RiC-CM 0.2; the name of this property in RiC-O 0.1 was "hasCorrespondent").
  date: 2021-01-22
RiC-CM corresponding component: RiC-R052 ('has or had correspondent' relation)

precedes or preceded
type: ObjectProperty
comment: Connects a Thing to a Thing that follows or followed it in some sequence.
domain: Thing
range: Thing
sub property of: is related to
inverse of: follows or followed
property chain axiom: thing is source of sequential relation
property chain axiom: sequential relation has target
change note:
  value: changed the IRI, label, inverse property IRI, text definition, corresponding CM component name (changed made in order to make RiC-O compliant with RiC-CM 0.2; the name of this property in RiC-O 0.1 was "precedes").
  date: 2021-01-22
scope note: The relation does not specify by itself what criteria are used for ordering the sequence. There may actually be zero to many intermediate Entities, ignored or unkown, in the sequence between the two connected Things. Can be used, for example, for specifying that some Record 'precedes' (has next) some Record within a Record Set.
RiC-CM corresponding component: RiC-R008 ('precedes or preceded' relation)

agent is target of mandate relation
type: ObjectProperty
comment: Connects a mandated Agent to a Mandate Relation
domain: Agent
range: Mandate Relation
sub property of: thing is target of rule relation
inverse of: mandate relation has target

Documentary Form Types
type: ConceptScheme
type: NamedIndividual
creator: International Coucil on Archives Expert Group on Archival Description (ICA EGAD)
title: International Council on Archives Records in Contexts Vocabulary for Documentary Form Types
definition: A vocabulary that includes documentary form types

was used from date
type: ObjectProperty
comment: Connects an Appellation to the Date from which it was used.
domain: Appellation
range: Date
sub property of: is associated with date
inverse of: is from use date of

Type Relation
type: Class
comment: Connects a category (a Type) and at least one Thing that belongs to this category.
subclass of: Relation
subclass of: Restriction
  on class: Type
  on property: type relation has source
  qualified cardinality: 1
subclass of: Restriction
  min qualified cardinality: 1
  on class: Thing
  on property: type relation has target
scope note: may be useful at least for some types (e.g. demographic group)

Creation Relation
type: Class
comment: Connects at least one Record Resource or Instantiation to at least one Agent, when the Agent is either responsible for all or some of the content of the Record Resource, or is a contributor to the genesis or production of the Instantiation.
subclass of: Agent Origination Relation
subclass of: Restriction
  min qualified cardinality: 1
  on class: Agent
  on property: creation relation has target
subclass of: Restriction
  min qualified cardinality: 1
  on class: Class
    union of: Instantiation
    union of: Record Resource
  on property: creation relation has source
subclass of: Restriction
  all values from: Role Type
  on property: creation with role
RiC-CM corresponding component: Class implementation of RiC-R027 and RiC-R027i relations

has or had all members with category
type: ObjectProperty
comment: Connects a Record Set and a Category (Type) to which all the Records or Record Parts that are or were included in the Record Set belong.
domain: Record Set
range: Type
sub property of: is related to
inverse of: is or was category of all members of
change note:
  value: Object property added for handling the case where a Record Set is described as having all or some members that belong to some category (see RiC-CM 0.2 attributes section, #4.4 on Record Set, Record and Record Part attributes).
  date: 2020-12-28

is date associated with
type: ObjectProperty
comment: Connects a Date to a Thing that the Date is associated with the existence and lifecycle of.
domain: Date
range: Thing
sub property of: is related to
inverse of: is associated with date
RiC-CM corresponding component: RiC-R068 ('is date associated with' relation)

authorship relation has source
type: ObjectProperty
comment: Connects an Authorship Relation to one of the Records involved in the relation.
domain: Authorship Relation
range: Record
sub property of: creation relation has source
inverse of: record is source of authorship relation
change note: Created following the addition of RiC-R079 relation in RiC-CM 0.2
  date: 2020-12-29

precedes in time
type: ObjectProperty
comment: Connects a Thing to a Thing that follows it in chronological order.
domain: Thing
range: Thing
sub property of: precedes or preceded
inverse of: follows in time
property chain axiom: thing is source of temporal relation
property chain axiom: temporal relation has target
change note: changed the superproperty IRI
  date: 2021-01-22
scope note: There may actually be zero to many intermediate Entities, ignored or unknown, in the chronological sequence between the two connected Entities.
RiC-CM corresponding component: RiC-R009 ('precedes in time' relation)

agent temporal relation has target
type: ObjectProperty
comment: Connects an Agent Temporal Relation to one of the successor Agents
domain: Agent Temporal Relation
range: Agent
sub property of: temporal relation has target
sub property of: agent relation connects
inverse of: agent is target of agent temporal relation

group is target of position to group relation
type: ObjectProperty
comment: Connects the Group (in which a Position exists) to a Position To Group Relation
domain: Group
range: Position to Group Relation
sub property of: thing is target of relation
sub property of: agent is connected to agent relation
inverse of: position to group relation has target

record resource or instantiation is target of record resource holding relation
type: ObjectProperty
comment: Connects a Record Resource or Instantiation (that is held by an Agent) to a Record Resource Holding Relation.
domain: Class
  union of: Instantiation
  union of: Record Resource
range: Record Resource Holding Relation
sub property of: record resource or instantiation is target of management relation
inverse of: record resource holding relation has target

person is source of knowing of relation
type: ObjectProperty
comment: Connects a Person (who has some knowledge of another one) to a Knowing Of Relation.
domain: Person
range: Knowing Of Relation
sub property of: thing is source of relation
sub property of: agent is connected to agent relation
inverse of: knowing of relation has source

record resource holding relation has source
type: ObjectProperty
comment: Connects a Record Resource Holding Relation to an Agent (as the holder of a Record Resource or Instantiation).
domain: Record Resource Holding Relation
range: Agent
sub property of: management relation has source
inverse of: agent is source of record resource holding relation

authenticity note
type: DatatypeProperty
comment: Description of evidences that the Record Resource or Instantiation is what it purports to be, was created or sent by the said Agent, at the said time and has not been tampered or corrupted.
domain: Class
  union of: Instantiation
  union of: Record Resource
range: Literal
change note: examples added. Objective: to make RiC-O compliant with RiC-CM v0.2.
  date: 2020-11-01
example: The electronic signature validity cannot by assessed, but the content was not modified from the moment of signing.
example: The record bears no signature.
example: The record is digitally signed by the Notary.
example: The record bears signatures and it was preserved.
example: The charter is missing the seal of the King.
example: The timestamp exists but cannot be verified.
example: The whole collection consists of copies of the charters issued by Vlad the Impaler.
scope note: For electronic records, it may include results from automated means of checking the validity of signatures and timestamp.
RiC-CM corresponding component: Corresponds to RiC-A03 (Authenticity Note attribute)

is or was contained by
type: ObjectProperty
comment: Inverse of 'contains or contained' object property.
domain: Place
range: Place
sub property of: is or was part of
sub property of: is associated with place
sub property of: is place associated with
inverse of: contains or contained
change note:
  value: changed the IRI, label, inverse property IRI, text definition, corresponding CM component name (changed made in order to make RiC-O compliant with RiC-CM 0.2; the name of this property in RiC-O 0.1 was "containedBy").
  date: 2021-01-22
RiC-CM corresponding component: RiC-R007i ('is or was contained by' relation)

Functional Equivalence Relation
type: Class
comment: Connects at least two Instantiations which may be considered as equivalent.
subclass of: Instantiation to Instantiation Relation
subclass of: Restriction
  min qualified cardinality: 2
  on class: Instantiation
  on property: functional equivalence relation connects
scope note: Use for Instantiations which, from some point of view, in some context and for some users at least, may be considered as equivalent. This equivalence is usually based upon the fact that the Instantiations have at least the same intellectual content (they instantiate the same Record Resource).
RiC-CM corresponding component: Class implementation of RiC-R035 and RiC-R035i relations

agent is source of authority relation
type: ObjectProperty
comment: Connects an Agent thas has the authority, to an Authority Relation
domain: Agent
range: Authority Relation
sub property of: thing is source of relation
inverse of: authority relation has source

migrated into
type: ObjectProperty
comment: Connects an Instantiation to a version it has been migrated to.
domain: Instantiation
range: Instantiation
sub property of: has derived instantiation
inverse of: migrated from
property chain axiom: instantiation is source of migration relation
property chain axiom: migration relation has target
change note: changed the IRI, label and inverse property IRI (changed made in order to make RiC-O compliant with RiC-CM 0.2; the name of this property in RiC-O 0.1 was "isMigratedIntoInstantiation").
  date: 2021-01-22
scope note: Use for digital instantiations.
RiC-CM corresponding component: RiC-R015 ('migrated into' relation)

is or was category of some members of
type: ObjectProperty
comment: Connects a Category (Type) and a Record Set whose some present or past Record or Record Part members belong to that Category.
domain: Type
range: Record Set
sub property of: is related to
inverse of: has or had some members with category
change note:
  value: Object property added for handling the case where a Record Set is described as having all or some members that belong to some category (see RiC-CM 0.2 attributes section, #4.4 on Record Set, Record and Record Part attributes).
  date: 2020-12-28

is birth date of
type: ObjectProperty
comment: Connects a Date to a Person that was born on that Date.
domain: Date
range: Person
sub property of: is beginning date of
inverse of: has birth date
RiC-CM corresponding component: RiC-R070 ('is birth date of' relation)

classification
type: DatatypeProperty
comment: A term, number or alphanumeric string that is usually taken from an external classification vocabulary or scheme that qualifies the Record Resource.
domain: Record Resource
range: Literal
change note: Text definition and scope note updated. Examples added. Objective: to make RiC-O compliant with RiC-CM v0.2.
  date: 2020-11-01
example: human resource management
example: BUD-01-F002 [example of a classification number from a corporate file plan]
example: financial affairs
example: student registration
example: digitized items
scope note: No further statement is made here about the nature of the qualifier, nor about the relation it has with the Record Resource or with the management of the Record Resource. The value of this property may in turn be used as a criterion for identifying the qualified Record Resource as a member of a Record Set.
RiC-CM corresponding component: Corresponds to RiC-A07 (Classification attribute)

creation relation has target
type: ObjectProperty
comment: Connects a Creation Relation to one of the creator Agents
domain: Creation Relation
range: Agent
sub property of: agent origination relation has target
inverse of: agent is target of creation relation

Date
type: Class
comment: Chronological information associated with an entity that contributes to its identification and contextualization.
subclass of: Thing
change note: Scope note: made separate paragraphs.
  date: 2020-10-23
scope note: Date includes both single dates, a date range, or a set of non-contiguous single dates or date ranges. A date may be represented in natural language, based on a digital standard, or both. Digital standard dates will typically be based on ISO 8601, or Extended Date-Time Format (EDTF).
RiC-CM corresponding component: Corresponds to RiC-E18 (Date entity)

record resource or instantiation is source of provenance relation
type: ObjectProperty
comment: Connects a Record Resource or Instantiation (that is created or accumulated by an Agent, or documents an Activity) to a Provenance Relation.
domain: Class
  union of: Instantiation
  union of: Record Resource
range: Provenance Relation
sub property of: thing is source of relation
inverse of: provenance relation has source

Identifier
type: Class
comment: A word, number, letter, symbol, or any combination of these used to uniquely identify or reference an individual instance of an entity within a specific information domain.
subclass of: Appellation
subclass of: Restriction
  all values from: Identifier Type
  on property: has identifier type
RiC-CM corresponding component: Class implementation of RiC-A22 (Identifier attribute) (see also the identifier data property)

migrated from
type: ObjectProperty
comment: Inverse of 'migrated into' object property.
domain: Instantiation
range: Instantiation
sub property of: is derived from instantiation
inverse of: migrated into
property chain axiom: instantiation is target of migration relation
property chain axiom: migration relation has source
change note:
  value: changed the IRI, label, inverse property IRI, text definition, corresponding CM component name (changed made in order to make RiC-O compliant with RiC-CM 0.2; the name of this property in RiC-O 0.1 was "createdByMigrationFromInstantiation").
  date: 2021-01-22
RiC-CM corresponding component: RiC-R015i ('migrated from' relation)

has or had place name
type: ObjectProperty
comment: Connects a Place to one of its past or present names.
domain: Place
range: Place Name
sub property of: has or had name
inverse of: is or was place name of
change note: changed the IRI, label, inverse property IRI, text definition, super property IRI (the name of this property in RiC-O 0.1 was "hasPlaceName").
  date: 2021-01-22

has birth date
type: ObjectProperty
comment: Inverse of 'is birth date of' object property
domain: Person
range: Date
sub property of: has beginning date
inverse of: is birth date of
RiC-CM corresponding component: RiC-R070i ('has birth date' relation)

is accumulator of
type: ObjectProperty
comment: Inverse of 'has accumulator' object property.
domain: Agent
range: Class
  union of: Instantiation
  union of: Record Resource
sub property of: is provenance of
inverse of: has accumulator
property chain axiom: agent is target of accumulation relation
property chain axiom: accumulation relation has source
change note:
  value: changed the IRI, label, inverse property IRI, text definition and corresponding CM component (changed made in order to make RiC-O compliant with RiC-CM 0.2; the name of this property in RiC-O 0.1 was "accumulates").
  date: 2021-01-22
RiC-CM corresponding component: RiC-R028i ('is accumulator of' relation)

quantity
type: DatatypeProperty
comment: Machine-readable quantity.
domain: Extent
range: decimal
sub property of: textual value
change note: Added a scope note.
  date: 2020-11-21
change note: Datatype property created along with unitOfMeasurement, Extent and UnitOfMeasurement classes, in order to provide methods for handling extent accurately.
  date: 2020-10-28
scope note: Use if you use the Extent class and its properties for handling an accurate description of the extent of a resource..

group is source of membership relation
type: ObjectProperty
comment: Connects the Group (that has one to many members) to a Membership Relation
domain: Group
range: Membership Relation
sub property of: thing is source of relation
sub property of: agent is connected to agent relation
inverse of: membership relation has source

agent is source of agent hierarchical relation
type: ObjectProperty
comment: Connects a hierarchically superior Agent to an Agent Hierarchical Relation
domain: Agent
range: Agent Hierarchical Relation
sub property of: thing is source of relation
sub property of: agent is connected to agent relation
inverse of: agent hierarchical relation has source

is or was under authority of
type: ObjectProperty
comment: Inverse of 'has or had authority over' object property.
domain: Thing
range: Agent
sub property of: is related to
inverse of: has or had authority over
property chain axiom: thing is target of authority relation
property chain axiom: authority relation has source
change note: changed the IRI, label, inverse property IRI, text definition (changed made in order to make RiC-O compliant with RiC-CM 0.2; the name of this property in RiC-O 0.1 was "isUnderAuthorityOf").
  date: 2021-01-22
RiC-CM corresponding component: RiC-R036i ('is or was under authority of' relation)

Migration Relation
type: Class
comment: Connects an Instantiation and at least another Instantiation, when the first is migrated into the second one(s).
subclass of: Derivation Relation
subclass of: Restriction
  on class: Instantiation
  on property: migration relation has source
  qualified cardinality: 1
subclass of: Restriction
  min qualified cardinality: 1
  on class: Instantiation
  on property: migration relation has target
RiC-CM corresponding component: Class implementation of RiC-R015 and RiC-R015i relations

has or had agent name
type: ObjectProperty
comment: Connects an Agent and (one of) its present or past Agent Name.
domain: Agent
range: Agent Name
sub property of: has or had name
inverse of: is or was agent name of
change note: changed the IRI, label, inverse property IRI, textual definition (the name of this property in RiC-O 0.1 was "hasAgentName").
  date: 2021-01-22

appellation relation has source
type: ObjectProperty
comment: Connects an Appellation Relation to the concerned Appellation
domain: Appellation Relation
range: Appellation
sub property of: relation has source
inverse of: appellation is source of appellation relation

Identifier Type
type: Class
comment: Categorization of an Identifier.
subclass of: Type
subclass of: Restriction
  all values from: Identifier
  on property: is identifier type of
change note: Class added along with hasIdentifierType and isIdentifierTypeOf object properties.
  date: 2020-10-19
scope note: For example, 'old identifier' ; 'ISNI' (for a person or corporate body), etc.

correspondence relation connects
type: ObjectProperty
comment: Connects a Correspondence Relation to one of the Persons involved
domain: Correspondence Relation
range: Person
sub property of: knowing relation connects
inverse of: person has correspondence relation

is draft of
type: ObjectProperty
comment: Connects a draft to the final version of a Record.
domain: Class
  union of: Record
  union of: Record Part
range: Class
  union of: Record
  union of: Record Part
sub property of: precedes in time
sub property of: has genetic link to record resource
inverse of: has draft
RiC-CM corresponding component: RiC-R011 (is draft of relation)

documents
type: ObjectProperty
comment: Connects a Record Resource or an Instantiation to the Activity that generates the Record Resource or Instantiation.
domain: Class
  union of: Instantiation
  union of: Record Resource
range: Activity
sub property of: results or resulted from
inverse of: documented by
property chain axiom: record resource or instantiation is source of activity documentation relation
property chain axiom: activity documentation relation has target
change note:
  value: changed the IRI, label, superproperty IRI, corresponding CM component name (changed made in order to make RiC-O compliant with RiC-CM 0.2; the name of this property in RiC-O 0.1 was "isDocumentationOf").
  date: 2021-01-22
RiC-CM corresponding component: RiC-R033 ('documents' relation)

thing is target of authority relation
type: ObjectProperty
comment: Connects a Thing (that is under authority of an Agent) to an Authority Relation.
domain: Thing
range: Authority Relation
sub property of: thing is target of relation
inverse of: authority relation has target

production technique
type: DatatypeProperty
comment: Method used in the representation of information on the Instantiation.
domain: Instantiation
range: Literal
change note: Examples added. Objective: to make RiC-O compliant with RiC-CM v0.2.
  date: 2020-11-01
example: handwriting
example: engraving
example: optical recording
example: magnetic recording
scope note: Use only if you have free text or don't have a controlled vocabulary for production techniques (in this case, use the ProductionTechniqueType class)
RiC-CM corresponding component: Corresponds to RiC-A33 (Production Technique attribute)

affects or affected
type: ObjectProperty
comment: Connects an Event to a Thing on which the Event has or had some significant impact.
domain: Event
range: Thing
sub property of: has or had participant
inverse of: is or was affected by
change note:
  value: changed the IRI, label, inverse property IRI, text definition and corresponding CM component (changed made in order to make RiC-O compliant with RiC-CM 0.2; the name of this property in RiC-O 0.1 was "affects").
  date: 2021-01-22
RiC-CM corresponding component: RiC-R059 ('affects or affected' relation)

results or resulted from
type: ObjectProperty
comment: Inverse of 'results or resulted in' object property.
domain: Thing
range: Event
sub property of: is associated with event
inverse of: results or resulted in
change note: changed the IRI, label, inverse property IRI, text definition (changed made in order to make RiC-O compliant with RiC-CM 0.2; the name of this property in RiC-O 0.1 was "resultsFrom").
  date: 2021-01-22
RiC-CM corresponding component: RiC-R061i ('results or resulted from' relation)

agent is source of management relation
type: ObjectProperty
comment: Connects a manager Agent to a Management Relation
domain: Agent
range: Management Relation
sub property of: agent is source of authority relation
inverse of: management relation has source

Rule Relation
type: Class
comment: Connects at least one Rule to at least one Thing, when it is associated with existence and lifecycle of the Thing.
subclass of: Relation
subclass of: Restriction
  min qualified cardinality: 1
  on class: Thing
  on property: rule relation has target
subclass of: Restriction
  min qualified cardinality: 1
  on class: Rule
  on property: rule relation has source
RiC-CM corresponding component: Class implementation of RiC-R062 and RiC-R062i relations

has or had component
type: ObjectProperty
comment: Connects an Instantiation to one of its present or past component instantiations.
domain: Instantiation
range: Instantiation
sub property of: is instantiation associated with instantiation
sub property of: has or had part
inverse of: is or was component of
change note: changed the IRI, label, inverse property IRI, textual definition (changed made in order to make RiC-O compliant with RiC-CM 0.2; the name of this property in RiC-O 0.1 was "hasComponent").
  date: 2021-01-22
RiC-CM corresponding component: RiC-R004 ('has or had component' relation)

instantiation is target of migration relation
type: ObjectProperty
comment: Connects an Instantiation which results from a migration, to a Migration Relation.
domain: Instantiation
range: Migration Relation
sub property of: instantiation is target of derivation relation
inverse of: migration relation has target

is or was enforced by
type: ObjectProperty
comment: Connects a Rule to an Agent that enforces or enforced the Rule.
domain: Rule
range: Agent
sub property of: is rule associated with
inverse of: is or was responsible for enforcing
change note:
  value: changed the IRI, label, inverse property IRI, text definition, corresponding CM component name (changed made in order to make RiC-O compliant with RiC-CM 0.2; the name of this property in RiC-O 0.1 was "enforcedBy").
  date: 2021-01-22
RiC-CM corresponding component: RiC-R066 ('is or was enforced by' relation)

is or was expressed by
type: ObjectProperty
comment: Connects a Rule to a Record Resource that expresses or expressed the Rule.
domain: Rule
range: Record Resource
sub property of: is rule associated with
inverse of: expresses or expressed
change note:
  value: changed the IRI, label, inverse property IRI, text definition, corresponding CM component name (changed made in order to make RiC-O compliant with RiC-CM 0.2; the name of this property in RiC-O 0.1 was "expressedBy").
  date: 2021-01-22
RiC-CM corresponding component: RiC-R064 ('is or was expressed by' relation)

thing is context of relation
type: ObjectProperty
comment: Connects a Thing (that is a secondary, contextual entity during the existence of the Relation) to a n-ary Relation.
domain: Thing
range: Relation
sub property of: thing is connected to relation
inverse of: relation has context

has or had leader
type: ObjectProperty
comment: Inverse of 'is or was leader of' object property.
domain: Group
range: Person
sub property of: has or had controller
inverse of: is or was leader of
property chain axiom: group is target of leadership relation
property chain axiom: leadership relation has source
change note: changed the IRI, label, inverse property IRI, text definition, super property IRI (changed made in order to make RiC-O compliant with RiC-CM 0.2; the name of this property in RiC-O 0.1 was "ledBy").
  date: 2021-01-22
RiC-CM corresponding component: RiC-R042i ('has or had leader' relation)

has coordinates
type: ObjectProperty
comment: Connects a Physical Location to its past or present coordinates in a reference system.
domain: Physical Location
range: Coordinates
sub property of: is related to
inverse of: is or was coordinates of
change note: changed the IRI, label, inverse property IRI, textual definition (the name of this property in RiC-O 0.1 was "hasCoordinates").
  date: 2021-01-22

has or had some members with category
type: ObjectProperty
comment: Connects a Record Set and a Category (Type) to which some of the Records or Record Parts that are or were included in the Record Set belong.
domain: Record Set
range: Type
sub property of: is related to
inverse of: is or was category of some members of
change note:
  value: Object property added for handling the case where a Record Set is described as having all or some members that belong to some category (see RiC-CM 0.2 attributes section, #4.4 on Record Set, Record and Record Part attributes).
  date: 2020-12-28

Instantiation to Instantiation Relation
type: Class
comment: Connects at least two instantiations
subclass of: Relation
subclass of: Restriction
  min qualified cardinality: 2
  on class: Instantiation
  on property: instantiation to instantiation relation connects

membership relation has target
type: ObjectProperty
comment: Connects a Membership Relation to a Person who is involved as a member.
domain: Membership Relation
range: Person
sub property of: relation has target
sub property of: agent relation connects
inverse of: person is target of membership relation

agent is source of intellectual property rights relation
type: ObjectProperty
comment: Connects an Agent having the intellectual property rights, to an Intellectual Property Rights Relation
domain: Class
  union of: Group
  union of: Person
  union of: Position
range: Intellectual Property Rights Relation
sub property of: agent is source of authority relation
inverse of: intellectual property rights relation has source

is or was record state of all members of
type: ObjectProperty
comment: Connects a Record State and a Record Set whose all past or present Record or Record Part members have that Record State.
domain: Record State
range: Record Set
sub property of: is or was category of all members of
inverse of: has of had all members with record state
change note:
  value: Object property added for handling the case where a Record Set is described as having all or some members that belong to some category (see RiC-CM 0.2 attributes section, #4.4 on Record Set, Record and Record Part attributes).
  date: 2020-12-28

agent hierarchical relation has target
type: ObjectProperty
comment: Connects an Agent Hierarchical Relation to one of the hierarchically inferior Agents
domain: Agent Hierarchical Relation
range: Agent
sub property of: relation has target
sub property of: agent relation connects
inverse of: agent is target of agent hierarchical relation

child relation has target
type: ObjectProperty
comment: Connects a Child Relation to a child Person
domain: Child Relation
range: Person
sub property of: descendance relation has target
inverse of: person is target of child relation

is to use date of
type: ObjectProperty
comment: Connects a Date to an Appellation, when it is the date till which the Appellation was used.
domain: Date
range: Appellation
sub property of: is date associated with
inverse of: was used to date

person has correspondence relation
type: ObjectProperty
comment: Connects a Person to a Correspondence Relation.
domain: Person
range: Correspondence Relation
sub property of: person has knowing relation
inverse of: correspondence relation connects

is author of
type: ObjectProperty
comment: Inverse of 'has author' object property.
domain: Class
  union of: Group
  union of: Person
  union of: Position
range: Record
sub property of: is creator of
inverse of: has author
property chain axiom: agent is target of authorship relation
property chain axiom: authorship relation has source
change note: Created following the addition of RiC-R079 relation in RiC-CM 0.2
  date: 2020-12-29
RiC-CM corresponding component: RiC-R079i ('is author of' relation)

is associated with event
type: ObjectProperty
comment: Inverse of 'is event associated with' object property.
domain: Thing
range: Event
sub property of: is related to
inverse of: is event associated with
property chain axiom: thing is target of event relation
property chain axiom: event relation has source
RiC-CM corresponding component: RiC-R057i ('is associated with event' relation)

family relation connects
type: ObjectProperty
comment: Connects a Family Relation to a Person.
domain: Family Relation
range: Person
sub property of: agent relation connects
inverse of: person has family relation

occupies or occupied
type: ObjectProperty
comment: Connects a Person to a Position they occupy or occupied.
domain: Person
range: Position
sub property of: is agent associated with agent
inverse of: is or was occupied by
property chain axiom: person is source of position holding relation
property chain axiom: position holding relation has target
change note: changed the IRI, label, inverse property IRI, text definition (changed made in order to make RiC-O compliant with RiC-CM 0.2; the name of this property in RiC-O 0.1 was "occupies").
  date: 2021-01-22
RiC-CM corresponding component: RiC-R054 ('occupies or occupied' relation)

has event type
type: ObjectProperty
comment: Connects an Event to an Event Type which categorizes it.
domain: Event
range: Event Type
sub property of: has or had category
inverse of: is event type of
change note: changed the superproperty IRI.
  date: 2021-01-22

thing is target of type relation
type: ObjectProperty
comment: Connects a Thing (that is categorized by a Type) to a Type Relation.
domain: Thing
range: Type Relation
sub property of: thing is target of relation
inverse of: type relation has target

has or had place type
type: ObjectProperty
comment: Connects a Place to a Place Type that categorized or categorizes it.
domain: Place
range: Place Type
sub property of: has or had category
inverse of: is or was place type of
change note: changed the IRI, label, inverse property IRI, text definition, super property IRI (the name of this property in RiC-O 0.1 was "hasPlaceType").
  date: 2021-01-22

has or had manager
type: ObjectProperty
comment: Inverse of 'is or was manager of' object property.
domain: Class
  union of: Instantiation
  union of: Record Resource
range: Agent
sub property of: is or was under authority of
inverse of: is or was manager of
property chain axiom: record resource or instantiation is target of management relation
property chain axiom: management relation has source
change note:
  value: changed the IRI, label, inverse property IRI, text definition, super property IRI (changed made in order to make RiC-O compliant with RiC-CM 0.2; the name of this property in RiC-O 0.1 was "managedBy").
  date: 2021-01-22
RiC-CM corresponding component: RiC-R038i ('is or was managed by' relation)

performance relation has source
type: ObjectProperty
comment: Connects a Performance Relation to a performed Activity.
domain: Performance Relation
range: Activity
sub property of: relation has source
inverse of: activity is source of performance relation

Sibling Relation
type: Class
comment: Connects at least two Persons, when they are siblings.
subclass of: Family Relation
subclass of: Restriction
  min qualified cardinality: 2
  on class: Person
  on property: sibling relation connects
RiC-CM corresponding component: Class implementation of RiC-R048 and048i relations RiC-

is responsible for issuing
type: ObjectProperty
comment: Inverse of 'issued by' object property.
domain: Agent
range: Rule
sub property of: is associated with rule
inverse of: issued by
RiC-CM corresponding component: RiC-R065i ('is responsible for issuing' relation)

is record state of
type: ObjectProperty
comment: Connects a Record State to a Record or Record Part whose state it categorizes.
domain: Record State
range: Class
  union of: Record
  union of: Record Part
sub property of: is or was category of
inverse of: has record state
change note: Changed the IRI, label, textual definition and range (Record Resource removed, replaced by Record or Record Part).
  date: 2020-12-28

is associated with rule
type: ObjectProperty
comment: Inverse of 'is rule associated with' object property.
domain: Thing
range: Rule
sub property of: is related to
inverse of: is rule associated with
property chain axiom: thing is target of rule relation
property chain axiom: rule relation has source
RiC-CM corresponding component: RiC-R062i ('is associated with rule' relation)

thing is connected to relation
type: ObjectProperty
comment: Connects a Thing to a n-ary Relation.
domain: Thing
range: Relation
sub property of: is related to
inverse of: relation connects

is last update date of
type: ObjectProperty
comment: Connects a Date and a Thing that was last modified at this Date.
domain: Date
range: Thing
sub property of: is modification date of
inverse of: was last updated at date

is or was agent name of
type: ObjectProperty
comment: Connects an Agent Name to an Agent it designates or designated.
domain: Agent Name
range: Agent
sub property of: is or was name of
inverse of: has or had agent name
change note: changed the IRI, label, inverse property IRI, textual definition (the name of this property in RiC-O 0.1 was "isAgentNameOf").
  date: 2021-01-22

Child Relation
type: Class
comment: Connects at lest one Person, to at least another Person, when the first has child the second one.
subclass of: Descendance Relation
subclass of: Restriction
  min qualified cardinality: 1
  on class: Person
  on property: child relation has target
subclass of: Restriction
  min qualified cardinality: 1
  on class: Person
  on property: child relation has source
RiC-CM corresponding component: Class implementation of RiC-R018 and RiC-R018i relations

has or had some members with record state
type: ObjectProperty
comment: Connects a Record Set and a Record State that categorizes some of the Records or Record Parts that are or were included in the Record Set.
domain: Record Set
range: Record State
sub property of: has or had some members with category
inverse of: is or was record state of some members of
change note:
  value: Object property added for handling the case where a Record Set is described as having all or some members that belong to some category (see RiC-CM 0.2 attributes section, #4.4 on Record Set, Record and Record Part attributes).
  date: 2020-12-28

file
type: Record Set Type
type: Concept
type: NamedIndividual
definition: An organized unit of documents grouped together either for current use by the creator or in the process of archival arrangement, because they relate to the same subject, activity, or transaction. A file is usually the basic unit within a record series. (From ICA ISAD(G))
in scheme: Record Set Types

agent origination relation has source
type: ObjectProperty
comment: Connects an Agent Origination Relation to one of the resulting Record Resource or Instantiation
domain: Agent Origination Relation
range: Class
  union of: Instantiation
  union of: Record Resource
sub property of: provenance relation has source
inverse of: record resource or instantiation is source of agent origination relation

is identifier type of
type: ObjectProperty
comment: Connects an Identifier Type and an Identifier that it categorizes.
domain: Identifier Type
range: Identifier
sub property of: is or was category of
inverse of: has identifier type
change note: changed the superproperty IRI.
  date: 2021-01-22
change note: Object property added along with IdentifierType class and hasIdentifierType object property.
  date: 2020-10-19

unit of measurement
type: DatatypeProperty
comment: A definite magnitude of a quantity, defined and adopted by convention or by law, that is used as a standard for measurement of the same kind of quantity. Can be spacial units (cm, m), weight (g, kg), time (s, h), storage (MB, TB) or more informal units used in the archival context like number of boxes, pages or words.
domain: Extent
range: Literal
change note: Added a scope note.
  date: 2020-11-21
change note: Datatype property created along with quantity, Extent and UnitOfMeasurement classes, in order to provide methods for handling extent accurately.
  date: 2020-10-28
scope note: Use if you do not use the UnitOfMeasurement class for handling units of measurement along with Extent.

accrual status
type: DatatypeProperty
comment: Information on the status of an Accrual
domain: Record Set
range: Literal
change note: scope note : updated. Objective: to make RiC-O compliant with RiC-CM v0.2.
  date: 2020-11-01
scope note: A text statement or single words such as “Closed” to indicate that no additional Record Resource will (or is anticipated to) be added to the Record Set; “Open” to indicate that additional records or record sets will (or are expected to) be added to the Record Set; or “Unknown” to indicate that this information is not available, for example. See also accrual
RiC-CM corresponding component: corresponds to RiC-A01 (Accrual attribute)

person has family relation
type: ObjectProperty
comment: Connects a Person to a Family Relation.
domain: Person
range: Family Relation
sub property of: agent is connected to agent relation
inverse of: family relation connects

agent is target of agent temporal relation
type: ObjectProperty
comment: Connects a successor Agent to an Agent Temporal Relation
domain: Agent
range: Agent Temporal Relation
sub property of: thing is target of temporal relation
sub property of: agent is connected to agent relation
inverse of: agent temporal relation has target

is associated with date
type: ObjectProperty
comment: Inverse of 'is date associated with' object property.
domain: Thing
range: Date
sub property of: is related to
inverse of: is date associated with
RiC-CM corresponding component: RiC-R068i ('is associated with date' relation)

temporal relation has target
type: ObjectProperty
comment: Connects a Temporal Relation to a Thing that follows other Thing(s) in time.
domain: Temporal Relation
range: Thing
sub property of: sequential relation has target
inverse of: thing is target of temporal relation

person has sibling relation
type: ObjectProperty
comment: Connects a Person to a Sibling Relation.
domain: Person
range: Sibling Relation
sub property of: person has family relation
inverse of: sibling relation connects

is production technique type of
type: ObjectProperty
comment: Connects a Production Technique Type to an Instantiation whose production technique is categorized by it.
domain: Production Technique Type
range: Instantiation
sub property of: is or was category of
inverse of: has production technique type
change note: changed the super property IRI.
  date: 2021-01-22

is or was subject of
type: ObjectProperty
comment: Inverse of 'has or had subject' object property.
domain: Thing
range: Record Resource
sub property of: is related to
inverse of: has or had subject
change note: changed the IRI, label, inverse property IRI, text definition (changed made in order to make RiC-O compliant with RiC-CM 0.2; the name of this property in RiC-O 0.1 was "isSubjectOf").
  date: 2021-01-22
RiC-CM corresponding component: RIc-R019i ('is or was subject of' relation)

provenance relation has target
type: ObjectProperty
comment: Connects a Provenance Relation to an Agent or Activity.
domain: Provenance Relation
range: Class
  union of: Activity
  union of: Agent
sub property of: relation has target
inverse of: agent or activity is target of provenance relation

Work Relation
type: Class
comment: Connects at least two Agents that have some type of work relation in the course of their activities.
subclass of: Agent Relation
subclass of: Restriction
  min qualified cardinality: 2
  on class: Agent
  on property: work relation connects
RiC-CM corresponding component: Class implementation of RiC-R046 and RiR046i relations-

is or was appellation of
type: ObjectProperty
comment: Connects an Appellation to a Thing that it designates or designated.
domain: Appellation
range: Thing
sub property of: is related to
inverse of: has or had appellation
change note: changed the IRI, label, inverse property IRI, text definition (the name of this property in RiC-O 0.1 was "isAppellationOf").
  date: 2021-01-22

person is source of descendance relation
type: ObjectProperty
comment: Connects a Person (as an ancestor) to a Descendance Relation.
domain: Person
range: Descendance Relation
sub property of: person has family relation
sub property of: agent is source of agent temporal relation
inverse of: descendance relation has source

Knowing Relation
type: Class
comment: Connects at least two Persons that directly know each other during their existence. This relation is symmetric.
subclass of: Agent Relation
subclass of: Restriction
  min qualified cardinality: 2
  on class: Person
  on property: knowing relation connects
RiC-CM corresponding component: Cass implementation of RiC-R051 and RiC—R051i relations

Knowing Of Relation
type: Class
comment: Connects at least one Person to at least another one, when the first one has some knowledge of the second one through time or space.
subclass of: Agent Relation
subclass of: Restriction
  min qualified cardinality: 1
  on class: Person
  on property: knowing of relation has target
subclass of: Restriction
  min qualified cardinality: 1
  on class: Person
  on property: knowing of relation has source
RiC-CM corresponding component: Class implementation of RiC-R050 and RiC-R050i relationsi

agent is source of record resource holding relation
type: ObjectProperty
comment: Connects an Agent that holds a Record Resource or Instantiation, to a Record Resource Holding Relation
domain: Agent
range: Record Resource Holding Relation
sub property of: agent is source of management relation
inverse of: record resource holding relation has source

thing is target of temporal relation
type: ObjectProperty
comment: Connects a Thing (that follows other Thing(s) in time) to a Temporal Relation.
domain: Thing
range: Temporal Relation
sub property of: thing is target of sequential relation
inverse of: temporal relation has target

physical or logical extent
type: DatatypeProperty
comment: Countable characteristics of the content of an entity expressed as a quantity.
domain: Class
  union of: Instantiation
  union of: Record Resource
range: Literal
scope note: Provided for usability reasons. Use only if you cannot use the subproperties (particularly if the same free text is being used in your current metadata for describing the record resource, carrier and instantiation extent).

has or had title
type: ObjectProperty
comment: Connects a Record Resource, Instantiation or Rule to a title that is or was used for designating it.
domain: Class
  union of: Instantiation
  union of: Record Resource
  union of: Rule
range: Title
sub property of: has or had name
inverse of: is or was title of
change note: changed the IRI, label, inverse property IRI, text definition, super property IRI (the name of this property in RiC-O 0.1 was "hasTitle").
  date: 2021-01-22

authorized by
type: ObjectProperty
comment: Inverse of 'authorizes' object property
domain: Agent
range: Mandate
sub property of: is associated with rule
inverse of: authorizes
property chain axiom: agent is target of mandate relation
property chain axiom: mandate relation has source
RiC-CM corresponding component: RiC-R067i ('authorizedBy' relation)

knows
type: ObjectProperty
type: SymmetricProperty
comment: Connects two Persons that directly know each other during their existence. This object property is symmetric.
domain: Person
range: Person
sub property of: is agent associated with agent
property chain axiom: person has knowing relation
property chain axiom: knowing relation connects
RiC-CM corresponding component: RiC-R051 ('knows' relation)

quality of representation
type: DatatypeProperty
comment: Conditions of an Instantiation that impact the legibility or completeness of Record Resource, and thus the viability of its use. Conditions may be associated with deficiencies in the processes of Record (re)creation or capture, or the deterioration of the Instantiation (e.g. its carrier) causing loss of information of the record over time
domain: Instantiation
range: Literal
change note: Text definition updated. Examples added. Objective: to make RiC-O compliant with RiC-CM v0.2.
  date: 2020-11-01
example: some loss of text due to rodent damage
example: Black and white digitization may have led to loss of some information.
example: some loss of information due to poor quality of image capture
RiC-CM corresponding component: Corresponds to RiC-A34 (Quality of Representation attribute)

has of had all members with language
type: ObjectProperty
comment: Connects a Record Set and a Language used by all the Records or Record Parts that are or were included in the Record Set.
domain: Record Set
range: Language
sub property of: is related to
inverse of: is or was language of all members of
change note:
  value: Object property added for handling the case where a Record Set is described as having all or some members that belong to some category (see RiC-CM 0.2 attributes section, #4.4 on Record Set, Record and Record Part attributes).
  date: 2020-12-28

Teaching Relation
type: Class
comment: Connects at least one Person to at least another Person, who is their student.
subclass of: Knowing Relation
subclass of: Restriction
  min qualified cardinality: 1
  on class: Person
  on property: teaching relation has target
subclass of: Restriction
  min qualified cardinality: 1
  on class: Person
  on property: teaching relation has source
RiC-CM corresponding component: Class implementation of RiC-R053 and RiC-R053i relation

activity documentation relation has source
type: ObjectProperty
comment: Connects an Activity Documentation Relation to one of the resulting Record Resources or Instantiations
domain: Activity Documentation Relation
range: Class
  union of: Instantiation
  union of: Record Resource
sub property of: provenance relation has source
inverse of: record resource or instantiation is source of activity documentation relation

record resource to instantiation relation has source
type: ObjectProperty
comment: Connects a Record Resource To Instantiation Relation to the Record Resource (that was instantiated).
domain: Record Resource to Instantiation Relation
range: Record Resource
sub property of: relation has source
inverse of: record resource is source of record resource to instantiation relation

Event Type
type: Class
comment: Categorization of an Event.
subclass of: Type
subclass of: Restriction
  all values from: Event
  on property: is event type of
change note: Scope note: updated and made several paragraphs. Objective: to make RiC-O compliant with RiC-CM v0.2.
  date: 2020-10-23
scope note: Events of all kinds can be categorized. Curation event types include creation; acquisition; transfer; arrangement; description; digitization, etc. Biographical event types include birth, marriage, death, etc.
RiC-CM corresponding component: Corresponds to RiC-A18 (Event Type attribute)

is child of
type: ObjectProperty
comment: Inverse of 'has child' object property.
domain: Person
range: Person
sub property of: has ancestor
inverse of: has child
change note: changed the IRI and label (changed made in order to make RiC-O compliant with RiC-CM 0.2; the name of this property in RiC-O 0.1 was "hasParent").
  date: 2021-01-22
RiC-CM corresponding component: RiC-R018i ('is child of' relation)

migration relation has source
type: ObjectProperty
comment: Connects a Migration Relation to the migrated Instantiation.
domain: Migration Relation
range: Instantiation
sub property of: derivation relation has source
inverse of: instantiation is source of migration relation

intellectual property rights relation has source
type: ObjectProperty
comment: Connects an IntellectualPropertyRightsRelation to one of the Group, Person or Position that holds the rights.
domain: Intellectual Property Rights Relation
range: Class
  union of: Group
  union of: Person
  union of: Position
sub property of: authority relation has source
inverse of: agent is source of intellectual property rights relation

leadership with position
type: ObjectProperty
comment: Connects a Leadership Relation to the Position occupied by the leading Person.
domain: Leadership Relation
range: Position
sub property of: relation has context
inverse of: position is context of leadership relation

is modification date of
type: ObjectProperty
comment: Connects a Date to a Thing that was modified on that Date.
domain: Date
range: Thing
sub property of: is date associated with
inverse of: has modification date
RiC-CM corresponding component: RiC-R073 ('is modification date of' relation)

has record state
type: ObjectProperty
comment: Connects a Record or Record Part to a Record State that categorizes its state.
domain: Class
  union of: Record
  union of: Record Part
range: Record State
sub property of: has or had category
inverse of: is record state of
change note: Changed the IRI (hasRecordResourceState changed to hasRecordState), label, textual definition and domain (RecordResource replaced by Record or Record Part).
  date: 2020-12-28

whole part relation has source
type: ObjectProperty
comment: Connects a Whole Part Relation to the Thing that has some parts.
domain: Whole Part Relation
range: Thing
sub property of: relation has source
inverse of: thing is source of whole part relation

thing is target of rule relation
type: ObjectProperty
comment: Connects a Thing (that is associated with a Rule) to a Rule Relation.
domain: Thing
range: Rule Relation
sub property of: thing is target of relation
inverse of: rule relation has target

authorizing mandate
type: DatatypeProperty
comment: Information on a Mandate that authorizes an Agent to perform an Activity.
domain: Agent
range: Literal
sub property of: rule followed
scope note: Provided for usability reasons. May be deprecated and removed later on. Use only if you don't use the Mandate class for handling mandates.

geographical coordinates
type: DatatypeProperty
comment: Longitudinal and latitudinal information of a Place.
domain: Place
range: Literal
change note: Text definition and scope note updated. Examples added. Objective: to make RiC-O compliant with RiC-CM v0.2.
  date: 2020-11-01
example: Latitude 35.89421911, Longitude 139.94637467
example: Latitude 50°40′46,461″N, Longitude 95°48′26,533″W, Height 123,45m
scope note: Provided for usability reasons. May be deprecated and removed later on. Use only if you don't use PhysicalLocation and Coordinates classes with Place. Coordinates may be based on ISO 6709 Standard representation of geographic point location by coordinates.
RiC-CM corresponding component: Corresponds to RiC-A11 (Coordinates attribute)

record resource holding relation has target
type: ObjectProperty
comment: Connects a Record Resource Holding Relation to a Record Resource or Instantiation (that is held by an Agent).
domain: Record Resource Holding Relation
range: Class
  union of: Instantiation
  union of: Record Resource
sub property of: management relation has target
inverse of: record resource or instantiation is target of record resource holding relation

Activity Type
type: Class
comment: Categorization of an Activity.
subclass of: Type
subclass of: Restriction
  all values from: Activity
  on property: is activity type of
change note: Scope note: updated (different from RiC-CM scope note). Objective: to make RiC-O compliant with RiC-CM v0.2.
  date: 2020-10-23
scope note: Can be extended with any number of subclasses, e.g. “function/action” and “activity domain”. This allows for a faceted approach that enables an Activity to be categorized using a combination of components, general or more specific. For example, “monitoring” can be used in combination with “election polls” or “water resources”.
RiC-CM corresponding component: Corresponds to RiC-A02 (Activity Type attribute)

title
type: DatatypeProperty
comment: An identifying name of a Record Resource, Instantiation or Rule.
domain: Class
  union of: Instantiation
  union of: Record Resource
  union of: Rule
range: Literal
sub property of: name
scope note: Use only if you don't use Title class for handling titles.
RiC-CM corresponding component: Specialization of RiC-A28 (Name attribute)

has or had spouse
type: SymmetricProperty
type: ObjectProperty
comment: Connects two Persons that are or were married. This relation is symmetric.
domain: Person
range: Person
sub property of: has family association with
property chain axiom: person has spouse relation
property chain axiom: spouse relation connects
change note:
  value: changed the IRI, label, inverse property IRI, text definition, super property IRI (changed made in order to make RiC-O compliant with RiC-CM 0.2; the name of this property in RiC-O 0.1 was "hasSpouse").
  date: 2021-01-22
RiC-CM corresponding component: RiC-R049 ('has or had spouse' relation)

is or was documentary form type of all members of
type: ObjectProperty
comment: Connects a Documentary Form Type and a Record Set whose all past or present Record or Record Part members have that Documentary Form Type.
domain: Documentary Form Type
range: Record Set
sub property of: is or was category of all members of
inverse of: has of had all members with documentary form type
change note:
  value: Object property added for handling the case where a Record Set is described as having all or some members that belong to some category (see RiC-CM 0.2 attributes section, #4.4 on Record Set, Record and Record Part attributes).
  date: 2020-12-28

group subdivision relation has target
type: ObjectProperty
comment: Connects a Group Subdivision Relation to one of the Groups that is a subdivision
domain: Group Subdivision Relation
range: Group
sub property of: whole part relation has target
sub property of: agent hierarchical relation has target
inverse of: group is target of group subdivision relation

has or had rule type
type: ObjectProperty
comment: Connects a Rule to a Rule Type that categorized or categorizes it.
domain: Rule
range: Rule Type
sub property of: has or had category
inverse of: is or was rule type of
change note: Object property added along with RuleType class and isRuleTypeOf object property.
  date: 2020-10-19
change note: changed the IRI, label, inverse property IRI, text definition, super property IRI (the name of this property in RiC-O 0.1 was "hasRuleType").
  date: 2021-01-22

thing is target of event relation
type: ObjectProperty
comment: Connects a Thing (that is associated with an Event) to an Event Relation.
domain: Thing
range: Event Relation
sub property of: thing is target of relation
inverse of: event relation has target

collection
type: Record Set Type
type: Concept
type: NamedIndividual
definition: An artificial assemblage of documents accumulated on the basis of some common characteristic without regard to the provenance of those documents. Not to be confused with an archival fonds. (From ICA ISAD(G))
in scheme: Record Set Types

is sender of
type: ObjectProperty
comment: Inverse of 'has sender' object property.
domain: Agent
range: Class
  union of: Instantiation
  union of: Record Resource
sub property of: is provenance of
inverse of: has sender
RiC-CM corresponding component: RiC-R031i ('is sender of' relation)

performs or performed
type: ObjectProperty
comment: Inverse of 'is or was performed by' object property.
domain: Agent
range: Activity
sub property of: is or was participant in
inverse of: is or was performed by
property chain axiom: agent is target of performance relation
property chain axiom: performance relation has source
change note:
  value: changed the IRI, label, inverse property IRI, text definition, super property IRI (changed made in order to make RiC-O compliant with RiC-CM 0.2; the name of this property in RiC-O 0.1 was "performs").
  date: 2021-01-22
RiC-CM corresponding component: RiC-R060i ('performs or performed' relation)

has modification date
type: ObjectProperty
comment: Inverse of 'is modification date of' object property.
domain: Thing
range: Date
sub property of: is associated with date
inverse of: is modification date of
RiC-CM corresponding component: RiC-R073i ('has modification date' relation)

instantiation to instantiation relation connects
type: ObjectProperty
comment: Connects an Instantiation to Instantiation Relation to one of the related Instantiations.
domain: Instantiation to Instantiation Relation
range: Instantiation
sub property of: relation connects
inverse of: instantiation is connected to instantiation relation

has or had some members with content type
type: ObjectProperty
comment: Connects a Record Set and a Content Type that categorizes some of the Records or Record Parts that are or were included in the Record Set.
domain: Record Set
range: Content Type
sub property of: has or had some members with category
inverse of: is or was content type of some members of
change note:
  value: Object property added for handling the case where a Record Set is described as having all or some members that belong to some category (see RiC-CM 0.2 attributes section, #4.4 on Record Set, Record and Record Part attributes).
  date: 2020-12-28

spouse relation connects
type: ObjectProperty
comment: Connects a Sibling Relation to one of the spouses involved.
domain: Spouse Relation
range: Person
sub property of: family relation connects
inverse of: person has spouse relation

thing is target of relation
type: ObjectProperty
comment: Connects a Thing to a n-ary Relation.
domain: Thing
range: Relation
sub property of: thing is connected to relation
inverse of: relation has target

thing is source of temporal relation
type: ObjectProperty
comment: Connects a Thing to a Temporal Relation, when this Thing precedes other Thing(s) in time.
domain: Thing
range: Temporal Relation
sub property of: thing is source of sequential relation
inverse of: temporal relation has source

person is source of leadership relation
type: ObjectProperty
comment: Connects a Person (as a leader) to a Leadership Relation.
domain: Person
range: Leadership Relation
sub property of: agent is source of agent control relation
inverse of: leadership relation has source

is activity type of
type: ObjectProperty
comment: Connects an Activity Type to an Activity that it categorizes.
domain: Activity Type
range: Activity
sub property of: is or was category of
inverse of: has activity type
change note: changed the super property IRI.
  date: 2021-01-22

position holding relation has source
type: ObjectProperty
comment: Connects a Position Holding Relation to a Person (who occupies a Position).
domain: Position Holding Relation
range: Person
sub property of: relation has source
sub property of: agent relation connects
inverse of: person is source of position holding relation

has genetic link to record resource
type: SymmetricProperty
type: ObjectProperty
comment: Connects two Record Resources when there is a genetic link between them. Genetic in this sense is as defined by diplomatics, i.e. the process by which a Record Resource is developed. This relation is symmetric.
domain: Record Resource
range: Record Resource
sub property of: is record resource associated with record resource
scope note: Use to connect two Record Resources only if it is not possible to be more accurate and specify a narrower, asymmetric relation, e.g. ‘is original of’.
RiC-CM corresponding component: RiC-R023 ('has genetic link to record resource' relation)

Instantiation extent
type: DatatypeProperty
comment: Countable characteristics of the Instantiation expressed as a quantity.
domain: Instantiation
range: Literal
sub property of: physical or logical extent
change note: Scope note updated. Examples added. Objective: to make RiC-O compliant with RiC-CM v0.2.
  date: 2020-11-01
example: Size of PDF-file: 1.5 MB
example: The book register has 345 written leaves.
scope note: For a given Record Resource, the Instantiation Extent may vary, based on format, density of information on the carrier, etc. For example, a file of 1500 words (Record Resource Extent) may have Instantiation Extent 3kb as a Word document and 5kb as a PDF file, and instantiations may be represented on a CD of 700mb (Carrier Extent). Use if you don't use InstantiationExtent class and its properties for handling such information.
RiC-CM corresponding component: Corresponds to RiC-A23 (Instantiation Extent attribute)

Physical Location
type: Class
comment: A delimitation of the physical territory of a Place.
subclass of: Thing
subclass of: Restriction
  all values from: Place
  on property: is or was physical location of
subclass of: Restriction
  all values from: Coordinates
  on property: has coordinates
scope note: Usually associated to one to many Places, and known during some time. A location may be linked to one to many Coordinates.
RiC-CM corresponding component: Class implementation of RiC-A27 (Location attribute)

contains or contained
type: ObjectProperty
comment: Connects a Place to a region that is or was within it.
domain: Place
range: Place
sub property of: is place associated with
sub property of: is associated with place
sub property of: has or had part
inverse of: is or was contained by
change note:
  value: changed the IRI, label, inverse property IRI, text definition, corresponding CM component name ; added a scope note (changed made in order to make RiC-O compliant with RiC-CM 0.2; the name of this property in RiC-O 0.1 was "contains").
  date: 2021-01-22
scope note: Use for connecting two geographical or administrative regions.
RiC-CM corresponding component: RiC-R007 ('contains or contained' relation)

is instantiation of
type: ObjectProperty
comment: Inverse of 'has instantiation' object property.
domain: Instantiation
range: Record Resource
sub property of: is related to
inverse of: has instantiation
property chain axiom: instantiation is target of record resource to instantiation relation
property chain axiom: record resource to instantiation relation has source
change note: changed the IRI and label (changed made in order to make RiC-O compliant with RiC-CM 0.2; the name of this property in RiC-O 0.1 was "instantiates").
  date: 2021-01-22
RiC-CM corresponding component: RiC-R025i ('is instantiation of' relation)

expresses or expressed
type: ObjectProperty
comment: Inverse of 'is or was expressed by' object property.
domain: Record Resource
range: Rule
sub property of: is associated with rule
inverse of: is or was expressed by
change note:
  value: changed the IRI, label, inverse property IRI, text definition, corresponding CM component name (changed made in order to make RiC-O compliant with RiC-CM 0.2; the name of this property in RiC-O 0.1 was "expresses").
  date: 2021-01-22
RiC-CM corresponding component: RiC-R064i ('expresses or expressed' relation)

is from use date of
type: ObjectProperty
comment: Connects a Date to an Appellation, when it is the date at which the Appellation was first used.
domain: Date
range: Appellation
sub property of: is date associated with
inverse of: was used from date

follows in time
type: ObjectProperty
comment: Inverse of 'precedes in time' object property.
domain: Thing
range: Thing
sub property of: follows or followed
inverse of: precedes in time
property chain axiom: thing is target of temporal relation
property chain axiom: temporal relation has source
change note: changed the superproperty IRI.
  date: 2021-01-22
RiC-CM corresponding component: RiC-R009i ('follows in time' relation)

knowing of relation has target
type: ObjectProperty
comment: Connects a Knowing Of Relation to a 'known by' Person (a Person on which another one has some has some knowledge.)
domain: Knowing Of Relation
range: Person
sub property of: relation has target
sub property of: agent relation connects
inverse of: person is target of knowing of relation

Record Set Types
type: ConceptScheme
type: NamedIndividual
creator: International Coucil on Archives Expert Group on Archival Description (ICA EGAD)
title: International Council on Archives Records in Contexts Vocabulary for Record Set Types
definition: A vocabulary on Record Set types

mandate relation has source
type: ObjectProperty
comment: Connects a Mandate Relation to a Mandate.
domain: Mandate Relation
range: Mandate
sub property of: rule relation has source
inverse of: mandate is source of mandate relation

has provenance
type: ObjectProperty
comment: Connects a Record Resource or an Instantiation to an Agent that creates or accumulates the Record Resource, receives it, or sends it.
domain: Class
  union of: Instantiation
  union of: Record Resource
range: Agent
sub property of: is related to
inverse of: is provenance of
property chain axiom: record resource or instantiation is source of agent origination relation
property chain axiom: agent origination relation has target
RiC-CM corresponding component: RiC-R026 ('has provenance' relation)

person is target of membership relation
type: ObjectProperty
comment: Connects a Person (as a member of a Group) to a Membership Relation.
domain: Person
range: Membership Relation
sub property of: thing is target of relation
sub property of: agent is connected to agent relation
inverse of: membership relation has target

has or had some members with language
type: ObjectProperty
comment: Connects a Record Set and a Language used by some of the Records or Record Parts that are or were included in the Record Set.
domain: Record Set
range: Language
sub property of: is related to
inverse of: is or was language of some members of
change note:
  value: Object property added for handling the case where a Record Set is described as having all or some members that belong to some category (see RiC-CM 0.2 attributes section, #4.4 on Record Set, Record and Record Part attributes).
  date: 2020-12-28

is instantiation associated with instantiation
type: ObjectProperty
type: SymmetricProperty
comment: Connects two Instantiations. This object property is symmetric.
domain: Instantiation
range: Instantiation
sub property of: is related to
property chain axiom: instantiation is connected to instantiation relation
property chain axiom: instantiation to instantiation relation connects
RiC-CM corresponding component: RiC-R034 ('is instantiation associated with instantiation' relation)

instantiation is source of migration relation
type: ObjectProperty
comment: Connects an Instantiation (from which at least one Instantiation is migrated) to a Migration Relation.
domain: Instantiation
range: Migration Relation
sub property of: instantiation is source of derivation relation
inverse of: migration relation has source

altitude
type: DatatypeProperty
comment: The height of a Place above a reference level, especially above sea level.
domain: Coordinates
range: Literal
sub property of: measure
scope note: Property of the Coordinates class. If you don't use this class, use geographicalCoordinates property, a property of Place class.

Carrier Extent
type: Class
comment: The extent of a Record Resource carrier
subclass of: Extent
change note: Class added in order to handle an accurate description of a carrier extent
  date: 2020-10-28
change note: Changed a bit the definition and added change notes.
  date: 2020-11-21
scope note: Countable characteristics of a record resource carrier expressed as a quantity.
RiC-CM corresponding component: Class implementation of RiC-A04 (Carrier Extent) attribute

latitude
type: DatatypeProperty
comment: Distance in degrees north or south of the equator.
domain: Coordinates
range: Literal
sub property of: measure
scope note: Property of the Coordinates class. If you don't use this class, use geographicalCoordinates property, a property of Place class.

Role Type
type: Class
comment: The role an agent plays in some context (usually in some creation relation). Not to be confused with a position (position of an agent in some group). For example, a person who is the head of some corporate body may play the role of annotator (of a record) in a creation relation.
subclass of: Type

Activity Documentation Relation
type: Class
comment: Connects at least one Record Resource or Instantiation to at least one Activity, when the Record Resource or Instantiation results from the activity.
subclass of: Provenance Relation
subclass of: Restriction
  min qualified cardinality: 1
  on class: Activity
  on property: activity documentation relation has target
subclass of: Restriction
  min qualified cardinality: 1
  on class: Class
    union of: Instantiation
    union of: Record Resource
  on property: activity documentation relation has source
RiC-CM corresponding component: Class implementation of RiC-R033 and RiC-R033 relations

record resource relation connects
type: ObjectProperty
comment: Connects a Record Resource relation to one of the related Record Resources.
domain: Record Resource to Record Resource Relation
range: Record Resource
sub property of: relation connects
inverse of: record resource is connected to record resource relation

has or had student
type: ObjectProperty
comment: Inverse of 'has or had teacher' object property.
domain: Person
range: Person
sub property of: knows
inverse of: has or had teacher
property chain axiom: person is source of teaching relation
property chain axiom: teaching relation has target
change note: changed the IRI, label, inverse property IRI, text definition (changed made in order to make RiC-O compliant with RiC-CM 0.2; the name of this property in RiC-O 0.1 was "hasStudent").
  date: 2021-01-22
RiC-CM corresponding component: RiC-R053i ('has or had student' relation)

performance relation has target
type: ObjectProperty
comment: Connects a Performance Relation to a performing Agent.
domain: Performance Relation
range: Agent
sub property of: relation has target
inverse of: agent is target of performance relation

was used to date
type: ObjectProperty
comment: Connects an Appellation to the Date till when it was used.
domain: Appellation
range: Date
sub property of: is associated with date
inverse of: is to use date of

known by
type: ObjectProperty
comment: Inverse of 'knows of' object property.
domain: Person
range: Person
sub property of: is agent associated with agent
inverse of: knows of
property chain axiom: person is target of knowing of relation
property chain axiom: knowing of relation has source
RiC-CM corresponding component: RiC-R050i ('known by' relation)

position is target of position holding relation
type: ObjectProperty
comment: Connects a Position (that is occupied by a Person) to a Position Holding Relation.
domain: Position
range: Position Holding Relation
sub property of: thing is target of relation
sub property of: agent is connected to agent relation
inverse of: position holding relation has target

has or had demographic group
type: ObjectProperty
comment: Connects a Person or a Group to a Demographic Group to which it belongs or belonged.
domain: Class
  union of: Group
  union of: Person
range: Demographic Group
sub property of: has or had category
inverse of: is or was demographic group of
change note: changed the IRI, label, inverse property IRI, text definition, domain (the name of this property in RiC-O 0.1 was "belongsToDemographicGroup").
  date: 2021-01-22

Spouse Relation
type: Class
comment: Connects at least two Persons, when they are spouses.
subclass of: Family Relation
subclass of: Restriction
  min qualified cardinality: 2
  on class: Person
  on property: spouse relation connects
RiC-CM corresponding component: Class implementation of RiC-R049 and RiC-R049i relations

source
type: DatatypeProperty
comment: Information about a source used to identify or describe an entity.
domain: Class
  union of: Record Resource
  union of: Relation
range: Literal
scope note: Can be used, in particular, for Records having documentary form type Finding Aid or Authority Record, or for Relations. Use only if you don't use the hasSource object property.

has or had work relation with
type: SymmetricProperty
type: ObjectProperty
comment: Connects two Agents that have or had some type of work relation in the course of their activities. This relation is symmetric.
domain: Agent
range: Agent
sub property of: is agent associated with agent
change note: changed the IRI, label, text definition (changed made in order to make RiC-O compliant with RiC-CM 0.2; the name of this property in RiC-O 0.1 was "hasWorkRelationWith").
  date: 2021-01-22
RiC-CM corresponding component: RiC-R046 ('has or had work relation with' relation)

has or had part
type: ObjectProperty
comment: Connects a Thing to a constitutive or component part of that Thing.
domain: Thing
range: Thing
sub property of: is related to
inverse of: is or was part of
property chain axiom: thing is source of whole part relation
property chain axiom: whole part relation has target
change note: changed the IRI, label, inverse property IRI, textual definition (changed made in order to make RiC-O compliant with RiC-CM 0.2; the name of this property in RiC-O 0.1 was "hasPart").
  date: 2021-01-22
scope note: The end of existence of a whole/part relation may affect the integrity or nature of the domain entity
RiC-CM corresponding component: RiC-R002 (has or had part relation)

has author
type: ObjectProperty
comment: Connects a Record to the Group, Person or Position that is responsible for conceiving and formulating the information contained in the Record.
domain: Record
range: Class
  union of: Group
  union of: Person
  union of: Position
sub property of: has creator
inverse of: is author of
property chain axiom: record is source of authorship relation
property chain axiom: authorship relation has target
change note: Created following the addition of RiC-R079 relation in RiC-CM 0.2
  date: 2020-12-29
scope note: To be used for any contribution to the content of a Record. Includes (of course) the Person, Group or Position in whose name or by whose command the content may have been formulated and first instantiated (e.g. the person who signed it).
RiC-CM corresponding component: RiC-R079 ('has author' relation)

Instantiation Extent
type: Class
comment: The extent of an Instantiation.
subclass of: Extent
change note: Class added in order to handle an accurate description of an instantiation extent
  date: 2020-10-28
change note: Changed a bit the definition and added change notes.
  date: 2020-11-21
scope note: Countable characteristics of an Instantiation expressed as a quantity.
RiC-CM corresponding component: Class implementation of RiC-A23 (Instantiation Extent attribute)

record resource is connected to record resource genetic relation
type: ObjectProperty
comment: Connects a Record Resource to a Record Resource Genetic Relation.
domain: Record Resource
range: Record Resource Genetic Relation
sub property of: record resource is connected to record resource relation
inverse of: record resource genetic relation connects

conditions of use
type: DatatypeProperty
comment: Terms and circumstances affecting the use of a Record Resource after access has been provided. Includes conditions governing reproduction of the Record Resource under applicable copyright (intellectual property) and/or property legislation, and of the Instantiation, due to conservation status.
domain: Class
  union of: Instantiation
  union of: Record Resource
range: Literal
change note: Text definition updated. Examples added. Objective: to make RiC-O compliant with RiC-CM v0.2.
  date: 2020-11-01
example: Freely usable without restrictions
example: The permission of the owner of the Record must be obtained before use.
example: The record cannot be copied using warm light copying machines or photographed using flashlight.
RiC-CM corresponding component: Corresponds to RiC-A09 (Conditions of Use attribute)

descendance relation has source
type: ObjectProperty
comment: Connects a Descendance Relation to one of the ancestor Persons
domain: Descendance Relation
range: Person
sub property of: family relation connects
sub property of: agent temporal relation has source
inverse of: person is source of descendance relation

relation connects
type: ObjectProperty
comment: Connects an n-ary Relation to any of the Things involved.
domain: Relation
range: Thing
sub property of: is related to
inverse of: thing is connected to relation

thing is source of relation
type: ObjectProperty
comment: Connects a Thing (that is the source of a Relation) to a Relation.
domain: Thing
range: Relation
sub property of: thing is connected to relation
inverse of: relation has source

position is source of position to group relation
type: ObjectProperty
comment: Connects a Position (that exists within a Group) to a Position to Group Relation.
domain: Position
range: Position to Group Relation
sub property of: thing is source of relation
sub property of: agent is connected to agent relation
inverse of: position to group relation has source

has reply
type: ObjectProperty
comment: Connects a Record Resource to a reply, usually in the form of correspondence.
domain: Record Resource
range: Record Resource
sub property of: precedes in time
sub property of: is record resource associated with record resource
inverse of: is reply to
change note: changed the IRI, label, inverse property IRI, text definition (changed made in order to make RiC-O compliant with RiC-CM 0.2; the name of this property in RiC-O 0.1 was "isRepliedToBy").
  date: 2021-01-22
RiC-CM corresponding component: RiC-R013 ('has reply' relation)

has of had all members with documentary form type
type: ObjectProperty
comment: Connects a Record Set and a Documentary Form Type that categorizes all the Records or Record Parts that are or were included in the Record Set.
domain: Record Set
range: Documentary Form Type
sub property of: has or had all members with category
inverse of: is or was documentary form type of all members of
change note:
  value: Object property added for handling the case where a Record Set is described as having all or some members that belong to some category (see RiC-CM 0.2 attributes section, #4.4 on Record Set, Record and Record Part attributes).
  date: 2020-12-28

Record Resource to Record Resource Relation
type: Class
comment: Connects at least two Record Resources.
subclass of: Relation
subclass of: Restriction
  min qualified cardinality: 2
  on class: Record Resource
  on property: record resource relation connects
RiC-CM corresponding component: Class implementation of RiC-R022 and RiC-022i relations

Record Resource to Instantiation Relation
type: Class
comment: Connects a Record Resource to one or more Instantiations that instantiate it.
subclass of: Relation
subclass of: Restriction
  on class: Record Resource
  on property: record resource to instantiation relation has source
  qualified cardinality: 1
subclass of: Restriction
  min qualified cardinality: 1
  on class: Instantiation
  on property: record resource to instantiation relation has target
RiC-CM corresponding component: Class implementation of RiC-R025 and RiC-R025i relations

is representation type of
type: ObjectProperty
comment: Connects a Representation Type to an Instantiation that it categorizes.
domain: Representation Type
range: Instantiation
sub property of: is or was category of
inverse of: has representation type
change note: changed the super property IRI.
  date: 2021-01-22

normalized value
type: DatatypeProperty
comment: Value representation based on a standard, preferably machine-readable.
domain: Class
  union of: Appellation
  union of: Date
range: Literal
sub property of: textual value

end date
type: DatatypeProperty
comment: Date at which something ended.
domain: Thing
range: Literal
sub property of: date
scope note: Provided for usability reasons. May be deprecated and removed later on. Use only if you don't use Date classes for handling dates.
RiC-CM corresponding component: Data property specialized implementation of RiC-E18 (Date entity)

name
type: DatatypeProperty
comment: A label, title or term designating the entity in order to make it distinguishable from other similar entities. For Record Resource or Instantiation, the Name is generally assigned by an Agent as most do not have a Name given when created.
domain: Thing
range: Literal
change note: Text definition updated. Examples added. Objective: to make RiC-O compliant with RiC-CM v0.2.
  date: 2020-11-01
example: hearing services
example: 4 March 1842
example: Digital copy of the Pomarius archival inventory from 1575
example: fundraising, University of Glasgow
example: Papers of the Earls of Liverpool
example: The Letter of Neacsu from Campulung to the Mayor of Brasov
example: Sketch Map of the Qatar Peninsula
example: Nelson Mandela
scope note: Use only if you don't use Name class for handling names.
RiC-CM corresponding component: Corrresponds to RiC-A28 (Name attribute)

is functionally equivalent to
type: ObjectProperty
type: SymmetricProperty
comment: Connects two Instantiations which may be considered as equivalent. This relation is symmetric.
domain: Instantiation
range: Instantiation
sub property of: is instantiation associated with instantiation
sub property of: is equivalent to
property chain axiom: instantiation is connected to functional equivalence relation
property chain axiom: functional equivalence relation connects
change note: changed the scope note.
  date: 2021-01-22
scope note: Two Instantiations, from some point of view, may be considered as equivalent. This equivalence is usually based upon the fact that the Instantiations have at least the same intellectual content (they instantiate the same Record Resource).
RiC-CM corresponding component: RiC-R035 ('is functionally equivalent to' relation)

record resource to instantiation relation has target
type: ObjectProperty
comment: Connects a Record Resource To Instantiation Relation to an Instantiation of the involved Record Resource.
domain: Record Resource to Instantiation Relation
range: Instantiation
sub property of: relation has target
inverse of: instantiation is target of record resource to instantiation relation

is rule associated with
type: ObjectProperty
comment: Connects a Rule to a Thing that is associated with the existence and lifecycle of the Rule.
domain: Rule
range: Thing
sub property of: is related to
inverse of: is associated with rule
property chain axiom: rule is source of rule relation
property chain axiom: rule relation has target
RiC-CM corresponding component: RiC-R062 ('is rule associated with' relation)

migration relation has target
type: ObjectProperty
comment: Connects a Migration Relation to a resulting Instantiation.
domain: Migration Relation
range: Instantiation
sub property of: derivation relation has target
inverse of: instantiation is target of migration relation

Place Relation
type: Class
comment: Connects a Place and at least one Thing, when the first is associated with the existence and lifecycle of the second one.
subclass of: Relation
subclass of: Restriction
  on class: Place
  on property: place relation has source
  qualified cardinality: 1
subclass of: Restriction
  min qualified cardinality: 1
  on class: Thing
  on property: place relation has target
RiC-CM corresponding component: Class implementation of RiC-R074 and RiC-R074i relations

intellectual property rights relation has target
type: ObjectProperty
comment: Connects an IintellectualPropertyRightsRelation to one of the Record Resource or Instantiation on which the rights are held.
domain: Intellectual Property Rights Relation
range: Class
  union of: Instantiation
  union of: Record Resource
sub property of: authority relation has target
inverse of: record resource or instantiation is target of intellectual property rights relation

has record set type
type: ObjectProperty
comment: Connects a Record Set to a Record Set Type that categorizes it.
domain: Record Set
range: Record Set Type
sub property of: has or had category
inverse of: is record set type of
change note: changed the super property IRI.
  date: 2021-01-22

Instantiation
type: Class
comment: The inscription of information made by an Agent on a physical carrier in any persistent, recoverable form as a means of communicating information through time and space.
subclass of: Thing
subclass of: Restriction
  all values from: Representation Type
  on property: has representation type
subclass of: Restriction
  all values from: Production Technique Type
  on property: has production technique type
subclass of: Restriction
  all values from: Carrier Type
  on property: has carrier type
change note: Comment: updated. Scope note: updated and made several paragraphs. Objective: to make RiC-O compliant with RiC-CM v0.2.
  date: 2020-10-23
scope note: A Record or Record Part must have been instantiated at least once, though this instantiation may no longer exist at the moment of description. An instantiation might also exist at the moment of description, but be destroyed at a later moment in time, when, for example, a derived instantiation might become the only remaining instantiation. A Record Set may have an instantiation, which is to say that it is not a necessary condition. An Instantiation may be derived from another Instantiation. A Record Resource may have many Instantiations simultaneously (for instance, a record printed and saved in the same time as DOCX and PDF/A would have 3 concurrent instantiations) or through time (for example, copy of a record). Depending on the context, a new instantiation may be seen as a new or as the same record resource. During in the process of re-instantiation something is lost and something is preserved, but it is up to the context and the Agent that produces or uses that Instantiation to assess whether the two instantiations are functionally equivalent or not. For instance, a postcard representing a town map from 1874 (Instantiation 1) is digitized and kept as a JPEG file (Instantiation 2). The digital copy may be considered as instantiating the "same" Record by an Agent considering the information transmitted by the Record (e.g., the urban landscape displayed), but as a" different" Record by an antiquarian more focused on the materiality of the carrier. Successive instantiations may change the perceivable boundaries of a Record Resource. For instance, a case file comprising many records may be digitized and saved as one single PDF file, which, from management perspective, may be treated as one Record. Similarly, a large Record Set (a fonds or a series) may be maintained as one database. On the other hand, one record (main document and its annexes) may be digitized in separate files and each one may be managed as a discrete “physical” item. Instantiations may require media…
RiC-CM corresponding component: Corresponds to RiC-E06 (Instantiation entity)
close to: PREMIS Representation

record is source of authorship relation
type: ObjectProperty
comment: Connects a Record and an Authorship Relation.
domain: Record
range: Authorship Relation
sub property of: record resource or instantiation is source of creation relation
inverse of: authorship relation has source
change note: Created following the addition of RiC-R079 relation in RiC-CM 0.2
  date: 2020-12-29

textual value
type: DatatypeProperty
comment: A textual expression of an Appellation or Date.
domain: Class
  union of: Appellation
  union of: Date
  union of: Extent
range: Literal

Membership Relation
type: Class
comment: Connects a Group and at least one Person, when the first one has the second one(s) among its members.
subclass of: Agent Relation
subclass of: Restriction
  max qualified cardinality: 1
  on class: Position
  on property: membership with position
subclass of: Restriction
  on class: Group
  on property: membership relation has source
  qualified cardinality: 1
subclass of: Restriction
  min qualified cardinality: 1
  on class: Person
  on property: membership relation has target
RiC-CM corresponding component: Class implementation of RiC-R055 and RiC-R055i relations

is or was category of all members of
type: ObjectProperty
comment: Connects a Category (Type) and a Record Set whose all present or past Record or Record Part members belong to that Category.
domain: Type
range: Record Set
sub property of: is related to
inverse of: has or had all members with category
change note:
  value: Object property added for handling the case where a Record Set is described as having all or some members that belong to some category (see RiC-CM 0.2 attributes section, #4.4 on Record Set, Record and Record Part attributes).
  date: 2020-12-28

is or was component of
type: ObjectProperty
comment: Inverse of 'has or had component' object property.
domain: Instantiation
range: Instantiation
sub property of: is instantiation associated with instantiation
sub property of: is or was part of
inverse of: has or had component
change note: changed the IRI, label, inverse property IRI, text definition (changed made in order to make RiC-O compliant with RiC-CM 0.2; the name of this property in RiC-O 0.1 was "isComponentOf").
  date: 2021-01-22
RiC-CM corresponding component: RiC-R004i ('is or was component of' relation)

integrity
type: DatatypeProperty
comment: Information about the completeness of a Record Resource or Instantiation.
domain: Class
  union of: Instantiation
  union of: Record Resource
range: Literal
change note: Scope note and examples added. Objective: to make RiC-O compliant with RiC-CM v0.2.
  date: 2020-11-01
example: The database (DBF) file has the checksum SHA-1: 99f9d780e441785016dea545b72dad700305535a.
example: The book register’s last pages are missing, which affects the completeness of the record.
example: The charter is missing the seal.
scope note: The information about integrity may be generated manually or automatically.
RiC-CM corresponding component: Corresponds to RiC-A24 (Integrity attribute)

Accumulation Relation
type: Class
comment: Connects at least one Record Resource or Instantiation to at least one Agent, when the Agent accumulates it, be it intentionally (collecting it) or not (receiving it in the course of its activities).
subclass of: Agent Origination Relation
subclass of: Restriction
  min qualified cardinality: 1
  on class: Agent
  on property: accumulation relation has target
subclass of: Restriction
  min qualified cardinality: 1
  on class: Class
    union of: Instantiation
    union of: Record Resource
  on property: accumulation relation has source
RiC-CM corresponding component: Class implementation of RiC-R028 and RiC-R028i relations

position is context of membership relation
type: ObjectProperty
comment: Connects a Position to a Membership Relation (the member Person occupies that Position).
domain: Position
range: Membership Relation
sub property of: thing is context of relation
inverse of: membership with position

has or had participant
type: ObjectProperty
comment: Connects an Event to a Thing that is or was actively or passively involved in it.
domain: Event
range: Thing
sub property of: is event associated with
inverse of: is or was participant in
change note: changed the IRI, label, inverse property IRI, textual definition (changed made in order to make RiC-O compliant with RiC-CM 0.2; the name of this property in RiC-O 0.1 was "involves").
  date: 2021-01-22
RiC-CM corresponding component: RiC-R058 ('has or had participant' relation)

management relation has source
type: ObjectProperty
comment: Connects a Management Relation to an Agent who is involved as a manager.
domain: Management Relation
range: Agent
sub property of: authority relation has source
inverse of: agent is source of management relation

is or was owner of
type: ObjectProperty
comment: Connects a Group, Person or Position to a Thing that this Agent owns or owned.
domain: Class
  union of: Group
  union of: Person
  union of: Position
range: Thing
sub property of: has or had authority over
inverse of: has or had owner
property chain axiom: agent is source of ownership relation
property chain axiom: owner ship relation has target
change note:
  value: changed the IRI, label, inverse property IRI, textual definition, super property IRI (changed made in order to make RiC-O compliant with RiC-CM 0.2; the name of this property in RiC-O 0.1 was "isOwnerOf").
  date: 2021-01-22
RiC-CM corresponding component: RiC-R037 ('is or was owner of' relation)

group is target of leadership relation
type: ObjectProperty
comment: Connects a Group (which has a leader) to a Leadership Relation
domain: Group
range: Leadership Relation
sub property of: agent is target of agent control relation
inverse of: leadership relation has target

is or was demographic group of
type: ObjectProperty
comment: Connects a Demographic Group to a Person or Group which belongs or belonged to it.
domain: Demographic Group
range: Class
  union of: Group
  union of: Person
sub property of: is or was category of
inverse of: has or had demographic group
change note: changed the IRI, label, inverse property IRI, text definition, range (the name of this property in RiC-O 0.1 was "isDemographicGroupOf").
  date: 2021-01-22

type relation has target
type: ObjectProperty
comment: Connects a Type Relation to a Thing (that is categorized by the involved Type).
domain: Type Relation
range: Thing
sub property of: relation has target
inverse of: thing is target of type relation

accrual
type: DatatypeProperty
comment: Information on the anticipated accession(s) to the Record Set.
domain: Record Set
range: Literal
scope note: See also accrualStatus
RiC-CM corresponding component: corresponds to RiC-A01 (Accrual attribute)

event is source of event relation
type: ObjectProperty
comment: Connects an Event to an Event Relation
domain: Event
range: Event Relation
sub property of: thing is source of relation
inverse of: event relation has source

is or was language of
type: ObjectProperty
comment: Connects a Language to an Agent, Record or Record Part that uses or used it.
domain: Language
range: Class
  union of: Agent
  union of: Record
  union of: Record Part
sub property of: is related to
inverse of: has or had language
change note: changed the IRI, label, inverse property IRI, textual definition (the name of this property in RiC-O 0.1 was "isLanguageOf").
  date: 2021-01-22

normalized date value
type: DatatypeProperty
comment: Date representation based on a standard, preferably machine-readable.
domain: Date
range: Literal
sub property of: normalized value
change note: Examples added. Objective: to make RiC-O compliant with RiC-CM v0.2.
  date: 2020-11-01
example: 1948-03-03
example: 1789/1815
RiC-CM corresponding component: Corresponds to RiC-A29 (Normalized Date attribute)

has or had subordinate
type: ObjectProperty
comment: Connects an Agent to an Agent that is hierarchically inferior.
domain: Agent
range: Agent
sub property of: is agent associated with agent
inverse of: is or was subordinate to
property chain axiom: agent is source of agent hierarchical relation
property chain axiom: agent hierarchical relation has target
change note: changed the IRI, label, inverse property IRI (changed made in order to make RiC-O compliant with RiC-CM 0.2; the name of this property in RiC-O 0.1 was "isHierarchicallySuperiorTo").
  date: 2021-01-22
scope note: The hierarchical relation can be an authority relation, or a whole/part relation between two Groups
RiC-CM corresponding component: RiC-R045 ('has or had subordinate ' relation)

Appellation
type: Class
comment: A concept of any kind that is used for designating an Entity and referring to it.
subclass of: Concept

type
type: DatatypeProperty
comment: A term used to characterize an entity.
domain: Thing
range: Literal
scope note: Provided for usability reasons. May be deprecated and removed later on. Use only if you don't use Type subclasses for handling categories.

is or was included in
type: ObjectProperty
comment: Inverse of 'includes or included' object property.
domain: Class
  union of: Record
  union of: Record Set
range: Record Set
sub property of: is record resource associated with record resource
inverse of: includes or included
change note: changed the IRI, label, inverse property IRI, text definition (changed made in order to make RiC-O compliant with RiC-CM 0.2; the name of this property in RiC-O 0.1 was "includedIn").
  date: 2021-01-22
RiC-CM corresponding component: RiC-R024i ('is or was included in' relation)

person is target of child relation
type: ObjectProperty
comment: Connects a Person (as a child) to a Child Relation.
domain: Person
range: Child Relation
sub property of: person is target of descendance relation
inverse of: child relation has target

is beginning date of
type: ObjectProperty
comment: Connects a Date to a Thing that came into existence on that Date.
domain: Date
range: Thing
sub property of: is date associated with
inverse of: has beginning date
RiC-CM corresponding component: RiC-R069 ('is beginning date of' relation)

date standard
type: DatatypeProperty
comment: Identifier of the standard of the Normalized date.
domain: Date
range: Literal
sub property of: reference system
change note: examples added. Objective: to make RiC-O compliant with RiC-CM v0.2.
  date: 2020-11-01
example: ISO8601
example: IETF
RiC-CM corresponding component: Corresponds to RiC-A14 (Date Standard attribute)

has carrier type
type: ObjectProperty
comment: Connects an Instantiation to a Carrier Type which categorizes its carrier.
domain: Instantiation
range: Carrier Type
sub property of: has or had category
inverse of: is carrier type of
change note: changed the superproperty IRI.
  date: 2021-01-22

is or was language of some members of
type: ObjectProperty
comment: Connects a Language and a Record Set whose some present or past Record or Record Part members use that Language.
domain: Language
range: Record Set
sub property of: is related to
inverse of: has or had some members with language
change note:
  value: Object property added for handling the case where a Record Set is described as having all or some members that belong to some category (see RiC-CM 0.2 attributes section, #4.4 on Record Set, Record and Record Part attributes).
  date: 2020-12-28

deletion date
type: DatatypeProperty
comment: Date at which an entity was deleted.
domain: Thing
range: Literal
sub property of: end date
scope note: Provided for usability reasons. May be deprecated and removed later on. Use only if you don't use Date classes for handling dates.
RiC-CM corresponding component: Data property specialized implementation of RiC-E18 (Date entity)

position holding relation has target
type: ObjectProperty
comment: Connects a Position Holding Relation to a Position (that is occupied).
domain: Position Holding Relation
range: Position
sub property of: relation has target
sub property of: agent relation connects
inverse of: position is target of position holding relation

is or was occupation type of
type: ObjectProperty
comment: Connects an Occupation Type to a Person whose occupation is or was categorized by it.
domain: Occupation Type
range: Person
sub property of: is or was demographic group of
inverse of: has or had occupation of type
change note: changed the IRI, label, inverse property IRI, textual definition, super property IRI (the name of this property in RiC-O 0.1 was "isOccupationTypeOf").
  date: 2021-01-22

instantiation is source of derivation relation
type: ObjectProperty
comment: Connects an Instantiation (from which at least one Instantiation is derived) to a Derivation Relation.
domain: Instantiation
range: Derivation Relation
sub property of: instantiation is connected to instantiation relation
sub property of: thing is source of temporal relation
sub property of: thing is source of relation
inverse of: derivation relation has source

rule followed
type: DatatypeProperty
comment: The rule or conditions that govern the existence or lifecycle of a Thing.
domain: Thing
range: Literal
scope note: Provided for usability reasons. May be deprecated and removed later on. Use only if you don't use the Rule class for handling rules.

activity is target of activity documentation relation
type: ObjectProperty
comment: Connects an Activity to an Activity Documentation Relation
domain: Activity
range: Activity Documentation Relation
sub property of: agent or activity is target of provenance relation
inverse of: activity documentation relation has target

leadership relation has source
type: ObjectProperty
comment: Connects a Leadership Relation to a Person who is involved as a leader.
domain: Leadership Relation
range: Person
sub property of: agent control relation has source
inverse of: person is source of leadership relation

has or had subdivision
type: ObjectProperty
comment: Connects a Group to one of its present or past subdivisions.
domain: Group
range: Group
sub property of: has or had subordinate
sub property of: has or had part
inverse of: is or was subdivision of
property chain axiom: group is source of group subdivision relation
property chain axiom: group subdivision relation has target
change note:
  value: changed the IRI, label, inverse property IRI, text definition, super property IRIs (changed made in order to make RiC-O compliant with RiC-CM 0.2; the name of this property in RiC-O 0.1 was "hasSubdivision").
  date: 2021-01-22
RiC-CM corresponding component: RiC-R005 ('has or hadsubdivision' relation)

is family type of
type: ObjectProperty
comment: Connects a Family Type to a Family that is categorizes.
domain: Family Type
range: Family
sub property of: is or was category of
inverse of: has family type
change note: changed the superproperty IRI.
  date: 2021-01-22

Intellectual Property Rights Relation
type: Class
comment: Connects at least one Agent and one Record Resource or Instantiation on which the Agent has some intellectual property rights.
subclass of: Authority Relation
subclass of: Restriction
  min qualified cardinality: 1
  on class: Class
    union of: Instantiation
    union of: Record Resource
  on property: intellectual property rights relation has target
subclass of: Restriction
  min qualified cardinality: 1
  on class: Class
    union of: Group
    union of: Person
    union of: Position
  on property: intellectual property rights relation has source
scope note: Can be used, when the record resource is a work, for specifying the connection between the record resource and its author(s).
RiC-CM corresponding component: Class implementation of RiC-R040 and RiC-R040i relations

altimetric system
type: DatatypeProperty
comment: Reference system used for altitude
domain: Coordinates
range: Literal
sub property of: reference system

is provenance of
type: ObjectProperty
comment: inverse of 'has provenance' object property.
domain: Agent
range: Class
  union of: Instantiation
  union of: Record Resource
sub property of: is related to
inverse of: has provenance
property chain axiom: agent is target of agent origination relation
property chain axiom: agent origination relation has source
RiC-CM corresponding component: RiC-R026i ('is provenance of' relation)

instantiation is connected to instantiation relation
type: ObjectProperty
comment: Connects an Instantiation to an Instantiation to Instantiation Relation.
domain: Instantiation
range: Instantiation to Instantiation Relation
sub property of: thing is connected to relation
inverse of: instantiation to instantiation relation connects

Place Type
type: Class
comment: Categorization of a Place.
subclass of: Type
subclass of: Restriction
  all values from: Place
  on property: is or was place type of
scope note: Broadly, a Place may be a member of three broad categories: jurisdiction, manmade structure, or a natural feature. Each of these three categories can subdivided into narrower categories.
RiC-CM corresponding component: Corresponds to RiC-A32 (Place Type attribute)

Agent Relation
type: Class
comment: Connects at least two Agents.
subclass of: Relation
subclass of: Restriction
  min qualified cardinality: 2
  on class: Agent
  on property: agent relation connects
RiC-CM corresponding component: Class implementation of RiC-R044 and RiC-044i relations

accumulation relation has source
type: ObjectProperty
comment: Connects an Accumulation Relation to one of the accumulated Record Resources or Instantiations
domain: Accumulation Relation
range: Class
  union of: Instantiation
  union of: Record Resource
sub property of: agent origination relation has source
inverse of: record resource or instantiation is source of accumulation relation

Event Relation
type: Class
comment: Connects at least one Event to at least one Thing, when the first is associated with the existence and lifecycle of the second one.
subclass of: Relation
subclass of: Restriction
  min qualified cardinality: 1
  on class: Thing
  on property: event relation has target
subclass of: Restriction
  min qualified cardinality: 1
  on class: Event
  on property: event relation has source
RiC-CM corresponding component: Class implementation of RiC-R057 and RiC-R057i relations

mandate relation has target
type: ObjectProperty
comment: Connects a Mandate Relation to an Agent who is given the authority or competencies to act.
domain: Mandate Relation
range: Agent
sub property of: rule relation has target
inverse of: agent is target of mandate relation

Name
type: Class
comment: A label, title or term designating the entity in order to make it distinguishable from other similar entities.
subclass of: Appellation
RiC-CM corresponding component: Class implementation of RiC-A28 (Name attribute) (see also the name data property)

creation relation has source
type: ObjectProperty
comment: Connects a Creation Relation to one of the created Record Resources or Instantiations
domain: Creation Relation
range: Class
  union of: Instantiation
  union of: Record Resource
sub property of: agent origination relation has source
inverse of: record resource or instantiation is source of creation relation

is or was performed by
type: ObjectProperty
comment: Connects an Activity to an Agent that performed or performs the Activity.
domain: Activity
range: Agent
sub property of: has or had participant
inverse of: performs or performed
property chain axiom: activity is source of performance relation
property chain axiom: performance relation has target
change note:
  value: changed the IRI, label, inverse property IRI, text definition, super property IRI (changed made in order to make RiC-O compliant with RiC-CM 0.2; the name of this property in RiC-O 0.1 was "performedBy").
  date: 2021-01-22
RiC-CM corresponding component: RiC-R060 ('is or was performed by' relation)

Record State
type: Class
comment: Categorization of the production or reproduction status of a Record or Record Part.
subclass of: Type
change note: scope note: updated. Objective: to make RiC-O compliant with RiC-CM v0.2.
  date: 2020-10-23
change note: IRI and label changed (RecordResourceState to RecordState), as well as textual definition.
  date: 2020-12-28
scope note: Can in particular refer to a record state of development or its status of transmission once finished (draft, original, copy...). Specifying that a record resource has state copy usually implies that another record resource existed or exists, of which the one described is the copy. In such a case you can also use 'is copy of' object property.
RiC-CM corresponding component: Corresponds to RiC-A39 (State attribute)

hasPublisher
type: ObjectProperty
comment: Connects a Record resource to an Agent who published it.
domain: Record Resource
range: Agent
sub property of: is related to
inverse of: isPublisherOf
change note: changed the IRI, label, inverse property IRI (the name of this property in RiC-O 0.1 was "publishedBy").
  date: 2021-01-22

role is context of creation relation
type: ObjectProperty
comment: Connects a Role Type to a Creation Relation (this Role Type being the specific role played by the creating Person in the context of this Relation).
domain: Role Type
range: Creation Relation
sub property of: thing is context of relation
inverse of: creation with role

is record resource associated with record resource
type: SymmetricProperty
type: ObjectProperty
comment: Connects two Record Resources. This object property is symmetric.
domain: Record Resource
range: Record Resource
sub property of: is related to
property chain axiom: record resource is connected to record resource relation
property chain axiom: record resource relation connects
RiC-CM corresponding component: RiC-R022 ('is record resource associated with record resource' relation)

is reply to
type: ObjectProperty
comment: Inverse of 'has reply' object property.
domain: Record Resource
range: Record Resource
sub property of: is record resource associated with record resource
sub property of: follows in time
inverse of: has reply
change note: changed the IRI, label, inverse property IRI, text definition (changed made in order to make RiC-O compliant with RiC-CM 0.2; the name of this property in RiC-O 0.1 was "repliesTo").
  date: 2021-01-22
RiC-CM corresponding component: RiC-R013i ('is reply to' relation)

has or had authority over
type: ObjectProperty
comment: Connects an Agent to a Thing the Agent has or had authority over.
domain: Agent
range: Thing
sub property of: is related to
inverse of: is or was under authority of
property chain axiom: agent is source of authority relation
property chain axiom: authority relation has target
change note: changed the IRI, label, inverse property IRI, textual definition (changed made in order to make RiC-O compliant with RiC-CM 0.2; the name of this property in RiC-O 0.1 was "hasAuthorityOver").
  date: 2021-01-22
RiC-CM corresponding component: RiC-R036 ('has or had authority over' relation)

Whole Part Relation
type: Class
comment: Connects a Thing to at least one constitutive or component part of that Thing.
subclass of: Relation
subclass of: Restriction
  on class: Thing
  on property: whole part relation has source
  qualified cardinality: 1
subclass of: Restriction
  min qualified cardinality: 1
  on class: Thing
  on property: whole part relation has target
RiC-CM corresponding component: Class implementation of RiC-R002 and RiC-R002i relations