Published
type: Concept

Deprecated
type: Concept

RDA Work properties
note: Properties derived from RDA elements and relationship designators with the domain of RDA Work.

has respondent
has unconstrained: P60045
lexical alias: respondent.en
name: respondent
status: Published
toolkit definition: A candidate for a degree who defends or opposes a thesis provided by the praeses in an academic disputation.
toolkit label: respondent
type: Property
domain: C10001
range: C10004
sub property of: P60045
sub property of: has creator
inverse of: P50001
definition: Relates a work to a candidate for a degree who defends or opposes a thesis provided by the praeses in an academic disputation.

has identifier for the work
has unconstrained: P60052
lexical alias: identifierForTheWork.en
name: identifierForTheWork
status: Published
instruction number: 6.8
toolkit definition: A character string uniquely associated with a work, or with a surrogate for a work (e.g., an authority record).
toolkit label: identifier for the work
type: Property
domain: C10001
sub property of: P60052
definition: Relates a work to a character string uniquely associated with a work, or with a surrogate for a work (e.g., an authority record).
scope note: The identifier serves to differentiate that work from other works.

has other distinguishing characteristic of the work
has unconstrained: P60054
lexical alias: otherDistinguishingCharacteristicOfTheWork.en
name: otherDistinguishingCharacteristicOfTheWork
status: Published
instruction number: 6.6
toolkit definition: A characteristic other than form of work, date of work, or place of origin of the work.
toolkit label: other distinguishing characteristic of the work
type: Property
domain: C10001
sub property of: P60054
definition: Relates a work to a characteristic other than form of work, date of work, or place of origin of the work.
scope note: It serves to differentiate a work from another work with the same title or from the name of a person, family, or corporate body.

has form of work
has unconstrained: P60058
lexical alias: formOfWork.en
name: formOfWork
status: Published
instruction number: 6.3
toolkit definition: A class or genre to which a work belongs.
toolkit label: form of work
type: Property
domain: C10001
sub property of: P60058
definition: Relates a work to a class or genre to which a work belongs.

has appellee corporate body
has unconstrained: P60373
lexical alias: appelleeCorporateBody.en
name: appelleeCorporateBody
status: Published
toolkit definition: A corporate body against whom an appeal is taken on the decision of a lower court recorded in a legal work of a higher court.
toolkit label: has appellee corporate body
type: Property
domain: C10001
range: C10005
sub property of: P60373
sub property of: has appellee
inverse of: P50002
definition: Relates a work to a corporate body against whom an appeal is taken on the decision of a lower court recorded in a legal work of a higher court.

has degree granting institution
has unconstrained: P60060
lexical alias: degreeGrantingInstitution.en
name: degreeGrantingInstitution
status: Published
toolkit definition: A corporate body granting an academic degree.
toolkit label: degree granting institution
type: Property
domain: C10001
range: C10005
sub property of: P60060
sub property of: has other person, family, or corporate body associated with a work
inverse of: P50003
definition: Relates a work to a corporate body granting an academic degree.

has host institution
has unconstrained: P60061
lexical alias: hostInstitution.en
name: hostInstitution
status: Published
toolkit definition: A corporate body hosting the event, exhibit, conference, etc., which gave rise to a work, but having little or no responsibility for the content of the work.
toolkit label: host institution
type: Property
domain: C10001
range: C10005
sub property of: P60061
sub property of: has other person, family, or corporate body associated with a work
inverse of: P50004
definition: Relates a work to a corporate body hosting the event, exhibit, conference, etc., which gave rise to a work, but having little or no responsibility for the content of the work.

has production company
has unconstrained: P60062
lexical alias: productionCompany.en
name: productionCompany
status: Published
toolkit definition: A corporate body that is responsible for financial, technical, and organizational management of a production for stage, screen, sound recording, television, webcast, etc.
toolkit label: production company
type: Property
domain: C10001
range: C10005
sub property of: P60062
sub property of: has other person, family, or corporate body associated with a work
inverse of: P50005
definition: Relates a work to a corporate body that is responsible for financial, technical, and organizational management of a production for stage, screen, sound recording, television, webcast, etc.

has appellant corporate body
has unconstrained: P60457
lexical alias: appellantCorporateBody.en
name: appellantCorporateBody
status: Published
toolkit definition: A corporate body who appeals the decision of a lower court recorded in a legal work of a higher court.
toolkit label: appellant corporate body
type: Property
domain: C10001
range: C10005
sub property of: P60457
sub property of: has appellant
inverse of: P50042
definition: Relates a work to a corporate body who appeals the decision of a lower court recorded in a legal work of a higher court.

has plaintiff corporate body
has unconstrained: P60459
lexical alias: plaintiffCorporateBody.en
name: plaintiffCorporateBody
status: Published
toolkit definition: A corporate body who brings a suit in a civil proceeding.
toolkit label: plaintiff corporate body
type: Property
domain: C10001
range: C10005
sub property of: P60459
sub property of: has plaintiff
inverse of: P50043
definition: Relates a work to a corporate body who brings a suit in a civil proceeding.

has court governed
has unconstrained: P60065
lexical alias: courtGoverned.en
name: courtGoverned
status: Published
toolkit definition: A court governed by court rules, regardless of their official nature (e.g., laws, administrative regulations).
toolkit label: court governed
type: Property
domain: C10001
range: C10005
sub property of: P60065
sub property of: has other person, family, or corporate body associated with a work
inverse of: P50044
definition: Relates a work to a court governed by court rules, regardless of their official nature (e.g., laws, administrative regulations).

has numbering of part
has unconstrained: P60080
lexical alias: numberingOfPart.en
name: numberingOfPart
status: Published
instruction number: 24.6
toolkit definition: A designation of the sequencing of a part or parts within a larger work.
toolkit label: numbering of part
type: Property
domain: C10001
sub property of: P60080
definition: Relates a work to a designation of the sequencing of a part or parts within a larger work.
scope note: Numbering of part may include a numeral, a letter, any other character, or the combination of these with or without an accompanying caption (volume, number, etc.) and/or a chronological designation.

has film director
has unconstrained: P60084
lexical alias: filmDirector.en
name: filmDirector
status: Published
toolkit definition: A director responsible for the general management and supervision of a filmed performance.
toolkit label: film director
type: Property
domain: C10001
range: C10002
sub property of: P60084
sub property of: has director
inverse of: P50048
definition: Relates a work to a director responsible for the general management and supervision of a filmed performance.

has radio director
has unconstrained: P60085
lexical alias: radioDirector.en
name: radioDirector
status: Published
toolkit definition: A director responsible for the general management and supervision of a radio program.
toolkit label: radio director
type: Property
domain: C10001
range: C10002
sub property of: P60085
sub property of: has director
inverse of: P50049
definition: Relates a work to a director responsible for the general management and supervision of a radio program.

has television director
has unconstrained: P60086
lexical alias: televisionDirector.en
name: televisionDirector
status: Published
toolkit definition: A director responsible for the general management and supervision of a television program.
toolkit label: television director
type: Property
domain: C10001
range: C10002
sub property of: P60086
sub property of: has director
inverse of: P50050
definition: Relates a work to a director responsible for the general management and supervision of a television program.

is dramatized as (work)
has unconstrained: P60088
lexical alias: dramatizedAsWork.en
name: dramatizedAsWork
status: Published
toolkit definition: A dramatic work adapted from the source work.
toolkit label: dramatized as (work)
type: Property
domain: C10001
range: C10001
sub property of: P60088
sub property of: is adapted as (work)
inverse of: is dramatization of (work)
definition: Relates a work to a dramatic work adapted from the source work.

has enacting jurisdiction
has unconstrained: P60096
lexical alias: enactingJurisdiction.en
name: enactingJurisdiction
status: Published
toolkit definition: A jurisdiction enacting a law, regulation, constitution, court rule, etc.
toolkit label: enacting jurisdiction
type: Property
domain: C10001
range: C10005
sub property of: P60096
sub property of: has creator
inverse of: P50068
definition: Relates a work to a jurisdiction enacting a law, regulation, constitution, court rule, etc.

has jurisdiction governed
has unconstrained: P60097
lexical alias: jurisdictionGoverned.en
name: jurisdictionGoverned
status: Published
toolkit definition: A jurisdiction governed by a law, regulation, etc., that was enacted by another jurisdiction.
toolkit label: jurisdiction governed
type: Property
domain: C10001
range: C10005
sub property of: P60097
sub property of: has other person, family, or corporate body associated with a work
inverse of: P50069
definition: Relates a work to a jurisdiction governed by a law, regulation, etc., that was enacted by another jurisdiction.

is contained in (work)
has subproperty: is subseries of
has subproperty: is in series
has unconstrained: P60101
lexical alias: containedInWork.en
name: containedInWork
status: Published
toolkit definition: A larger work of which the work is a discrete component.
toolkit label: contained in (work)
type: Property
domain: C10001
range: C10001
sub property of: P60101
sub property of: has whole-part work relationship with
inverse of: is container of (work)
definition: Relates a work to a larger work of which the work is a discrete component.

is sequel
has unconstrained: P60102
lexical alias: sequel.en
name: sequel
status: Published
toolkit definition: A later work that continues the narrative of an earlier work.
toolkit label: sequel
type: Property
domain: C10001
range: C10001
sub property of: P60102
sub property of: is succeeded by (work)
inverse of: is sequel to
definition: Relates a work to a later work that continues the narrative of an earlier work.

is replaced in part by (work)
has unconstrained: P60103
lexical alias: replacedInPartByWork.en
name: replacedInPartByWork
status: Published
toolkit definition: A later work used in part in place of an earlier work, usually because the later work contains updated or new information that makes part of the earlier work obsolete.
toolkit label: replaced in part by (work)
type: Property
domain: C10001
range: C10001
sub property of: P60103
sub property of: is succeeded by (work)
inverse of: is replacement in part of (work)
definition: Relates a work to a later work used in part in place of an earlier work, usually because the later work contains updated or new information that makes part of the earlier work obsolete.

is replaced by (work)
has unconstrained: P60104
lexical alias: replacedByWork.en
name: replacedByWork
status: Published
toolkit definition: A later work used in place of an earlier work, usually because the later work contains updated or new information that makes the earlier work obsolete.
toolkit label: replaced by (work)
type: Property
domain: C10001
range: C10001
sub property of: P60104
sub property of: is succeeded by (work)
inverse of: is replacement of (work)
definition: Relates a work to a later work used in place of an earlier work, usually because the later work contains updated or new information that makes the earlier work obsolete.

is adapted in verse as (work)
has unconstrained: P60106
lexical alias: adaptedInVerseAsWork.en
name: adaptedInVerseAsWork
status: Published
toolkit definition: A literary composition in verse form adapted from the source work.
toolkit label: adapted in verse as (work)
type: Property
domain: C10001
range: C10001
sub property of: P60106
sub property of: is adapted as (work)
inverse of: is verse adaptation of (work)
definition: Relates a work to a literary composition in verse form adapted from the source work.

has coordinates of cartographic content
has subproperty: has longitude and latitude
has subproperty: has right ascension and declination
has subproperty: has strings of coordinate pairs
has unconstrained: P60109
lexical alias: coordinatesOfCartographicContent.en
name: coordinatesOfCartographicContent
status: Published
instruction number: 7.4
toolkit definition: A mathematical system for identifying the area covered by the cartographic content of a resource.
toolkit label: coordinates of cartographic content
type: Property
domain: C10001
sub property of: P60109
definition: Relates a work to a mathematical system for identifying the area covered by the cartographic content of a resource.
scope note: Coordinates may be expressed by means of longitude and latitude on the surface of planets or by the angles of right ascension and declination for celestial charts.

is adapted as motion picture (work)
has unconstrained: P60110
lexical alias: adaptedAsMotionPictureWork.en
name: adaptedAsMotionPictureWork
status: Published
toolkit definition: A motion picture based on the source work.
toolkit label: adapted as motion picture (work)
type: Property
domain: C10001
range: C10001
sub property of: P60110
sub property of: is adapted as (work)
inverse of: is motion picture adaptation of (work)
definition: Relates a work to a motion picture based on the source work.

is cadenza (work)
has unconstrained: P60113
lexical alias: cadenzaWork.en
name: cadenzaWork
status: Published
toolkit definition: A musical work consisting of an ornamental passage for a soloist, added to a musical work such as a concerto, either by the same or a different composer.
toolkit label: cadenza (work)
type: Property
domain: C10001
range: C10001
sub property of: P60113
sub property of: is augmented by (work)
inverse of: is cadenza composed for (work)
definition: Relates a work to a musical work consisting of an ornamental passage for a soloist, added to a musical work such as a concerto, either by the same or a different composer.

is variations based on (work)
has unconstrained: P60114
lexical alias: variationsBasedOnWork.en
name: variationsBasedOnWork
status: Published
toolkit definition: A musical work from which melodic, thematic, or harmonic material is taken to form a discrete theme, which is repeated one or more times with subsequent modifications.
toolkit label: variations based on (work)
type: Property
domain: C10001
range: C10001
sub property of: P60114
sub property of: is based on (work)
inverse of: is modified by variation as (work)
definition: Relates a work to a musical work from which melodic, thematic, or harmonic material is taken to form a discrete theme, which is repeated one or more times with subsequent modifications.

is modified by variation as (work)
has unconstrained: P60115
lexical alias: modifiedByVariationAsWork.en
name: modifiedByVariationAsWork
status: Published
toolkit definition: A musical work in which melodic, thematic, or harmonic material is taken from the source work to form a discrete theme, which is repeated one or more times with subsequent modifications.
toolkit label: modified by variation as (work)
type: Property
domain: C10001
range: C10001
sub property of: P60115
sub property of: is derivative (work)
inverse of: is variations based on (work)
definition: Relates a work to a musical work in which melodic, thematic, or harmonic material is taken from the source work to form a discrete theme, which is repeated one or more times with subsequent modifications.

is cadenza composed for (work)
has unconstrained: P60116
lexical alias: cadenzaComposedForWork.en
name: cadenzaComposedForWork
status: Published
toolkit definition: A musical work such as a concerto for which an ornamental passage for a soloist has been composed, either by the same or a different composer.
toolkit label: cadenza composed for (work)
type: Property
domain: C10001
range: C10001
sub property of: P60116
sub property of: is augmentation of (work)
inverse of: is cadenza (work)
definition: Relates a work to a musical work such as a concerto for which an ornamental passage for a soloist has been composed, either by the same or a different composer.

is libretto for (work)
has unconstrained: P60117
lexical alias: librettoForWork.en
name: librettoForWork
status: Published
toolkit definition: A musical work such as an opera or other work for the musical stage, or an oratorio, that uses the text of the related work as a libretto.
toolkit label: libretto for (work)
type: Property
domain: C10001
range: C10001
sub property of: P60117
sub property of: is complemented by (work)
inverse of: is libretto (work)
definition: Relates a work to a musical work such as an opera or other work for the musical stage, or an oratorio, that uses the text of the related work as a libretto.

is incidental music (work)
has unconstrained: P60118
lexical alias: incidentalMusicWork.en
name: incidentalMusicWork
status: Published
toolkit definition: A musical work that provides the incidental music for a play or other spoken work for the stage.
toolkit label: incidental music (work)
type: Property
domain: C10001
range: C10001
sub property of: P60118
inverse of: is incidental music for (work)
definition: Relates a work to a musical work that provides the incidental music for a play or other spoken work for the stage.

is remade as (work)
has unconstrained: P60120
lexical alias: remadeAsWork.en
name: remadeAsWork
status: Published
toolkit definition: A new motion picture, radio program, television program, or video based on an earlier work.
toolkit label: remade as (work)
type: Property
domain: C10001
range: C10001
sub property of: P60120
sub property of: is derivative (work)
inverse of: is remake of (work)
definition: Relates a work to a new motion picture, radio program, television program, or video based on an earlier work.

is set to music as (work)
has unconstrained: P60121
lexical alias: setToMusicAsWork.en
name: setToMusicAsWork
status: Published
toolkit definition: A non-dramatic musical work, other than an oratorio, that uses the text of the source work.
toolkit label: set to music as (work)
type: Property
domain: C10001
range: C10001
sub property of: P60121
sub property of: is derivative (work)
inverse of: is musical setting of (work)
definition: Relates a work to a non-dramatic musical work, other than an oratorio, that uses the text of the source work.

is adapted as novel (work)
has unconstrained: P60138
lexical alias: adaptedAsNovelWork.en
name: adaptedAsNovelWork
status: Published
toolkit definition: A novel adapted from the source work.
toolkit label: adapted as novel (work)
type: Property
domain: C10001
range: C10001
sub property of: P60138
sub property of: is adapted as (work)
inverse of: is novelization of (work)
definition: Relates a work to a novel adapted from the source work.

has appellee person
has unconstrained: P60373
lexical alias: appelleePerson.en
name: appelleePerson
status: Published
toolkit definition: A person against whom an appeal is taken on the decision of a lower court recorded in a legal work of a higher court.
toolkit label: appellee person
type: Property
domain: C10001
range: C10004
sub property of: P60373
sub property of: has appellee
inverse of: P50085
definition: Relates a work to a person against whom an appeal is taken on the decision of a lower court recorded in a legal work of a higher court.

has medium
has unconstrained: P60157
lexical alias: medium.en
name: medium
status: Published
toolkit definition: A person held to be a channel of communication between the earthly world and a world of spirits.
toolkit label: medium
type: Property
domain: C10001
range: C10004
sub property of: P60157
sub property of: has other person, family, or corporate body associated with a work
inverse of: P50086
definition: Relates a work to a person held to be a channel of communication between the earthly world and a world of spirits.

has appellee
has subproperty: has appellee corporate body
has subproperty: has appellee person
has unconstrained: P60373
lexical alias: appellee.en
name: appellee
status: Published
toolkit definition: A person or corporate body against whom an appeal is taken on the decision of a lower court recorded in a legal work of a higher court.
toolkit label: appellee
type: Property
domain: C10001
sub property of: P60373
sub property of: has other person, family, or corporate body associated with a work
inverse of: P50087
definition: Relates a work to a person or corporate body against whom an appeal is taken on the decision of a lower court recorded in a legal work of a higher court.

has appellant
has subproperty: has appellant corporate body
has unconstrained: P60457
lexical alias: appellant.en
name: appellant
status: Published
toolkit definition: A person or corporate body who appeals the decision of a lower court recorded in a legal work of a higher court.
toolkit label: appellant
type: Property
domain: C10001
sub property of: P60457
sub property of: has other person, family, or corporate body associated with a work
inverse of: P50088
definition: Relates a work to a person or corporate body who appeals the decision of a lower court recorded in a legal work of a higher court.

has plaintiff
has subproperty: has plaintiff corporate body
has subproperty: has plaintiff person
has unconstrained: P60459
lexical alias: plaintiff.en
name: plaintiff
status: Published
toolkit definition: A person or corporate body who brings a suit in a civil proceeding.
toolkit label: plaintiff
type: Property
domain: C10001
sub property of: P60459
sub property of: has other person, family, or corporate body associated with a work
inverse of: P50089
definition: Relates a work to a person or corporate body who brings a suit in a civil proceeding.

has defendant
has subproperty: has defendant corporate body
has subproperty: has defendant person
has unconstrained: P60462
lexical alias: defendant.en
name: defendant
status: Published
toolkit definition: A person or corporate body who is accused in a criminal proceeding or sued in a civil proceeding.
toolkit label: defendant
type: Property
domain: C10001
range: C10002
sub property of: P60462
sub property of: has other person, family, or corporate body associated with a work
inverse of: P50090
definition: Relates a work to a person or corporate body who is accused in a criminal proceeding or sued in a civil proceeding.

has degree supervisor
has unconstrained: P60420
lexical alias: degreeSupervisor.en
name: degreeSupervisor
status: Published
toolkit definition: A person, such as an advisor or supervisor of thesis or dissertation research, overseeing either an academic degree or thesis.
toolkit label: degree supervisor
type: Property
domain: C10001
range: C10004
sub property of: P60420
sub property of: has other person, family, or corporate body associated with a work
inverse of: P50091
definition: Relates a work to a person, such as an advisor or supervisor of thesis or dissertation research, overseeing either an academic degree or thesis.

has appellant person
has unconstrained: P60457
lexical alias: appellantPerson.en
name: appellantPerson
status: Published
toolkit definition: A person who appeals the decision of a lower court recorded in a legal work of a higher court.
toolkit label: appellant person
type: Property
domain: C10001
range: C10004
sub property of: P60457
inverse of: P50122
definition: Relates a work to a person who appeals the decision of a lower court recorded in a legal work of a higher court.

has plaintiff person
has unconstrained: P60459
lexical alias: plaintiffPerson.en
name: plaintiffPerson
status: Published
toolkit definition: A work to a person who brings a suit in a civil proceeding.
toolkit label: plaintiff person
type: Property
domain: C10001
range: C10004
sub property of: P60459
sub property of: has plaintiff
inverse of: P50124
definition: Relates a work to a person who brings a suit in a civil proceeding.

has judge
has unconstrained: P60461
lexical alias: judge.en
name: judge
status: Published
toolkit definition: A person who hears and decides on legal matters in court.
toolkit label: judge
type: Property
domain: C10001
range: C10004
sub property of: P60461
sub property of: has other person, family, or corporate body associated with a work
inverse of: P50126
definition: Relates a work to a person who hears and decides on legal matters in court.

has praeses
has unconstrained: P60463
lexical alias: praeses.en
name: praeses
status: Published
toolkit definition: A person who is the faculty moderator of an academic disputation, normally proposing a thesis and participating in the ensuing disputation.
toolkit label: praeses
type: Property
domain: C10001
range: C10004
sub property of: P60463
sub property of: has creator
inverse of: P50127
definition: Relates a work to a person who is the faculty moderator of an academic disputation, normally proposing a thesis and participating in the ensuing disputation.

has issuing body
has unconstrained: P60467
lexical alias: issuingBody.en
name: issuingBody
status: Published
toolkit definition: A person, family, or corporate body issuing a work, such as an official organ of the body.
toolkit label: issuing body
type: Property
domain: C10001
range: C10002
sub property of: P60467
sub property of: has other person, family, or corporate body associated with a work
inverse of: P50130
definition: Relates a work to a person, family, or corporate body issuing a work, such as an official organ of the body.

has other person, family, or corporate body associated with a work
has subproperty: has degree granting institution
has subproperty: has host institution
has subproperty: has production company
has subproperty: has court governed
has subproperty: has jurisdiction governed
has subproperty: has medium
has subproperty: has appellee
has subproperty: has appellant
has subproperty: has plaintiff
has subproperty: has defendant
has subproperty: has degree supervisor
has subproperty: has judge
has subproperty: has issuing body
has subproperty: has dedicator
has subproperty: has honouree
has subproperty: has producer
has subproperty: has director
has subproperty: has sponsoring body
has subproperty: has director of photography
has subproperty: has dedicatee
has subproperty: has addressee
has subproperty: has consultant
has subproperty: has degree committee member
has subproperty: has commissioning body
has subproperty: has participant in a treaty
has subproperty: has researcher
has subproperty: has organizer
has unconstrained: P60374
lexical alias: otherPFCWork.en
name: otherPFCWork
status: Published
instruction number: 19.3
toolkit definition: A person, family, or corporate body associated with a work other than as a creator.
toolkit label: other person, family, or corporate body associated with a work
type: Property
domain: C10001
range: C10002
sub property of: P60374
inverse of: P50131
definition: Relates a work to a person, family, or corporate body associated with a work other than as a creator.
scope note: Includes persons, etc., to whom correspondence is addressed, persons, etc., honoured by a festschrift, directors, cinematographers, sponsoring bodies, production companies, institutions, etc., hosting an exhibition or event, etc

has dedicator
has unconstrained: P60375
lexical alias: dedicator.en
name: dedicator
status: Published
toolkit definition: A person, family, or corporate body by whom a work is dedicated.
toolkit label: dedicator
type: Property
domain: C10001
range: C10002
sub property of: P60375
sub property of: has other person, family, or corporate body associated with a work
inverse of: P50132
definition: Relates a work to a person, family, or corporate body by whom a work is dedicated.

has honouree
has unconstrained: P60406
lexical alias: honouree.en
name: honouree
status: Published
toolkit definition: A person, family, or corporate body honoured by a work (e.g., the honouree of a festschrift).
toolkit label: honouree
type: Property
domain: C10001
range: C10002
sub property of: P60406
sub property of: has other person, family, or corporate body associated with a work
inverse of: P50166
alternative label: has honoree
definition: Relates a work to a person, family, or corporate body honoured by a work (e.g., the honouree of a festschrift).

has programmer
has unconstrained: P60423
lexical alias: programmer.en
name: programmer
status: Published
toolkit definition: A person, family, or corporate body responsible for creating a computer program.
toolkit label: programmer
type: Property
domain: C10001
range: C10002
sub property of: P60423
sub property of: has creator
inverse of: P50184
definition: Relates a work to a person, family, or corporate body responsible for creating a computer program.

has designer
has unconstrained: P60424
lexical alias: designer.en
name: designer
status: Published
toolkit definition: A person, family, or corporate body responsible for creating a design for an object.
toolkit label: designer
type: Property
domain: C10001
range: C10002
sub property of: P60424
sub property of: has creator
inverse of: P50185
definition: Relates a work to a person, family, or corporate body responsible for creating a design for an object.

has cartographer
has unconstrained: P60425
lexical alias: cartographer.en
name: cartographer
status: Published
toolkit definition: A person, family, or corporate body responsible for creating a map, atlas, globe, or other cartographic work.
toolkit label: cartographer
type: Property
domain: C10001
range: C10002
sub property of: P60425
sub property of: has creator
inverse of: P50186
definition: Relates a work to a person, family, or corporate body responsible for creating a map, atlas, globe, or other cartographic work.

has composer
has unconstrained: P60426
lexical alias: composer.en
name: composer
status: Published
toolkit definition: A person, family, or corporate body responsible for creating a musical work.
toolkit label: composer
type: Property
domain: C10001
range: C10002
sub property of: P60426
sub property of: has creator
inverse of: P50187
definition: Relates a work to a person, family, or corporate body responsible for creating a musical work.

has inventor
has unconstrained: P60427
lexical alias: inventor.en
name: inventor
status: Published
toolkit definition: A person, family, or corporate body responsible for creating a new device or process.
toolkit label: inventor
type: Property
domain: C10001
range: C10002
sub property of: P60427
sub property of: has creator
inverse of: P50188
definition: Relates a work to a person, family, or corporate body responsible for creating a new device or process.

has compiler
has unconstrained: P60428
lexical alias: compiler.en
name: compiler
status: Published
toolkit definition: A person, family, or corporate body responsible for creating a new work (e.g., a bibliography, a directory) by selecting, arranging, aggregating, and editing data, information, etc.
toolkit label: compiler
type: Property
domain: C10001
range: C10002
sub property of: P60428
sub property of: has creator
inverse of: P50189
definition: Relates a work to a person, family, or corporate body responsible for creating a new work (e.g., a bibliography, a directory) by selecting, arranging, aggregating, and editing data, information, etc.

has photographer
has unconstrained: P60429
lexical alias: photographer.en
name: photographer
status: Published
toolkit definition: A person, family, or corporate body responsible for creating a photographic work.
toolkit label: photographer
type: Property
domain: C10001
range: C10002
sub property of: P60429
sub property of: has creator
inverse of: P50190
definition: Relates a work to a person, family, or corporate body responsible for creating a photographic work.

has interviewer
has unconstrained: P60430
lexical alias: interviewer.en
name: interviewer
status: Published
toolkit definition: A person, family, or corporate body responsible for creating a work by acting as an interviewer, reporter, pollster, or some other information gathering agent.
toolkit label: interviewer
type: Property
domain: C10001
range: C10002
sub property of: P60430
sub property of: has creator
inverse of: P50191
definition: Relates a work to a person, family, or corporate body responsible for creating a work by acting as an interviewer, reporter, pollster, or some other information gathering agent.

has artist
has subproperty: has sculptor
has subproperty: has calligrapher
has subproperty: has book artist
has unconstrained: P60431
lexical alias: artist.en
name: artist
status: Published
toolkit definition: A person, family, or corporate body responsible for creating a work by conceiving, and often implementing, an original graphic design, drawing, painting, etc.
toolkit label: artist
type: Property
domain: C10001
range: C10002
sub property of: P60431
sub property of: has creator
inverse of: P50192
definition: Relates a work to a person, family, or corporate body responsible for creating a work by conceiving, and often implementing, an original graphic design, drawing, painting, etc.

has interviewee
has unconstrained: P60432
lexical alias: interviewee.en
name: interviewee
status: Published
toolkit definition: A person, family, or corporate body responsible for creating a work by responding to an interviewer, usually a reporter, pollster, or some other information gathering agent.
toolkit label: interviewee
type: Property
domain: C10001
range: C10002
sub property of: P60432
sub property of: has creator
inverse of: P50193
definition: Relates a work to a person, family, or corporate body responsible for creating a work by responding to an interviewer, usually a reporter, pollster, or some other information gathering agent.

has choreographer
has unconstrained: P60433
lexical alias: choreographer.en
name: choreographer
status: Published
toolkit definition: A person, family, or corporate body responsible for creating a work of movement.
toolkit label: choreographer
type: Property
domain: C10001
range: C10002
sub property of: P60433
sub property of: has creator
inverse of: P50194
definition: Relates a work to a person, family, or corporate body responsible for creating a work of movement.

has author
has subproperty: has screenwriter
has subproperty: has lyricist
has subproperty: has librettist
has subproperty: has rapporteur
has unconstrained: P60434
lexical alias: author.en
name: author
status: Published
toolkit definition: A person, family, or corporate body responsible for creating a work that is primarily textual in content, regardless of media type (e.g., printed text, spoken word, electronic text, tactile text) or genre (e.g., poems, novels, screenplays, blogs).
toolkit label: author
type: Property
domain: C10001
range: C10002
sub property of: P60434
sub property of: has creator
inverse of: P50195
definition: Relates a work to a person, family, or corporate body responsible for creating a work that is primarily textual in content, regardless of media type (e.g., printed text, spoken word, electronic text, tactile text) or genre (e.g., poems, novels, screenplays, blogs).
scope note: Use also for persons, etc., creating a new work by paraphrasing, rewriting, or adapting works by another creator if the modification has substantially changed the nature and content of the original or changed the medium of expression.

has architect
has subproperty: has landscape architect
has unconstrained: P60435
lexical alias: architect.en
name: architect
status: Published
toolkit definition: A person, family, or corporate body responsible for creating an architectural design, including a pictorial representation intended to show how a building, etc., will look when completed.
toolkit label: architect
type: Property
domain: C10001
range: C10002
sub property of: P60435
sub property of: has creator
inverse of: P50196
definition: Relates a work to a person, family, or corporate body responsible for creating an architectural design, including a pictorial representation intended to show how a building, etc., will look when completed.

has filmmaker
has unconstrained: P60436
lexical alias: filmmaker.en
name: filmmaker
status: Published
toolkit definition: A person, family, or corporate body responsible for creating an independent or personal film.
toolkit label: filmmaker
type: Property
domain: C10001
range: C10002
sub property of: P60436
sub property of: has creator
inverse of: P50197
definition: Relates a work to a person, family, or corporate body responsible for creating an independent or personal film.
scope note: A filmmaker is individually responsible for the conception and execution of all aspects of the film.

has producer
has subproperty: has film producer
has subproperty: has radio producer
has subproperty: has television producer
has unconstrained: P60441
lexical alias: producer.en
name: producer
status: Published
toolkit definition: A person, family, or corporate body responsible for most of the business aspects of a production for screen, sound recording, television, webcast, etc.
toolkit label: producer
type: Property
domain: C10001
range: C10002
sub property of: P60441
sub property of: has other person, family, or corporate body associated with a work
inverse of: P50201
definition: Relates a work to a person, family, or corporate body responsible for most of the business aspects of a production for screen, sound recording, television, webcast, etc.
scope note: The producer is generally responsible for fund raising, managing the production, hiring key personnel, arranging for distributors, etc.

has creator
has subproperty: has respondent
has subproperty: has enacting jurisdiction
has subproperty: has praeses
has subproperty: has programmer
has subproperty: has designer
has subproperty: has cartographer
has subproperty: has composer
has subproperty: has inventor
has subproperty: has compiler
has subproperty: has photographer
has subproperty: has interviewer
has subproperty: has artist
has subproperty: has interviewee
has subproperty: has choreographer
has subproperty: has author
has subproperty: has architect
has subproperty: has filmmaker
has unconstrained: P60447
lexical alias: creator.en
name: creator
status: Published
instruction number: 19.2
toolkit definition: A person, family, or corporate body responsible for the creation of a work.
toolkit label: creator
type: Property
domain: C10001
range: C10002
sub property of: P60447
inverse of: P50204
definition: Relates a work to a person, family, or corporate body responsible for the creation of a work.

has director
has subproperty: has film director
has subproperty: has radio director
has subproperty: has television director
has unconstrained: P60449
lexical alias: director.en
name: director
status: Published
toolkit definition: A person, family, or corporate body responsible for the general management and supervision of a filmed performance, a radio or television program, etc.
toolkit label: director
type: Property
domain: C10001
range: C10002
sub property of: P60449
sub property of: has other person, family, or corporate body associated with a work
inverse of: P50205
definition: Relates a work to a person, family, or corporate body responsible for the general management and supervision of a filmed performance, a radio or television program, etc.

has sponsoring body
has unconstrained: P60451
lexical alias: sponsoringBody.en
name: sponsoringBody
status: Published
toolkit definition: A person, family, or corporate body sponsoring some aspect of a work, e.g., funding research, sponsoring an event.
toolkit label: sponsoring body
type: Property
domain: C10001
range: C10002
sub property of: P60451
sub property of: has other person, family, or corporate body associated with a work
inverse of: P50226
definition: Relates a work to a person, family, or corporate body sponsoring some aspect of a work, e.g., funding research, sponsoring an event.

has director of photography
has unconstrained: P60452
lexical alias: directorOfPhotography.en
name: directorOfPhotography
status: Published
toolkit definition: A person, family, or corporate body that captures images, either electronically or on film or video stock, and often selects and arranges the lighting.
toolkit label: director of photography
type: Property
domain: C10001
range: C10002
sub property of: P60452
sub property of: has other person, family, or corporate body associated with a work
inverse of: P50207
definition: Relates a work to a person, family, or corporate body that captures images, either electronically or on film or video stock, and often selects and arranges the lighting.
scope note: The director of photography for a movie is also called the chief cinematographer.

has dedicatee
has unconstrained: P60455
lexical alias: dedicatee.en
name: dedicatee
status: Published
toolkit definition: A person, family, or corporate body to whom a work is dedicated.
toolkit label: dedicatee
type: Property
domain: C10001
range: C10002
sub property of: P60455
sub property of: has other person, family, or corporate body associated with a work
inverse of: P50208
definition: Relates a work to a person, family, or corporate body to whom a work is dedicated.

has addressee
has unconstrained: P60456
lexical alias: addressee.en
name: addressee
status: Published
toolkit definition: A person, family, or corporate body to whom a work or part of a work is addressed.
toolkit label: addressee
type: Property
domain: C10001
range: C10002
sub property of: P60456
sub property of: has other person, family, or corporate body associated with a work
inverse of: P50209
definition: Relates a work to a person, family, or corporate body to whom a work or part of a work is addressed.

has consultant
has unconstrained: P60465
lexical alias: consultant.en
name: consultant
status: Published
toolkit definition: A person, family, or corporate body who provides consultation services, and often makes recommendations, for another person, family, or corporate body that is represented as the creator of a work.
toolkit label: consultant
type: Property
domain: C10001
range: C10002
sub property of: P60465
sub property of: has other person, family, or corporate body associated with a work
inverse of: P50211
definition: Relates a work to a person, family, or corporate body who provides consultation services, and often makes recommendations, for another person, family, or corporate body that is represented as the creator of a work.

has manifestation of work
lexical alias: manifestationOfWork.en
name: manifestationOfWork
status: Published
instruction number: 17.7
toolkit definition: A physical embodiment of an expression of a work.
toolkit label: manifestation of work
type: Property
domain: C10001
range: C10007
inverse of: P30135
definition: Relates a work to a physical embodiment of an expression of a work.

has film producer
has unconstrained: P60169
lexical alias: filmProducer.en
name: filmProducer
status: Published
toolkit definition: A producer responsible for most of the business aspects of a film.
toolkit label: film producer
type: Property
domain: C10001
range: C10002
sub property of: P60169
sub property of: has producer
inverse of: P50213
definition: Relates a work to a producer responsible for most of the business aspects of a film.

has radio producer
has unconstrained: P60170
lexical alias: radioProducer.en
name: radioProducer
status: Published
toolkit definition: A producer responsible for most of the business aspects of a radio program.
toolkit label: radio producer
type: Property
domain: C10001
range: C10002
sub property of: P60170
sub property of: has producer
inverse of: P50214
definition: Relates a work to a producer responsible for most of the business aspects of a radio program.

has television producer
has unconstrained: P60171
lexical alias: televisionProducer.en
name: televisionProducer
status: Published
toolkit definition: A producer responsible for most of the business aspects of a television program.
toolkit label: television producer
type: Property
domain: C10001
range: C10002
sub property of: P60171
sub property of: has producer
inverse of: P50215
definition: Relates a work to a producer responsible for most of the business aspects of a television program.

is adapted as radio program (work)
has unconstrained: P60174
lexical alias: adaptedAsRadioProgramWork.en
name: adaptedAsRadioProgramWork
status: Published
toolkit definition: A radio program based on the source work.
toolkit label: adapted as radio program (work)
type: Property
domain: C10001
range: C10001
sub property of: P60174
sub property of: is adapted as (work)
inverse of: is radio adaptation of (work)
definition: Relates a work to a radio program based on the source work.

has academic degree
has unconstrained: P60175
lexical alias: academicDegree.en
name: academicDegree
status: Published
instruction number: 7.9.2
toolkit definition: A rank conferred as a guarantee of academic proficiency.
toolkit label: academic degree
type: Property
domain: C10001
sub property of: P60175
definition: Relates a work to a rank conferred as a guarantee of academic proficiency.

has expression of work
lexical alias: expressionOfWork.en
name: expressionOfWork
status: Published
instruction number: 17.5
toolkit definition: A realization of a work in the form of alpha-numeric, musical or choreographic notation, sound, image, object, movement, etc., or any combination of such forms.
toolkit label: expression of work
type: Property
domain: C10001
range: C10006
inverse of: P20231
definition: Relates a work to a realization of a work in the form of alpha-numeric, musical or choreographic notation, sound, image, object, movement, etc., or any combination of such forms.

has numeric designation of a musical work
has unconstrained: P60315
lexical alias: numericDesignationOfAMusicalWork.en
name: numericDesignationOfAMusicalWork
status: Published
instruction number: 6.16
toolkit definition: A serial number, opus number, or thematic index number assigned to a musical work by a composer, publisher, or a musicologist.
toolkit label: numeric designation of a musical work
type: Property
domain: C10001
sub property of: P60315
definition: Relates a work to a serial number, opus number, or thematic index number assigned to a musical work by a composer, publisher, or a musicologist.

is subseries
has unconstrained: P60316
lexical alias: subseries.en
name: subseries
status: Published
toolkit definition: A serial or multipart work that consistently appears in a larger work; the title of the larger work appears on all issues or parts of the subseries
toolkit label: subseries
type: Property
domain: C10001
range: C10001
sub property of: P60316
sub property of: is container of (work)
inverse of: is subseries of
definition: Relates a work to a serial or multipart work that consistently appears in a larger work; the title of the larger work appears on all issues or parts of the subseries

has longitude and latitude
has unconstrained: P60345
lexical alias: longitudeAndLatitude.en
name: longitudeAndLatitude
status: Published
instruction number: 7.4.2
toolkit definition: A system for identifying the area covered by the cartographic content of a resource using longitude of the westernmost and easternmost boundaries and latitude of the northernmost and southernmost boundaries.
toolkit label: longitude and latitude
type: Property
domain: C10001
sub property of: P60345
sub property of: has coordinates of cartographic content
definition: Relates a work to a system for identifying the area covered by the cartographic content of a resource using longitude of the westernmost and easternmost boundaries and latitude of the northernmost and southernmost boundaries.

has right ascension and declination
has unconstrained: P60346
lexical alias: rightAscensionAndDeclination.en
name: rightAscensionAndDeclination
status: Published
instruction number: 7.4.4
toolkit definition: A system for identifying the location of a celestial object in the sky covered by the cartographic content of a resource using the angles of right ascension and declination.
toolkit label: right ascension and declination
type: Property
domain: C10001
sub property of: P60346
sub property of: has coordinates of cartographic content
definition: Relates a work to a system for identifying the location of a celestial object in the sky covered by the cartographic content of a resource using the angles of right ascension and declination.

has strings of coordinate pairs
has unconstrained: P60347
lexical alias: stringsOfCoordinatePairs.en
name: stringsOfCoordinatePairs
status: Published
instruction number: 7.4.3
toolkit definition: A system for identifying the precise area covered by the cartographic content of a resource using coordinates for each vertex of a polygon.
toolkit label: strings of coordinate pairs
type: Property
domain: C10001
sub property of: P60347
sub property of: has coordinates of cartographic content
definition: Relates a work to a system for identifying the precise area covered by the cartographic content of a resource using coordinates for each vertex of a polygon.

has system of organization
has unconstrained: P60348
lexical alias: systemOfOrganization.en
name: systemOfOrganization
status: Published
instruction number: 7.8
toolkit definition: A system of arranging materials in an archival resource or a collection.
toolkit label: system of organization
type: Property
domain: C10001
sub property of: P60348
definition: Relates a work to a system of arranging materials in an archival resource or a collection.

is adapted as television program (work)
has unconstrained: P60354
lexical alias: adaptedAsTelevisionProgramWork.en
name: adaptedAsTelevisionProgramWork
status: Published
toolkit definition: A television program based on the source work.
toolkit label: adapted as television program (work)
type: Property
domain: C10001
range: C10001
sub property of: P60354
sub property of: is adapted as (work)
inverse of: is television adaptation of (work)
definition: Relates a work to a television program based on the source work.

has variant title for the work
has unconstrained: P60355
lexical alias: variantTitleForTheWork.en
name: variantTitleForTheWork
status: Published
instruction number: 6.2.3
toolkit definition: A title or form of title by which a work is known that differs from the title or form of title chosen as the preferred title for the work.
toolkit label: variant title for the work
type: Property
domain: C10001
sub property of: P60355
sub property of: has title of the work
definition: Relates a work to a title or form of title by which a work is known that differs from the title or form of title chosen as the preferred title for the work.

is adapted as video (work)
has unconstrained: P60361
lexical alias: adaptedAsVideoWork.en
name: adaptedAsVideoWork
status: Published
toolkit definition: A video based on the source work.
toolkit label: adapted as video (work)
type: Property
domain: C10001
range: C10001
sub property of: P60361
sub property of: is adapted as (work)
inverse of: is video adaptation of (work)
definition: Relates a work to a video based on the source work.

has title of the work
has subproperty: has variant title for the work
has subproperty: has preferred title for the work
has unconstrained: P60367
lexical alias: titleOfTheWork.en
name: titleOfTheWork
status: Published
instruction number: 6.2
toolkit definition: A word, character, or group of words and/or characters by which a work is known.
toolkit label: title of the work
type: Property
domain: C10001
sub property of: P60367
definition: Relates a work to a word, character, or group of words and/or characters by which a work is known.

is abstracted in (work)
has unconstrained: P60177
lexical alias: abstractedInWork.en
name: abstractedInWork
status: Published
toolkit definition: A work (an abstracting and indexing service) that abstracts the contents of a source work.
toolkit label: abstracted in (work)
type: Property
domain: C10001
range: C10001
sub property of: P60177
sub property of: is derivative (work)
inverse of: is abstracts for (work)
definition: Relates a work to a work (an abstracting and indexing service) that abstracts the contents of a source work.

is indexed in (work)
has unconstrained: P60178
lexical alias: indexedInWork.en
name: indexedInWork
status: Published
toolkit definition: A work (an abstracting and indexing service) that indexes the contents of the source work.
toolkit label: indexed in (work)
type: Property
domain: C10001
range: C10001
sub property of: P60178
sub property of: is derivative (work)
inverse of: is indexing for (work)
definition: Relates a work to a work (an abstracting and indexing service) that indexes the contents of the source work.

is adapted as choreography (work)
has unconstrained: P60180
lexical alias: adaptedAsChoreographyWork.en
name: adaptedAsChoreographyWork
status: Published
toolkit definition: A work consisting of movement (e.g., dance) based on the source work.
toolkit label: adapted as choreography (work)
type: Property
domain: C10001
range: C10001
sub property of: P60180
sub property of: is adapted as (work)
inverse of: is choreographic adaptation of (work)
definition: Relates a work to a work consisting of movement (e.g., dance) based on the source work.

is errata (work)
has unconstrained: P60181
lexical alias: errataWork.en
name: errataWork
status: Published
toolkit definition: A work consisting of errors discovered after the publication of the predominant work, with their corrections.
toolkit label: errata (work)
type: Property
domain: C10001
range: C10001
sub property of: P60181
sub property of: is augmented by (work)
inverse of: is errata to (work)
definition: Relates a work to a work consisting of errors discovered after the publication of the predominant work, with their corrections.

is illustrations (work)
has unconstrained: P60182
lexical alias: illustrationsWork.en
name: illustrationsWork
status: Published
toolkit definition: A work consisting of pictorial content designed to explain or decorate the augmented work.
toolkit label: illustrations (work)
type: Property
domain: C10001
range: C10001
sub property of: P60182
sub property of: is augmented by (work)
inverse of: is illustrations for (work)
definition: Relates a work to a work consisting of pictorial content designed to explain or decorate the augmented work.

is adapted as motion picture screenplay (work)
has unconstrained: P60184
lexical alias: adaptedAsMotionPictureScreenplayWork.en
name: adaptedAsMotionPictureScreenplayWork
status: Published
toolkit definition: A work consisting of the screenplay for a motion picture, based on the source work.
toolkit label: adapted as motion picture screenplay (work)
type: Property
domain: C10001
range: C10001
sub property of: P60184
sub property of: is adapted as screenplay (work)
inverse of: is motion picture screenplay based on (work)
definition: Relates a work to a work consisting of the screenplay for a motion picture, based on the source work.

is adapted as screenplay (work)
has subproperty: is adapted as motion picture screenplay (work)
has subproperty: is adapted as television screenplay (work)
has subproperty: is adapted as video screenplay (work)
has unconstrained: P60185
lexical alias: adaptedAsScreenplayWork.en
name: adaptedAsScreenplayWork
status: Published
toolkit definition: A work consisting of the screenplay for a motion picture, television program, or video, based on the source work.
toolkit label: adapted as a screenplay (work)
type: Property
domain: C10001
range: C10001
sub property of: P60185
sub property of: is adapted as (work)
inverse of: is screenplay based on (work)
definition: Relates a work to a work consisting of the screenplay for a motion picture, television program, or video, based on the source work.

is adapted as television screenplay (work)
has unconstrained: P60186
lexical alias: adaptedAsTelevisionScreenplayWork.en
name: adaptedAsTelevisionScreenplayWork
status: Published
toolkit definition: A work consisting of the screenplay for a television program, based on the source work.
toolkit label: adapted as television screenplay (work)
type: Property
domain: C10001
range: C10001
sub property of: P60186
sub property of: is adapted as screenplay (work)
inverse of: is television screenplay based on (work)
definition: Relates a work to a work consisting of the screenplay for a television program, based on the source work.

is adapted as video screenplay (work)
has unconstrained: P60187
lexical alias: adaptedAsVideoScreenplayWork.en
name: adaptedAsVideoScreenplayWork
status: Published
toolkit definition: A work consisting of the screenplay for a video, based on the source work.
toolkit label: adapted as video screenplay (work)
type: Property
domain: C10001
range: C10001
sub property of: P60187
sub property of: is adapted as screenplay (work)
inverse of: is video screenplay based on (work)
definition: Relates a work to a work consisting of the screenplay for a video, based on the source work.

is adapted as radio script (work)
has unconstrained: P60188
lexical alias: adaptedAsRadioScriptWork.en
name: adaptedAsRadioScriptWork
status: Published
toolkit definition: A work consisting of the script for a radio program, based on the source work.
toolkit label: adapted as radio script (work)
type: Property
domain: C10001
range: C10001
sub property of: P60188
sub property of: is adapted as (work)
inverse of: is radio script based on (work)
definition: Relates a work to a work consisting of the script for a radio program, based on the source work.

is freely translated as (work)
has unconstrained: P60189
lexical alias: freelyTranslatedAsWork.en
name: freelyTranslatedAsWork
status: Published
toolkit definition: A work created by freely translating the source work into another language, preserving the spirit of the original, but not its linguistic details.
toolkit label: freely translated as (work)
type: Property
domain: C10001
range: C10001
sub property of: P60189
sub property of: is derivative (work)
inverse of: is free translation of (work)
definition: Relates a work to a work created by freely translating the source work into another language, preserving the spirit of the original, but not its linguistic details.

is description of (work)
has subproperty: is analysis of (work)
has subproperty: is evaluation of (work)
has subproperty: is review of (work)
has subproperty: is critique of (work)
has subproperty: is commentary on (work)
has unconstrained: P60190
lexical alias: descriptionOfWork.en
name: descriptionOfWork
status: Published
toolkit definition: A work described by a describing work.
toolkit label: description of (work)
type: Property
domain: C10001
range: C10001
sub property of: P60190
sub property of: has subject (work)
inverse of: is described in (work)
definition: Relates a work to a work described by a describing work.

is subseries of
has unconstrained: P60192
lexical alias: subseriesOf.en
name: subseriesOf
status: Published
toolkit definition: A work in which the part consistently appears; the title of the larger work appears on all issues or parts of the subseries.
toolkit label: subseries of
type: Property
domain: C10001
range: C10001
sub property of: P60192
sub property of: is contained in (work)
inverse of: is subseries
definition: Relates a work to a work in which the part consistently appears; the title of the larger work appears on all issues or parts of the subseries.

is in series
has unconstrained: P60193
lexical alias: inSeries.en
name: inSeries
status: Published
toolkit definition: A work in which the part has been issued; the title of the larger work appears on the part.
toolkit label: in series
type: Property
domain: C10001
range: C10001
sub property of: P60193
sub property of: is contained in (work)
inverse of: is series container of
definition: Relates a work to a work in which the part has been issued; the title of the larger work appears on the part.

is complemented by (work)
has subproperty: is libretto for (work)
has subproperty: is screenplay for (work)
has subproperty: is screenplay (work)
has subproperty: is radio script (work)
has subproperty: is libretto (work)
has subproperty: is script for radio program (work)
has subproperty: is choreography (work)
has subproperty: is choreography for (work)
has unconstrained: P60198
lexical alias: complementedByWork.en
name: complementedByWork
status: Published
toolkit definition: A work paired with another work without either work being considered to predominate.
toolkit label: complemented by (work)
type: Property
domain: C10001
range: C10001
sub property of: P60198
sub property of: has accompanying work relationship with
definition: Relates a work to a work paired with another work without either work being considered to predominate.

is continued in part by (work)
has unconstrained: P60199
lexical alias: continuedInPartByWork.en
name: continuedInPartByWork
status: Published
toolkit definition: A work part of whose content separated from an earlier work to form a new work.
toolkit label: continued in part by (work)
type: Property
domain: C10001
range: C10001
sub property of: P60199
sub property of: is succeeded by (work)
inverse of: is separated from (work)
definition: Relates a work to a work part of whose content separated from an earlier work to form a new work.

is screenplay for (work)
has subproperty: is screenplay for motion picture (work)
has subproperty: is screenplay for television program (work)
has subproperty: is screenplay for video (work)
has unconstrained: P60201
lexical alias: screenplayForWork.en
name: screenplayForWork
status: Published
toolkit definition: A work such as a motion picture, television program, or video, that uses the text of the work as a screenplay.
toolkit label: screenplay for (work)
type: Property
domain: C10001
range: C10001
sub property of: P60201
sub property of: is complemented by (work)
inverse of: is screenplay (work)
definition: Relates a work to a work such as a motion picture, television program, or video, that uses the text of the work as a screenplay.

is incidental music for (work)
has unconstrained: P60202
lexical alias: incidentalMusicForWork.en
name: incidentalMusicForWork
status: Published
toolkit definition: A work such as a play or other spoken work for the stage that uses the musical work as incidental music.
toolkit label: incidental music for (work)
type: Property
domain: C10001
range: C10001
sub property of: P60202
inverse of: is incidental music (work)
definition: Relates a work to a work such as a play or other spoken work for the stage that uses the musical work as incidental music.

is abstracted as (work)
has unconstrained: P60203
lexical alias: abstractedAsWork.en
name: abstractedAsWork
status: Published
toolkit definition: A work that abbreviates the source work in a brief, objective manner.
toolkit label: abstracted as (work)
type: Property
domain: C10001
range: C10001
sub property of: P60203
sub property of: is derivative (work)
inverse of: is abstract of (work)
definition: Relates a work to a work that abbreviates the source work in a brief, objective manner.

is augmented by (work)
has subproperty: is cadenza (work)
has subproperty: is errata (work)
has subproperty: is illustrations (work)
has subproperty: is catalogue (work)
has subproperty: is concordance (work)
has subproperty: is addenda (work)
has subproperty: is appendix (work)
has subproperty: is guide (work)
has subproperty: is finding aid (work)
has subproperty: is index (work)
has subproperty: is supplement (work)
has unconstrained: P60204
lexical alias: augmentedByWork.en
name: augmentedByWork
status: Published
toolkit definition: A work that adds to the content of a predominant work.
toolkit label: augmented by (work)
type: Property
domain: C10001
range: C10001
sub property of: P60204
sub property of: has accompanying work relationship with
inverse of: is augmentation of (work)
definition: Relates a work to a work that adds to the content of a predominant work.

is summarized as (work)
has unconstrained: P60205
lexical alias: summarizedAsWork.en
name: summarizedAsWork
status: Published
toolkit definition: A work that consists of a brief recapitulation of the content of the source work.
toolkit label: summarized as (work)
type: Property
domain: C10001
range: C10001
sub property of: P60205
sub property of: is derivative (work)
inverse of: is summary of (work)
definition: Relates a work to a work that consists of a brief recapitulation of the content of the source work.

is catalogue (work)
has unconstrained: P60206
lexical alias: catalogueWork.en
name: catalogueWork
status: Published
toolkit definition: A work that consists of a complete enumeration of items arranged systematically.
toolkit label: catalogue (work)
type: Property
domain: C10001
range: C10001
sub property of: P60206
sub property of: is augmented by (work)
inverse of: is catalogue of (work)
definition: Relates a work to a work that consists of a complete enumeration of items arranged systematically.

is concordance (work)
has unconstrained: P60208
lexical alias: concordanceWork.en
name: concordanceWork
status: Published
toolkit definition: A work that consists of an index of all the words in the predominant work.
toolkit label: concordance (work)
type: Property
domain: C10001
range: C10001
sub property of: P60208
sub property of: is augmented by (work)
inverse of: is concordance to (work)
definition: Relates a work to a work that consists of an index of all the words in the predominant work.

is addenda (work)
has unconstrained: P60209
lexical alias: addendaWork.en
name: addendaWork
status: Published
toolkit definition: A work that consists of brief additional material, less extensive than a supplement, but essential to the completeness of the text of the predominant work; it is usually added at the end of the content, but is sometimes issued separately.
toolkit label: addenda (work)
type: Property
domain: C10001
range: C10001
sub property of: P60209
sub property of: is augmented by (work)
inverse of: is addenda to (work)
definition: Relates a work to a work that consists of brief additional material, less extensive than a supplement, but essential to the completeness of the text of the predominant work; it is usually added at the end of the content, but is sometimes issued separately.

is adapted as libretto (work)
has unconstrained: P60210
lexical alias: adaptedAsLibrettoWork.en
name: adaptedAsLibrettoWork
status: Published
toolkit definition: A work consisting of the text of an opera or other work for the musical stage, or an oratorio, based on the source work.
toolkit label: adapted as libretto (work)
type: Property
domain: C10001
range: C10001
sub property of: P60210
sub property of: is adapted as (work)
inverse of: is libretto based on (work)
definition: Relates a work to a work consisting of the text of an opera or other work for the musical stage, or an oratorio, based on the source work.

is reviewed in (work)
has unconstrained: P60211
lexical alias: reviewedInWork.en
name: reviewedInWork
status: Published
toolkit definition: A work that contains a brief evaluation of the described work.
toolkit label: reviewed in (work)
type: Property
domain: C10001
range: C10001
sub property of: P60211
sub property of: is described in (work)
inverse of: is review of (work)
definition: Relates a work to a work that contains a brief evaluation of the described work.

is critiqued in (work)
has unconstrained: P60212
lexical alias: critiquedInWork.en
name: critiquedInWork
status: Published
toolkit definition: A work that contains a critical evaluation of the described work.
toolkit label: critiqued in (work)
type: Property
domain: C10001
range: C10001
sub property of: P60212
sub property of: is described in (work)
inverse of: is critique of (work)
definition: Relates a work to a work that contains a critical evaluation of the described work.

is commentary in (work)
has unconstrained: P60213
lexical alias: commentaryInWork.en
name: commentaryInWork
status: Published
toolkit definition: A work that contains a set of explanatory or critical notes on the described work
toolkit label: commentary in (work)
type: Property
domain: C10001
range: C10001
sub property of: P60213
sub property of: is described in (work)
inverse of: is commentary on (work)
definition: Relates a work to a work that contains a set of explanatory or critical notes on the described work.

is imitated as (work)
has subproperty: is parodied as (work)
has unconstrained: P60214
lexical alias: imitatedAsWork.en
name: imitatedAsWork
status: Published
toolkit definition: A work that copies the style or content of the source work.
toolkit label: imitated as (work)
type: Property
domain: C10001
range: C10001
sub property of: P60214
sub property of: is derivative (work)
inverse of: is imitation of (work)
definition: Relates a work to a work that copies the style or content of the source work.

is described in (work)
has subproperty: is reviewed in (work)
has subproperty: is critiqued in (work)
has subproperty: is commentary in (work)
has subproperty: is evaluated in (work)
has subproperty: is analysed in (work)
has unconstrained: P60215
lexical alias: describedInWork.en
name: describedInWork
status: Published
toolkit definition: A work that describes a described work.
toolkit label: described in (work)
type: Property
domain: C10001
range: C10001
sub property of: P60215
sub property of: is subject of (work)
inverse of: is description of (work)
definition: Relates a work to a work that describes a described work.

is expanded as (work)
has unconstrained: P60216
lexical alias: expandedAsWork.en
name: expandedAsWork
status: Published
toolkit definition: A work that enlarges upon the content of the source work.
toolkit label: expanded as (work)
type: Property
domain: C10001
range: C10001
sub property of: P60216
sub property of: is derivative (work)
inverse of: is expanded version of (work)
definition: Relates a work to a work that enlarges upon the content of the source work.

is evaluated in (work)
has unconstrained: P60218
lexical alias: evaluatedInWork.en
name: evaluatedInWork
status: Published
toolkit definition: A work that examines or judges the described work.
toolkit label: evaluated in (work)
type: Property
domain: C10001
range: C10001
sub property of: P60218
sub property of: is described in (work)
inverse of: is evaluation of (work)
definition: Relates a work to a work that examines or judges the described work.

is analysed in (work)
has unconstrained: P60219
lexical alias: analysedInWork.en
name: analysedInWork
status: Published
toolkit definition: A work that examines the source work to identify its components and their relations.
toolkit label: analysed in (work)
type: Property
domain: C10001
range: C10001
sub property of: P60219
sub property of: is described in (work)
inverse of: is analysis of (work)
definition: Relates a work to a work that examines the source work to identify its components and their relations.

is prequel
has unconstrained: P60220
lexical alias: prequel.en
name: prequel
status: Published
toolkit definition: A work that extends the narrative of an earlier work backwards in time.
toolkit label: prequel
type: Property
domain: C10001
range: C10001
sub property of: P60220
sub property of: is preceded by (work)
inverse of: is prequel to
definition: Relates a work to a work that extends the narrative of an earlier work backwards in time.

is appendix (work)
has unconstrained: P60221
lexical alias: appendixWork.en
name: appendixWork
status: Published
toolkit definition: A work that forms an augmenting part of another work which is not essential to the completeness of the content, such as a list of references, statistical tables, and explanatory matter; it can either be material which comes at the end of the content of the predominant work, or be issued separately.
toolkit label: appendix (work)
type: Property
domain: C10001
range: C10001
sub property of: P60221
sub property of: is augmented by (work)
inverse of: is appendix to (work)
definition: Relates a work to a work that forms an augmenting part of another work which is not essential to the completeness of the content, such as a list of references, statistical tables, and explanatory matter; it can either be material which comes at the end of the content of the predominant work, or be issued separately.

is guide (work)
has unconstrained: P60222
lexical alias: guideWork.en
name: guideWork
status: Published
toolkit definition: A work that guides a user through the use of the predominant work, using notes, learning and study aids, exercises, problems, questions and answers, instructor or student materials, etc.
toolkit label: guide (work)
type: Property
domain: C10001
range: C10001
sub property of: P60222
sub property of: is augmented by (work)
inverse of: is guide to (work)
definition: Relates a work to a work that guides a user through the use of the predominant work, using notes, learning and study aids, exercises, problems, questions and answers, instructor or student materials, etc.

is abridgement of (work)
has unconstrained: P60223
lexical alias: abridgementOfWork.en
name: abridgementOfWork
status: Published
toolkit definition: A work that has been abridged, i.e., shortened without changing the general meaning or manner of presentation of the source work.
toolkit label: abridgement of (work)
type: Property
domain: C10001
range: C10001
sub property of: P60223
sub property of: is based on (work)
inverse of: is abridged as (work)
definition: Relates a work to a work that has been abridged, i.e., shortened without changing the general meaning or manner of presentation of the source work.

is abstract of (work)
has unconstrained: P60224
lexical alias: abstractOfWork.en
name: abstractOfWork
status: Published
toolkit definition: A work that has been abstracted, i.e., abbreviated in a brief, objective manner.
toolkit label: abstract of (work)
type: Property
domain: C10001
range: C10001
sub property of: P60224
sub property of: is based on (work)
inverse of: is abstracted as (work)
definition: Relates a work to a work that has been abstracted, i.e., abbreviated in a brief, objective manner.

is dramatization of (work)
has unconstrained: P60225
lexical alias: dramatizationOfWork.en
name: dramatizationOfWork
status: Published
toolkit definition: A work that has been adapted as a drama.
toolkit label: dramatization of (work)
type: Property
domain: C10001
range: C10001
sub property of: P60225
sub property of: is adaptation of (work)
inverse of: is dramatized as (work)
definition: Relates a work to a work that has been adapted as a drama.

is verse adaptation of (work)
has unconstrained: P60226
lexical alias: verseAdaptationOfWork.en
name: verseAdaptationOfWork
status: Published
toolkit definition: A work that has been adapted as a literary composition in verse form.
toolkit label: verse adaptation of (work)
type: Property
domain: C10001
range: C10001
sub property of: P60226
sub property of: is adaptation of (work)
inverse of: is adapted in verse as (work)
definition: Relates a work to a work that has been adapted as a literary composition in verse form.

is motion picture adaptation of (work)
has unconstrained: P60227
lexical alias: motionPictureAdaptationOfWork.en
name: motionPictureAdaptationOfWork
status: Published
toolkit definition: A work that has been adapted as a motion picture.
toolkit label: motion picture adaptation of (work)
type: Property
domain: C10001
range: C10001
sub property of: P60227
sub property of: is adaptation of (work)
inverse of: is adapted as motion picture (work)
definition: Relates a work to a work that has been adapted as a motion picture.

is novelization of (work)
has unconstrained: P60228
lexical alias: novelizationOfWork.en
name: novelizationOfWork
status: Published
toolkit definition: A work that has been adapted as a novel.
toolkit label: novelization of (work)
type: Property
domain: C10001
range: C10001
sub property of: P60228
sub property of: is adaptation of (work)
inverse of: is adapted as novel (work)
definition: Relates a work to a work that has been adapted as a novel.

is radio adaptation of (work)
has unconstrained: P60229
lexical alias: radioAdaptationOfWork.en
name: radioAdaptationOfWork
status: Published
toolkit definition: A work that has been adapted as a radio program.
toolkit label: radio adaptation of (work)
type: Property
domain: C10001
range: C10001
sub property of: P60229
sub property of: is adaptation of (work)
inverse of: is adapted as radio program (work)
definition: Relates a work to a work that has been adapted as a radio program.

is television adaptation of (work)
has unconstrained: P60230
lexical alias: televisionAdaptationOfWork.en
name: televisionAdaptationOfWork
status: Published
toolkit definition: A work that has been adapted as a television program.
toolkit label: television adaptation of (work)
type: Property
domain: C10001
range: C10001
sub property of: P60230
sub property of: is adaptation of (work)
inverse of: is adapted as television program (work)
definition: Relates a work to a work that has been adapted as a television program.

is screenplay based on (work)
has subproperty: is motion picture screenplay based on (work)
has subproperty: is television screenplay based on (work)
has subproperty: is video screenplay based on (work)
has unconstrained: P60231
lexical alias: screenplayBasedOnWork.en
name: screenplayBasedOnWork
status: Published
toolkit definition: A work that has been adapted as the screenplay for a motion picture, television program, or video.
toolkit label: screenplay based on (work)
type: Property
domain: C10001
range: C10001
sub property of: P60231
sub property of: is adaptation of (work)
inverse of: is adapted as screenplay (work)
definition: Relates a work to a work that has been adapted as the screenplay for a motion picture, television program, or video.

is motion picture screenplay based on (work)
has unconstrained: P60232
lexical alias: motionPictureScreenplayBasedOnWork.en
name: motionPictureScreenplayBasedOnWork
status: Published
toolkit definition: A work that has been adapted as the screenplay for a motion picture.
toolkit label: motion picture screenplay based on (work)
type: Property
domain: C10001
range: C10001
sub property of: P60232
sub property of: is screenplay based on (work)
inverse of: is adapted as motion picture screenplay (work)
definition: Relates a work to a work that has been adapted as the screenplay for a motion picture.

is television screenplay based on (work)
has unconstrained: P60233
lexical alias: televisionScreenplayBasedOnWork.en
name: televisionScreenplayBasedOnWork
status: Published
toolkit definition: A work that has been adapted as the screenplay for a television program.
toolkit label: television screenplay based on (work)
type: Property
domain: C10001
range: C10001
sub property of: P60233
sub property of: is screenplay based on (work)
inverse of: is adapted as television screenplay (work)
definition: Relates a work to a work that has been adapted as the screenplay for a television program.

is video screenplay based on (work)
has unconstrained: P60234
lexical alias: videoScreenplayBasedOnWork.en
name: videoScreenplayBasedOnWork
status: Published
toolkit definition: A work that has been adapted as the screenplay for a video.
toolkit label: video screenplay based on (work)
type: Property
domain: C10001
range: C10001
sub property of: P60234
sub property of: is screenplay based on (work)
inverse of: is adapted as video screenplay (work)
definition: Relates a work to a work that has been adapted as the screenplay for a video.

is radio script based on (work)
has unconstrained: P60235
lexical alias: radioScriptBasedOnWork.en
name: radioScriptBasedOnWork
status: Published
toolkit definition: A work that has been adapted as the script for a radio program.
toolkit label: radio script based on (work)
type: Property
domain: C10001
range: C10001
sub property of: P60235
sub property of: is adaptation of (work)
inverse of: is adapted as radio script (work)
definition: Relates a work to a work that has been adapted as the script for a radio program.

is video adaptation of (work)
has unconstrained: P60236
lexical alias: videoAdaptationOfWork.en
name: videoAdaptationOfWork
status: Published
toolkit definition: A work that has been adapted for video.
toolkit label: video adaptation of (work)
type: Property
domain: C10001
range: C10001
sub property of: P60236
sub property of: is adaptation of (work)
inverse of: is adapted as video (work)
definition: Relates a work to a work that has been adapted for video.

is digest of (work)
has unconstrained: P60238
lexical alias: digestOfWork.en
name: digestOfWork
status: Published
toolkit definition: A work that has been digested, i.e., systematically and comprehensively condensed.
toolkit label: digest of (work)
type: Property
domain: C10001
range: C10001
sub property of: P60238
sub property of: is based on (work)
inverse of: is digested as (work)
definition: Relates a work to a work that has been digested, i.e., systematically and comprehensively condensed.

is analysis of (work)
has unconstrained: P60239
lexical alias: analysisOfWork.en
name: analysisOfWork
status: Published
toolkit definition: A work that has been examined to identify its components and their relations.
toolkit label: analysis of (work)
type: Property
domain: C10001
range: C10001
sub property of: P60239
sub property of: is description of (work)
inverse of: is analysed in (work)
definition: Relates a work to a work that has been examined to identify its components and their relations.

is series container of
has unconstrained: P60240
lexical alias: seriesContainerOf.en
name: seriesContainerOf
status: Published
toolkit definition: A work that has been issued as part of a series.
toolkit label: series container of
type: Property
domain: C10001
range: C10001
sub property of: P60240
sub property of: is container of (work)
inverse of: is in series
definition: Relates a work to a work that has been issued as part of a series.

is adaptation of (work)
has subproperty: is dramatization of (work)
has subproperty: is verse adaptation of (work)
has subproperty: is motion picture adaptation of (work)
has subproperty: is novelization of (work)
has subproperty: is radio adaptation of (work)
has subproperty: is television adaptation of (work)
has subproperty: is screenplay based on (work)
has subproperty: is radio script based on (work)
has subproperty: is video adaptation of (work)
has subproperty: is musical theatre adaptation of (work)
has subproperty: is opera adaptation of (work)
has subproperty: is video game adaptation of (work)
has subproperty: is graphic novelization of (work)
has subproperty: is oratorio adaptation of (work)
has unconstrained: P60241
lexical alias: adaptationOfWork.en
name: adaptationOfWork
status: Published
toolkit definition: A work that has been modified for a purpose, use, or medium other than that for which it was originally intended.
toolkit label: adaptation of (work)
type: Property
domain: C10001
range: C10001
sub property of: P60241
sub property of: is based on (work)
inverse of: is adapted as (work)
definition: Relates a work to a work that has been modified for a purpose, use, or medium other than that for which it was originally intended.
scope note: Applies to changes in form or to works completely rewritten in the same form.

is free translation of (work)
has unconstrained: P60243
lexical alias: freeTranslationOfWork.en
name: freeTranslationOfWork
status: Published
toolkit definition: A work that has been translated freely, preserving the spirit of the original, but not its linguistic details.
toolkit label: free translation of (work)
type: Property
domain: C10001
range: C10001
sub property of: P60243
sub property of: is based on (work)
inverse of: is freely translated as (work)
definition: Relates a work to a work that has been translated freely, preserving the spirit of the original, but not its linguistic details.

is parodied as (work)
has unconstrained: P60246
lexical alias: parodiedAsWork.en
name: parodiedAsWork
status: Published
toolkit definition: A work that imitates the style or content of the source work for comic effect.
toolkit label: parodied as (work)
type: Property
domain: C10001
range: C10001
sub property of: P60246
sub property of: is imitated as (work)
inverse of: is parody of (work)
definition: Relates a work to a work that imitates the style or content of the source work for comic effect.

is absorbed by (work)
has unconstrained: P60247
lexical alias: absorbedByWork.en
name: absorbedByWork
status: Published
toolkit definition: A work that incorporates another work.
toolkit label: absorbed by (work)
type: Property
domain: C10001
range: C10001
sub property of: P60247
sub property of: is succeeded by (work)
inverse of: is absorption of (work)
definition: Relates a work to a work that incorporates another work.

is absorbed in part by (work)
has unconstrained: P60248
lexical alias: absorbedInPartByWork.en
name: absorbedInPartByWork
status: Published
toolkit definition: A work that incorporates part of the content of another work.
toolkit label: absorbed in part by (work)
type: Property
domain: C10001
range: C10001
sub property of: P60248
sub property of: is succeeded by (work)
inverse of: is absorption in part of (work)
definition: Relates a work to a work that incorporates part of the content of another work.

is container of (work)
has subproperty: is subseries
has subproperty: is series container of
has unconstrained: P60249
lexical alias: containerOfWork.en
name: containerOfWork
status: Published
toolkit definition: A work that is a discrete component of a larger work.
toolkit label: container of (work)
type: Property
domain: C10001
range: C10001
sub property of: P60249
sub property of: has whole-part work relationship with
inverse of: is contained in (work)
definition: Relates a work to a work that is a discrete component of a larger work.

is derivative (work)
has subproperty: is modified by variation as (work)
has subproperty: is remade as (work)
has subproperty: is set to music as (work)
has subproperty: is abstracted in (work)
has subproperty: is indexed in (work)
has subproperty: is adapted as choreography (work)
has subproperty: is freely translated as (work)
has subproperty: is abstracted as (work)
has subproperty: is summarized as (work)
has subproperty: is adapted as libretto (work)
has subproperty: is imitated as (work)
has subproperty: is expanded as (work)
has subproperty: is adapted as (work)
has subproperty: is paraphrased as (work)
has subproperty: is abridged as (work)
has subproperty: is digested as (work)
has subproperty: is based on (work)
has subproperty: is inspiration for
has unconstrained: P60250
lexical alias: derivativeWork.en
name: derivativeWork
status: Published
toolkit definition: A work that is a modification of a source work.
toolkit label: derivative (work)
type: Property
domain: C10001
range: C10001
sub property of: P60250
sub property of: has derivative work relationship with
inverse of: is based on (work)
definition: Relates a work to a work that is a modification of a source work.

is errata to (work)
has unconstrained: P60251
lexical alias: errataToWork.en
name: errataToWork
status: Published
toolkit definition: A work that is augmented by a list of errors in the predominant work, discovered after publication, with their corrections.
toolkit label: errata to (work)
type: Property
domain: C10001
range: C10001
sub property of: P60251
sub property of: is augmentation of (work)
inverse of: is errata (work)
definition: Relates a work to a work that is augmented by a list of errors in the predominant work, discovered after publication, with their corrections.

is guide to (work)
has unconstrained: P60252
lexical alias: guideToWork.en
name: guideToWork
status: Published
toolkit definition: A work that is augmented by another work consisting of material to help the user of the predominant work, such as notes, learning and study aids, exercises, problems, questions and answers, instructor or student materials, etc.
toolkit label: guide to (work)
type: Property
domain: C10001
range: C10001
sub property of: P60252
sub property of: is augmentation of (work)
inverse of: is guide (work)
definition: Relates a work to a work that is augmented by another work consisting of material to help the user of the predominant work, such as notes, learning and study aids, exercises, problems, questions and answers, instructor or student materials, etc.

is appendix to (work)
has unconstrained: P60253
lexical alias: appendixToWork.en
name: appendixToWork
status: Published
toolkit definition: A work that is augmented by another work that consists of material that is not essential to the completeness of the content, such as a list of references, statistical tables, and explanatory matter; the augmenting work can either come at the end of the content, or be issued separately.
toolkit label: appendix to (work)
type: Property
domain: C10001
range: C10001
sub property of: P60253
sub property of: is augmentation of (work)
inverse of: is appendix (work)
definition: Relates a work to a work that is augmented by another work that consists of material that is not essential to the completeness of the content, such as a list of references, statistical tables, and explanatory matter; the augmenting work can either come at the end of the content, or be issued separately.

is illustrations for (work)
has unconstrained: P60254
lexical alias: illustrationsForWork.en
name: illustrationsForWork
status: Published
toolkit definition: A work that is augmented by pictorial content designed to explain or decorate it.
toolkit label: illustrations for (work)
type: Property
domain: C10001
range: C10001
sub property of: P60254
sub property of: is augmentation of (work)
inverse of: is illustrations (work)
definition: Relates a work to a work that is augmented by pictorial content designed to explain or decorate it.

is evaluation of (work)
has unconstrained: P60255
lexical alias: evaluationOfWork.en
name: evaluationOfWork
status: Published
toolkit definition: A work that is examined or judged.
toolkit label: evaluation of (work)
type: Property
domain: C10001
range: C10001
sub property of: P60255
sub property of: is description of (work)
inverse of: is evaluated in (work)
definition: Relates a work to a work that is examined or judged.

is supplement to (work)
has unconstrained: P60259
lexical alias: supplementToWork.en
name: supplementToWork
status: Published
toolkit definition: A work that is updated or otherwise complemented by the augmenting work.
toolkit label: supplement to (work)
type: Property
domain: C10001
range: C10001
sub property of: P60259
sub property of: is augmentation of (work)
inverse of: is supplement (work)
definition: Relates a work to a work that is updated or otherwise complemented by the augmenting work.

is adapted as (work)
has subproperty: is dramatized as (work)
has subproperty: is adapted in verse as (work)
has subproperty: is adapted as motion picture (work)
has subproperty: is adapted as novel (work)
has subproperty: is adapted as radio program (work)
has subproperty: is adapted as television program (work)
has subproperty: is adapted as video (work)
has subproperty: is adapted as screenplay (work)
has subproperty: is adapted as radio script (work)
has subproperty: is adapted as musical theatre (work)
has subproperty: is adapted as opera (work)
has subproperty: is adapted as video game (work)
has subproperty: is adapted as graphic novel (work)
has subproperty: is adapted as oratorio (work)
has unconstrained: P60260
lexical alias: adaptedAsWork.en
name: adaptedAsWork
status: Published
toolkit definition: A work that modifies the source work for a purpose, use, or medium other than that for which it was originally intended.
toolkit label: adapted as (work)
type: Property
domain: C10001
range: C10001
sub property of: P60260
sub property of: is derivative (work)
inverse of: is adaptation of (work)
definition: Relates a work to a work that modifies the source work for a purpose, use, or medium other than that for which it was originally intended.
scope note: Applies to changes in form or to works completely rewritten in the same form.

is preceded by (work)
has subproperty: is prequel
has subproperty: is continuation in part of (work)
has subproperty: is separated from (work)
has subproperty: is replacement in part of (work)
has subproperty: is replacement of (work)
has subproperty: is merger of (work)
has subproperty: is absorption of (work)
has subproperty: is absorption in part of (work)
has subproperty: is continuation of (work)
has subproperty: is sequel to
has unconstrained: P60261
lexical alias: precededByWork.en
name: precededByWork
status: Published
toolkit definition: A work that precedes (e.g., is earlier in time or before in a narrative) the succeeding work.
toolkit label: preceded by (work)
type: Property
domain: C10001
range: C10001
sub property of: P60261
sub property of: has sequential work relationship with
inverse of: is succeeded by (work)
definition: Relates a work to a work that precedes (e.g., is earlier in time or before in a narrative) the succeeding work.

is finding aid (work)
has unconstrained: P60262
lexical alias: findingAidWork.en
name: findingAidWork
status: Published
toolkit definition: A work that provides a guide to the organization, arrangement, and contents of an archival collection.
toolkit label: finding aid (work)
type: Property
domain: C10001
range: C10001
sub property of: P60262
sub property of: is augmented by (work)
inverse of: is finding aid for (work)
definition: Relates a work to a work that provides a guide to the organization, arrangement, and contents of an archival collection.

is index (work)
has unconstrained: P60263
lexical alias: indexWork.en
name: indexWork
status: Published
toolkit definition: A work that provides a systematic, alphabetical guide to the contents of the predominant work, usually keyed to page numbers or other reference codes.
toolkit label: index (work)
type: Property
domain: C10001
range: C10001
sub property of: P60263
sub property of: is augmented by (work)
inverse of: is index to (work)
definition: Relates a work to a work that provides a systematic, alphabetical guide to the contents of the predominant work, usually keyed to page numbers or other reference codes.

is screenplay (work)
has subproperty: is motion picture screenplay (work)
has subproperty: is television screenplay (work)
has subproperty: is video screenplay (work)
has unconstrained: P60264
lexical alias: screenplayWork.en
name: screenplayWork
status: Published
toolkit definition: A work that provides the text for a motion picture, television program or video.
toolkit label: screenplay (work)
type: Property
domain: C10001
range: C10001
sub property of: P60264
sub property of: is complemented by (work)
inverse of: is screenplay for (work)
definition: Relates a work to a work that provides the text for a motion picture, television program or video.

is motion picture screenplay (work)
has unconstrained: P60265
lexical alias: motionPictureScreenplayWork.en
name: motionPictureScreenplayWork
status: Published
toolkit definition: A work that provides the text for a motion picture.
toolkit label: motion picture screenplay (work)
type: Property
domain: C10001
range: C10001
sub property of: P60265
sub property of: is screenplay (work)
inverse of: is screenplay for motion picture (work)
definition: Relates a work to a work that provides the text for a motion picture.

is musical setting of (work)
has unconstrained: P60266
lexical alias: musicalSettingOfWork.en
name: musicalSettingOfWork
status: Published
toolkit definition: A work that provides the text for a non-dramatic musical work, other than an oratorio.
toolkit label: musical setting of (work)
type: Property
domain: C10001
range: C10001
sub property of: P60266
sub property of: is based on (work)
inverse of: is set to music as (work)
definition: Relates a work to a work that provides the text for a non-dramatic musical work, other than an oratorio.

is radio script (work)
has unconstrained: P60267
lexical alias: radioScriptWork.en
name: radioScriptWork
status: Published
toolkit definition: A work that provides the text for a radio program.
toolkit label: radio script (work)
type: Property
domain: C10001
range: C10001
sub property of: P60267
sub property of: is complemented by (work)
inverse of: is script for radio program (work)
definition: Relates a work to a work that provides the text for a radio program.

is television screenplay (work)
has unconstrained: P60268
lexical alias: televisionScreenplayWork.en
name: televisionScreenplayWork
status: Published
toolkit definition: A work that provides the text for a television program.
toolkit label: television screenplay (work)
type: Property
domain: C10001
range: C10001
sub property of: P60268
sub property of: is screenplay (work)
inverse of: is screenplay for television program (work)
definition: Relates a work to a work that provides the text for a television program.

is video screenplay (work)
has unconstrained: P60269
lexical alias: videoScreenplayWork.en
name: videoScreenplayWork
status: Published
toolkit definition: A work that provides the text for a video.
toolkit label: video screenplay (work)
type: Property
domain: C10001
range: C10001
sub property of: P60269
sub property of: is screenplay (work)
inverse of: is screenplay for video (work)
definition: Relates a work to a work that provides the text for a video.

is libretto (work)
has unconstrained: P60270
lexical alias: librettoWork.en
name: librettoWork
status: Published
toolkit definition: A work that provides the text of an opera or other work for the musical stage, or an oratorio.
toolkit label: libretto (work)
type: Property
domain: C10001
range: C10001
sub property of: P60270
sub property of: is complemented by (work)
inverse of: is libretto for (work)
definition: Relates a work to a work that provides the text of an opera or other work for the musical stage, or an oratorio.

is paraphrased as (work)
has unconstrained: P60273
lexical alias: paraphrasedAsWork.en
name: paraphrasedAsWork
status: Published
toolkit definition: A work that restates the content of the source work in a different form.
toolkit label: paraphrased as (work)
type: Property
domain: C10001
range: C10001
sub property of: P60273
sub property of: is derivative (work)
inverse of: is paraphrase of (work)
definition: Relates a work to a work that restates the content of the source work in a different form.

is abridged as (work)
has unconstrained: P60275
lexical alias: abridgedAsWork.en
name: abridgedAsWork
status: Published
toolkit definition: A work that shortens the source work without changing the general meaning or manner of presentation.
toolkit label: abridged as (work)
type: Property
domain: C10001
range: C10001
sub property of: P60275
sub property of: is derivative (work)
inverse of: is abridgement of (work)
definition: Relates a work to a work that shortens the source work without changing the general meaning or manner of presentation.

is continuation in part of (work)
has unconstrained: P60276
lexical alias: continuationInPartOfWork.en
name: continuationInPartOfWork
status: Published
toolkit definition: A work that split into two or more separate works with new titles.
toolkit label: continuation in part of (work)
type: Property
domain: C10001
range: C10001
sub property of: P60276
sub property of: is preceded by (work)
inverse of: is split into (work)
definition: Relates a work to a work that split into two or more separate works with new titles.

is separated from (work)
has unconstrained: P60277
lexical alias: separatedFromWork.en
name: separatedFromWork
status: Published
toolkit definition: A work that spun off a part of its content to form a new work.
toolkit label: separated from (work)
type: Property
domain: C10001
range: C10001
sub property of: P60277
sub property of: is preceded by (work)
inverse of: is continued in part by (work)
definition: Relates a work to a work that spun off a part of its content to form a new work.

is succeeded by (work)
has subproperty: is sequel
has subproperty: is replaced in part by (work)
has subproperty: is replaced by (work)
has subproperty: is continued in part by (work)
has subproperty: is absorbed by (work)
has subproperty: is absorbed in part by (work)
has subproperty: is continued by (work)
has subproperty: is prequel to
has subproperty: is split into (work)
has subproperty: is merged to form (work)
has unconstrained: P60278
lexical alias: succeededByWork.en
name: succeededByWork
status: Published
toolkit definition: A work that succeeds (e.g., later in time or after in a narrative) the preceding work.
toolkit label: succeeded by (work)
type: Property
domain: C10001
range: C10001
sub property of: P60278
sub property of: has sequential work relationship with
inverse of: is preceded by (work)
definition: Relates a work to a work that succeeds (e.g., later in time or after in a narrative) the preceding work.

is digested as (work)
has unconstrained: P60279
lexical alias: digestedAsWork.en
name: digestedAsWork
status: Published
toolkit definition: A work that systematically and comprehensively condenses the source work.
toolkit label: digested as (work)
type: Property
domain: C10001
range: C10001
sub property of: P60279
sub property of: is derivative (work)
inverse of: is digest of (work)
definition: Relates a work to a work that systematically and comprehensively condenses the source work.

is supplement (work)
has unconstrained: P60281
lexical alias: supplementWork.en
name: supplementWork
status: Published
toolkit definition: A work that updates or otherwise complements the predominant work.
toolkit label: supplement (work)
type: Property
domain: C10001
range: C10001
sub property of: P60281
sub property of: is augmented by (work)
inverse of: is supplement to (work)
definition: Relates a work to a work that updates or otherwise complements the predominant work.

is screenplay for motion picture (work)
has unconstrained: P60282
lexical alias: screenplayForTheMotionPictureWork.en
name: screenplayForTheMotionPictureWork
status: Published
toolkit definition: A work that uses the text as a screenplay for a motion picture.
toolkit label: screenplay for motion picture (work)
type: Property
domain: C10001
range: C10001
sub property of: P60282
sub property of: is screenplay for (work)
inverse of: is motion picture screenplay (work)
definition: Relates a work to a work that uses the text as a screenplay for a motion picture.

is screenplay for television program (work)
has unconstrained: P60283
lexical alias: screenplayForTheTelevisionProgramWork.en
name: screenplayForTheTelevisionProgramWork
status: Published
toolkit definition: A work that uses the text as a screenplay for a television program.
toolkit label: screenplay for television program (work)
type: Property
domain: C10001
range: C10001
sub property of: P60283
sub property of: is screenplay for (work)
inverse of: is television screenplay (work)
definition: Relates a work to a work that uses the text as a screenplay for a television program.

is screenplay for video (work)
has unconstrained: P60284
lexical alias: screenplayForTheVideoWork.en
name: screenplayForTheVideoWork
status: Published
toolkit definition: A work that uses the text as a screenplay for a video.
toolkit label: screenplay for video (work)
type: Property
domain: C10001
range: C10001
sub property of: P60284
sub property of: is screenplay for (work)
inverse of: is video screenplay (work)
definition: Relates a work to a work that uses the text as a screenplay for a video.

is script for radio program (work)
has unconstrained: P60285
lexical alias: scriptForTheRadioProgramWork.en
name: scriptForTheRadioProgramWork
status: Published
toolkit definition: A work that uses the text as the script for a radio program.
toolkit label: script for radio program (work)
type: Property
domain: C10001
range: C10001
sub property of: P60285
sub property of: is complemented by (work)
inverse of: is radio script (work)
definition: Relates a work to a work that uses the text as the script for a radio program.

is addenda to (work)
has unconstrained: P60286
lexical alias: addendaToWork.en
name: addendaToWork
status: Published
toolkit definition: A work to which is added brief additional material, less extensive than a supplement, but essential to the completeness of the content of the work; it is usually added at the end of the work, but is sometimes issued separately.
toolkit label: addenda to (work)
type: Property
domain: C10001
range: C10001
sub property of: P60286
sub property of: is augmentation of (work)
inverse of: is addenda (work)
definition: Relates a work to a work to which is added brief additional material, less extensive than a supplement, but essential to the completeness of the content of the work; it is usually added at the end of the work, but is sometimes issued separately.

is review of (work)
has unconstrained: P60288
lexical alias: reviewOfWork.en
name: reviewOfWork
status: Published
toolkit definition: A work used as the basis for a brief evaluation.
toolkit label: review of (work)
type: Property
domain: C10001
range: C10001
sub property of: P60288
sub property of: is description of (work)
inverse of: is reviewed in (work)
definition: Relates a work to a work used as the basis for a brief evaluation.

is summary of (work)
has unconstrained: P60289
lexical alias: summaryOfWork.en
name: summaryOfWork
status: Published
toolkit definition: A work used as the basis for a brief recapitulation of its content.
toolkit label: summary of (work)
type: Property
domain: C10001
range: C10001
sub property of: P60289
sub property of: is based on (work)
inverse of: is summarized as (work)
definition: Relates a work to a work used as the basis for a brief recapitulation of its content.

is catalogue of (work)
has unconstrained: P60290
lexical alias: catalogueOfWork.en
name: catalogueOfWork
status: Published
toolkit definition: A work used as the basis for a catalogue, i.e., a complete enumeration of items arranged systematically.
toolkit label: catalogue of (work)
type: Property
domain: C10001
range: C10001
sub property of: P60290
sub property of: is augmentation of (work)
inverse of: is catalogue (work)
definition: Relates a work to a work used as the basis for a catalogue, i.e., a complete enumeration of items arranged systematically.

is concordance to (work)
has unconstrained: P60291
lexical alias: concordanceToWork.en
name: concordanceToWork
status: Published
toolkit definition: A work used as the basis for a concordance, i.e. an index of all the words in the predominant work.
toolkit label: concordance to (work)
type: Property
domain: C10001
range: C10001
sub property of: P60291
sub property of: is augmentation of (work)
inverse of: is concordance (work)
definition: Relates a work to a work used as the basis for a concordance, i.e. an index of all the words in the predominant work.

is critique of (work)
has unconstrained: P60292
lexical alias: critiqueOfWork.en
name: critiqueOfWork
status: Published
toolkit definition: A work used as the basis for a critical evaluation.
toolkit label: critique of (work)
type: Property
domain: C10001
range: C10001
sub property of: P60292
sub property of: is description of (work)
inverse of: is critiqued in (work)
definition: Relates a work to a work used as the basis for a critical evaluation.

is choreographic adaptation of (work)
has unconstrained: P60293
lexical alias: choreographicAdaptationOfWork.en
name: choreographicAdaptationOfWork
status: Published
toolkit definition: A work used that has been adapted as a work consisting of movement (e.g., dance).
toolkit label: choreographic adaptation of (work)
type: Property
domain: C10001
range: C10001
sub property of: P60293
sub property of: is adaptation of (work)
inverse of: is adapted as choreography (work)
definition: Relates a work to a work that has been adapted as a work consisting of movement (e.g., dance).

is expanded version of (work)
has unconstrained: P60294
lexical alias: expandedVersionOfWork.en
name: expandedVersionOfWork
status: Published
toolkit definition: A work used as the basis for a derivative work that enlarges upon the content of the source work.
toolkit label: expanded version of (work)
type: Property
domain: C10001
range: C10001
sub property of: P60294
sub property of: is based on (work)
inverse of: is expanded as (work)
definition: Relates a work to a work used as the basis for a derivative work that enlarges upon the content of the source work.

is remake of (work)
has unconstrained: P60295
lexical alias: remakeOfWork.en
name: remakeOfWork
status: Published
toolkit definition: A work used as the basis for a new motion picture, radio program, television program, or video.
toolkit label: remake of (work)
type: Property
domain: C10001
range: C10001
sub property of: P60295
sub property of: is based on (work)
inverse of: is remade as (work)
definition: Relates a work to a work used as the basis for a new motion picture, radio program, television program, or video.

is paraphrase of (work)
has unconstrained: P60296
lexical alias: paraphraseOfWork.en
name: paraphraseOfWork
status: Published
toolkit definition: A work used as the basis for a paraphrase, i.e., a restating of the content of the source work in a different form.
toolkit label: paraphrase of (work)
type: Property
domain: C10001
range: C10001
sub property of: P60296
sub property of: is based on (work)
inverse of: is paraphrased as (work)
definition: Relates a work to a work used as the basis for a paraphrase, i.e., a restating of the content of the source work in a different form.

is commentary on (work)
has unconstrained: P60298
lexical alias: commentaryOnWork.en
name: commentaryOnWork
status: Published
toolkit definition: A work used as the basis for a set of explanatory or critical notes.
toolkit label: commentary on (work)
type: Property
domain: C10001
range: C10001
sub property of: P60298
sub property of: is description of (work)
inverse of: is commentary in (work)
definition: Relates a work to a work used as the basis for a set of explanatory or critical notes.

is index to (work)
has unconstrained: P60302
lexical alias: indexToWork.en
name: indexToWork
status: Published
toolkit definition: A work used as the basis for an index, i.e., a systematic, alphabetical guide to the contents of the predominant work, usually keyed to page numbers or other reference codes.
toolkit label: index to (work)
type: Property
domain: C10001
range: C10001
sub property of: P60302
sub property of: is augmentation of (work)
inverse of: is index (work)
definition: Relates a work to a work used as the basis for an index, i.e., a systematic, alphabetical guide to the contents of the predominant work, usually keyed to page numbers or other reference codes.

is libretto based on (work)
has unconstrained: P60304
lexical alias: librettoBasedOnWork.en
name: librettoBasedOnWork
status: Published
toolkit definition: A work used as the basis for the text of an opera or other work for the musical stage, or an oratorio.
toolkit label: libretto based on (work)
type: Property
domain: C10001
range: C10001
sub property of: P60304
sub property of: is adaptation of (work)
inverse of: is adapted as libretto (work)
definition: Relates a work to a work that has been adapted as the text of an opera or other work for the musical stage, or an oratorio.

is based on (work)
has subproperty: is variations based on (work)
has subproperty: is abridgement of (work)
has subproperty: is abstract of (work)
has subproperty: is digest of (work)
has subproperty: is adaptation of (work)
has subproperty: is free translation of (work)
has subproperty: is musical setting of (work)
has subproperty: is summary of (work)
has subproperty: is choreographic adaptation of (work)
has subproperty: is expanded version of (work)
has subproperty: is remake of (work)
has subproperty: is paraphrase of (work)
has subproperty: is libretto based on (work)
has subproperty: is abstracts for (work)
has subproperty: is indexing for (work)
has subproperty: is imitation of (work)
has subproperty: is inspired by
has unconstrained: P60305
lexical alias: basedOnWork.en
name: basedOnWork
status: Published
toolkit definition: A work used as the source for a derivative work.
toolkit label: based on (work)
type: Property
domain: C10001
range: C10001
sub property of: P60305
sub property of: has derivative work relationship with
inverse of: is derivative (work)
definition: Relates a work to a work used as the source for a derivative work.

is continued by (work)
has unconstrained: P60306
lexical alias: continuedByWork.en
name: continuedByWork
status: Published
toolkit definition: A work whose content continues an earlier work.
toolkit label: continued by (work)
type: Property
domain: C10001
range: C10001
sub property of: P60306
sub property of: is succeeded by (work)
inverse of: is continuation of (work)
definition: Relates a work to a work whose content continues an earlier work.

is augmentation of (work)
has subproperty: is cadenza composed for (work)
has subproperty: is errata to (work)
has subproperty: is guide to (work)
has subproperty: is appendix to (work)
has subproperty: is illustrations for (work)
has subproperty: is supplement to (work)
has subproperty: is addenda to (work)
has subproperty: is catalogue of (work)
has subproperty: is concordance to (work)
has subproperty: is index to (work)
has subproperty: is finding aid for (work)
has unconstrained: P60307
lexical alias: augmentationOfWork.en
name: augmentationOfWork
status: Published
toolkit definition: A work whose content is added to by another work.
toolkit label: augmentation of (work)
type: Property
domain: C10001
range: C10001
sub property of: P60307
sub property of: has accompanying work relationship with
inverse of: is augmented by (work)
definition: Relates a work to a work whose content is added to by another work.

is abstracts for (work)
has unconstrained: P60308
lexical alias: abstractsForWork.en
name: abstractsForWork
status: Published
toolkit definition: A work whose contents have been abstracted by an abstracting and indexing service.
toolkit label: abstracts for (work)
type: Property
domain: C10001
range: C10001
sub property of: P60308
sub property of: is based on (work)
inverse of: is abstracted in (work)
definition: Relates a work to a work whose contents have been abstracted by an abstracting and indexing service.

is indexing for (work)
has unconstrained: P60309
lexical alias: indexingForWork.en
name: indexingForWork
status: Published
toolkit definition: A work whose contents have been indexed by an abstracting and indexing service.
toolkit label: indexing for (work)
type: Property
domain: C10001
range: C10001
sub property of: P60309
sub property of: is based on (work)
inverse of: is indexed in (work)
definition: Relates a work to a work whose contents have been indexed by an abstracting and indexing service.

is prequel to
has unconstrained: P60310
lexical alias: prequelTo.en
name: prequelTo
status: Published
toolkit definition: A work whose narrative is extended backwards in time by the later work.
toolkit label: prequel to
type: Property
domain: C10001
range: C10001
sub property of: P60310
sub property of: is succeeded by (work)
inverse of: is prequel
definition: Relates a work to a work whose narrative is extended backwards in time by the later work.

is imitation of (work)
has subproperty: is parody of (work)
has unconstrained: P60311
lexical alias: imitationOfWork.en
name: imitationOfWork
status: Published
toolkit definition: A work whose style or content is copied in a derivative work.
toolkit label: imitation of (work)
type: Property
domain: C10001
range: C10001
sub property of: P60311
sub property of: is based on (work)
inverse of: is imitated as (work)
definition: Relates a work to a work whose style or content is copied in a derivative work.

is parody of (work)
has unconstrained: P60312
lexical alias: parodyOfWork.en
name: parodyOfWork
status: Published
toolkit definition: A work whose style or content is imitated for comic effect.
toolkit label: parody of (work)
type: Property
domain: C10001
range: C10001
sub property of: P60312
sub property of: is imitation of (work)
inverse of: is parodied as (work)
definition: Relates a work to a work whose style or content is imitated for comic effect.

has related work
has subproperty: has accompanying work relationship with
has subproperty: has derivative work relationship with
has subproperty: has whole-part work relationship with
has subproperty: has referential work relationship with
has unconstrained: P60313
lexical alias: relatedWork.en
name: relatedWork
status: Published
instruction number: 25.1
toolkit definition: A work, represented by an identifier, an authorized access point, or a description, that is related to the work being described (e.g., an adaptation, commentary, supplement, sequel, part of a larger work).
toolkit label: related work
type: Property
domain: C10001
range: C10001
sub property of: P60313
definition: Relates a work to a work, represented by an identifier, an authorized access point, or a description, that is related to the work being described (e.g., an adaptation, commentary, supplement, sequel, part of a larger work).

has epoch
has unconstrained: P60472
lexical alias: epoch.en
name: epoch
status: Published
instruction number: 7.6
toolkit definition: An arbitrary moment in time to which measurements of position for a body or orientation for an orbit are referred.
toolkit label: epoch
type: Property
domain: C10001
sub property of: P60472
definition: Relates a work to an arbitrary moment in time to which measurements of position for a body or orientation for an orbit are referred.

has landscape architect
has unconstrained: P60473
lexical alias: landscapeArchitect.en
name: landscapeArchitect
status: Published
toolkit definition: An architect responsible for creating landscape works.
toolkit label: landscape architect
type: Property
domain: C10001
range: C10002
sub property of: P60473
sub property of: has architect
inverse of: P50221
definition: Relates a work to an architect responsible for creating landscape works.

is finding aid for (work)
has unconstrained: P60474
lexical alias: findingAidForWork.en
name: findingAidForWork
status: Published
toolkit definition: An archival collection that is described in a finding aid, i.e., a guide to the organization, arrangement, and contents of the collection.
toolkit label: finding aid for (work)
type: Property
domain: C10001
range: C10001
sub property of: P60474
sub property of: is augmentation of (work)
inverse of: is finding aid (work)
definition: Relates a work to an archival collection that is described in a finding aid, i.e., a guide to the organization, arrangement, and contents of the collection.

has sculptor
has unconstrained: P60475
lexical alias: sculptor.en
name: sculptor
status: Published
toolkit definition: An artist responsible for creating a three-dimensional work by modeling, carving, or similar technique.
toolkit label: sculptor
type: Property
domain: C10001
range: C10002
sub property of: P60475
sub property of: has artist
inverse of: P50222
definition: Relates a work to an artist responsible for creating a three-dimensional work by modeling, carving, or similar technique.

has screenwriter
has unconstrained: P60476
lexical alias: screenwriter.en
name: screenwriter
status: Published
toolkit definition: An author of a screenplay, script, or scene.
toolkit label: screenwriter
type: Property
domain: C10001
range: C10002
sub property of: P60476
sub property of: has author
inverse of: P50223
definition: Relates a work to an author of a screenplay, script, or scene.

has lyricist
has unconstrained: P60477
lexical alias: lyricist.en
name: lyricist
status: Published
toolkit definition: An author of the words of a popular song, including a song or songs from a musical.
toolkit label: lyricist
type: Property
domain: C10001
range: C10002
sub property of: P60477
sub property of: has author
inverse of: P50224
definition: Relates a work to an author of the words of a popular song, including a song or songs from a musical.

has librettist
has unconstrained: P60478
lexical alias: librettist.en
name: librettist
status: Published
toolkit definition: An author of the words of an opera or other musical stage work, or an oratorio.
toolkit label: librettist
type: Property
domain: C10001
range: C10002
sub property of: P60478
sub property of: has author
inverse of: P50225
definition: Relates a work to an author of the words of an opera or other musical stage work, or an oratorio.

is replacement in part of (work)
has unconstrained: P60479
lexical alias: replacementInPartOfWork.en
name: replacementInPartOfWork
status: Published
toolkit definition: An earlier work whose content has been partially replaced by a later work, usually because the later work contains updated or new information that makes the earlier work obsolete.
toolkit label: replacement in part of (work)
type: Property
domain: C10001
range: C10001
sub property of: P60479
sub property of: is preceded by (work)
inverse of: is replaced in part by (work)
definition: Relates a work to an earlier work whose content has been partially replaced by a later work, usually because the later work contains updated or new information that makes the earlier work obsolete.

is replacement of (work)
has unconstrained: P60480
lexical alias: replacementOfWork.en
name: replacementOfWork
status: Published
toolkit definition: An earlier work whose content has been replaced by a later work, usually because the later work contains updated or new information that makes the earlier work obsolete.
toolkit label: replacement of (work)
type: Property
domain: C10001
range: C10001
sub property of: P60480
sub property of: is preceded by (work)
inverse of: is replaced by (work)
definition: Relates a work to an earlier work whose content has been replaced by a later work, usually because the later work contains updated or new information that makes the earlier work obsolete.

has granting institution or faculty
has unconstrained: P60483
lexical alias: grantingInstitutionOrFaculty.en
name: grantingInstitutionOrFaculty
status: Published
instruction number: 7.9.3
toolkit definition: An institution or faculty conferring an academic degree on a candidate.
toolkit label: granting institution or faculty
type: Property
domain: C10001
sub property of: P60483
definition: Relates a work to an institution or faculty conferring an academic degree on a candidate.

has dissertation or thesis information
has unconstrained: P60489
lexical alias: dissertationOrThesisInformation.en
name: dissertationOrThesisInformation
status: Published
instruction number: 7.9
toolkit definition: Information about a work presented as part of the formal requirements for an academic degree.
toolkit label: dissertation or thesis information
type: Property
domain: C10001
sub property of: P60489
definition: Relates a work to information about a work presented as part of the formal requirements for an academic degree.

has history of the work
has unconstrained: P60491
lexical alias: historyOfTheWork.en
name: historyOfTheWork
status: Published
instruction number: 6.7
toolkit definition: Information about the history of a work.
toolkit label: history of the work
type: Property
domain: C10001
sub property of: P60491
definition: Relates a work to information about the history of a work.

is split into (work)
has unconstrained: P60503
lexical alias: splitIntoWork.en
name: splitIntoWork
status: Published
toolkit definition: One of two or more works resulting from the division of an earlier work into separate works.
toolkit label: split into (work)
type: Property
domain: C10001
range: C10001
sub property of: P60503
sub property of: is succeeded by (work)
inverse of: is continuation in part of (work)
definition: Relates a work to one of two or more works resulting from the division of an earlier work into separate works.

is merged to form (work)
has unconstrained: P60504
lexical alias: mergedToFormWork.en
name: mergedToFormWork
status: Published
toolkit definition: A work formed from the coming together of two or more works.
toolkit label: merged to form (work)
type: Property
domain: C10001
range: C10001
sub property of: P60504
sub property of: is succeeded by (work)
inverse of: is merger of (work)
definition: Relates a work to a work formed from the coming together of two or more works.

is merger of (work)
has unconstrained: P60505
lexical alias: mergerOfWork.en
name: mergerOfWork
status: Published
toolkit definition: A work that came together with one or more other works to form the new work.
toolkit label: merger of (work)
type: Property
domain: C10001
range: C10001
sub property of: P60505
sub property of: is preceded by (work)
inverse of: is merged to form (work)
definition: Relates a work to a work that came together with one or more other works to form the new work.

has equinox
has unconstrained: P60506
lexical alias: equinox.en
name: equinox
status: Published
instruction number: 7.5
toolkit definition: One of two points of intersection of the ecliptic and the celestial equator, occupied by the sun when its declination is 0�.
toolkit label: equinox
type: Property
domain: C10001
sub property of: P60506
definition: Relates a work to one of two points of intersection of the ecliptic and the celestial equator, occupied by the sun when its declination is 0°.

has year degree granted
has unconstrained: P60514
lexical alias: yearDegreeGranted.en
name: yearDegreeGranted
status: Published
instruction number: 7.9.4
toolkit definition: The calendar year in which a granting institution or faculty conferred an academic degree on a candidate.
toolkit label: year degree granted
type: Property
domain: C10001
sub property of: P60514
definition: Relates a work to the calendar year in which a granting institution or faculty conferred an academic degree on a candidate.

has coverage of the content
has unconstrained: P60518
lexical alias: coverageOfTheContent.en
name: coverageOfTheContent
status: Published
instruction number: 7.3
toolkit definition: The chronological or geographic coverage of the content of a resource.
toolkit label: coverage of the content
type: Property
domain: C10001
sub property of: P60518
definition: Relates a work to the chronological or geographic coverage of the content of a resource.

has intended audience
has unconstrained: P60520
lexical alias: intendedAudience.en
name: intendedAudience
status: Published
instruction number: 7.7
toolkit definition: The class of user for which the content of a resource is intended, or for whom the content is considered suitable.
toolkit label: intended audience
type: Property
domain: C10001
sub property of: P60520
definition: Relates a work to the class of user for which the content of a resource is intended, or for whom the content is considered suitable.
scope note: The class of user is defined by age group (e.g., children, young adults, adults), educational level (e.g., primary, secondary), type of disability, or another categorization.

has place of origin of the work
has unconstrained: P60523
lexical alias: placeOfOriginOfTheWork.en
name: placeOfOriginOfTheWork
status: Published
instruction number: 6.5
toolkit definition: The country or other territorial jurisdiction from which a work originated.
toolkit label: place of origin of the work
type: Property
domain: C10001
sub property of: P60523
definition: Relates a work to the country or other territorial jurisdiction from which a work originated.

has date of work
has unconstrained: P60527
lexical alias: dateOfWork.en
name: dateOfWork
status: Published
instruction number: 6.4
toolkit definition: The earliest date associated with a work.
toolkit label: date of work
type: Property
domain: C10001
sub property of: P60527
definition: Relates a work to the earliest date associated with a work.

has medium of performance
has unconstrained: P60536
lexical alias: mediumOfPerformance.en
name: mediumOfPerformance
status: Published
instruction number: 6.15
toolkit definition: The instrument, instruments, voice, voices, etc., for which a musical work was originally conceived.
toolkit label: medium of performance
type: Property
domain: C10001
sub property of: P60536
definition: Relates a work to the instrument, instruments, voice, voices, etc., for which a musical work was originally conceived.

has key
has unconstrained: P60580
lexical alias: key.en
name: key
status: Published
instruction number: 6.17
toolkit definition: The set of pitch relationships that establishes the tonal centre, or principal tonal centre, of a musical work.
toolkit label: key
type: Property
domain: C10001
sub property of: P60580
definition: Relates a work to the set of pitch relationships that establishes the tonal centre, or principal tonal centre, of a musical work.
scope note: Key is indicated by its pitch name and its mode, when it is major or minor.

has nature of the content
has unconstrained: P60584
lexical alias: natureOfTheContent.en
name: natureOfTheContent
status: Published
instruction number: 7.2
toolkit definition: The specific character of the primary content of a resource (e.g., legal articles, interim report).
toolkit label: nature of the content
type: Property
domain: C10001
sub property of: P60584
definition: Relates a work to the specific character of the primary content of a resource (e.g., legal articles, interim report).

has preferred title for the work
has unconstrained: P60588
lexical alias: preferredTitleForTheWork.en
name: preferredTitleForTheWork
status: Published
instruction number: 6.2.2
toolkit definition: The title or form of title chosen to identify the work.
toolkit label: preferred title for the work
type: Property
domain: C10001
sub property of: P60588
sub property of: has title of the work
definition: Relates a work to the title or form of title chosen to identify the work.
scope note: The preferred title is also the basis for the authorized access point representing that work.

is absorption of (work)
has unconstrained: P60574
lexical alias: absorptionOfWork.en
name: absorptionOfWork
status: Published
toolkit definition: The work that has been incorporated into another work.
toolkit label: absorption of (work)
type: Property
domain: C10001
range: C10001
sub property of: P60574
sub property of: is preceded by (work)
inverse of: is absorbed by (work)
definition: Relates a work to the work that has been incorporated into another work.

is absorption in part of (work)
has unconstrained: P60575
lexical alias: absorptionInPartOfWork.en
name: absorptionInPartOfWork
status: Published
toolkit definition: The work that has been partially incorporated into another work.
toolkit label: absorption in part of (work)
type: Property
domain: C10001
range: C10001
sub property of: P60575
sub property of: is preceded by (work)
inverse of: is absorbed in part by (work)
definition: Relates a work to the work that has been partially incorporated into another work.

is continuation of (work)
has unconstrained: P60576
lexical alias: continuationOfWork.en
name: continuationOfWork
status: Published
toolkit definition: The work that is continued by the content of a later work.
toolkit label: continuation of (work)
type: Property
domain: C10001
range: C10001
sub property of: P60576
sub property of: is preceded by (work)
inverse of: is continued by (work)
definition: Relates a work to the work that is continued by the content of a later work.

is sequel to
has unconstrained: P60577
lexical alias: sequelTo.en
name: sequelTo
status: Published
toolkit definition: The work whose narrative is continued by the later work.
toolkit label: sequel to
type: Property
domain: C10001
range: C10001
sub property of: P60577
sub property of: is preceded by (work)
inverse of: is sequel
definition: Relates a work to the work whose narrative is continued by the later work.

has accompanying work relationship with
has subproperty: is complemented by (work)
has subproperty: is augmented by (work)
has subproperty: is augmentation of (work)
has unconstrained: P60709
lexical alias: accompanyingWorkRelationship.en
name: accompanyingWorkRelationship
status: Published
toolkit definition: A work that is an augmentation of, or is augmented by, or is complemented by the work.
toolkit label: accompanying work relationship
type: Property
domain: C10001
range: C10001
sub property of: P60709
sub property of: has related work
definition: Relates a work to a work that is an augmentation of, or is augmented by, or is complemented by the work.
scope note: Accompanying works include supplements, concordances, indexes, catalogues, teacher’s guides, music for a motion picture, etc.

has derivative work relationship with
has subproperty: is derivative (work)
has unconstrained: P60710
lexical alias: derivativeWorkRelationship.en
name: derivativeWorkRelationship
status: Published
toolkit definition: A work that is based on or is a derivative of the work.
toolkit label: derivative work relationship
type: Property
domain: C10001
range: C10001
sub property of: P60710
sub property of: has related work
definition: Relates a work to a work that is based on or is a derivative of the work.
scope note: Derivative works include summaries, abstracts, digests, adaptations, dramatizations, novelizations, screenplays, free translations, paraphrases, imitations, parodies, etc.

has sequential work relationship with
has subproperty: is preceded by (work)
has subproperty: is succeeded by (work)
has unconstrained: P60713
lexical alias: sequentialWorkRelationship.en
name: sequentialWorkRelationship
status: Published
toolkit definition: A work that is preceded by or succeeded by the work.
toolkit label: sequential work relationship
type: Property
domain: C10001
range: C10001
sub property of: P60713
definition: Relates a work to a work that is preceded by or succeeded by the work.
scope note: Sequential works include sequels, prequels, continuations, superseding works, etc.

has whole-part work relationship with
has subproperty: is contained in (work)
has subproperty: is container of (work)
has unconstrained: P60714
lexical alias: wholePartWorkRelationship.en
name: wholePartWorkRelationship
status: Published
toolkit definition: A work that is contained in or contains the work.
toolkit label: whole-part work relationship
type: Property
domain: C10001
range: C10001
sub property of: has related work
definition: Relates a work to a work that is contained in or contains the work.
scope note: Parts of works include discrete components such as subseries, and individual poems, stories, or essays in a collection or anthology.

is musical theatre adaptation of (work)
has unconstrained: P60719
lexical alias: musicalTheatreAdaptationOfWork.en
name: musicalTheatreAdaptationOfWork
status: Published
toolkit definition: A work that has been adapted as a musical theatre work.
toolkit label: musical theatre adaptation of (work)
type: Property
domain: C10001
range: C10001
sub property of: P60719
sub property of: is adaptation of (work)
inverse of: is adapted as musical theatre (work)
definition: Relates a work to a work that has been adapted as a musical theatre work.

is opera adaptation of (work)
has unconstrained: P60720
lexical alias: operaAdaptationOf.en
name: operaAdaptationOf
status: Published
toolkit definition: A work that has been adapted as opera.
toolkit label: opera adaptation of (work)
type: Property
domain: C10001
range: C10001
sub property of: P60720
sub property of: is adaptation of (work)
inverse of: is adapted as opera (work)
definition: Relates a work to a work that has been adapted as opera.

is adapted as musical theatre (work)
has unconstrained: P60721
lexical alias: adaptedAsMusicalTheatreWork.en
name: adaptedAsMusicalTheatreWork
status: Published
toolkit definition: A musical theatre work based on the source work.
toolkit label: adapted as musical theatre (work)
type: Property
domain: C10001
range: C10001
sub property of: P60721
sub property of: is adapted as (work)
inverse of: is musical theatre adaptation of (work)
definition: Relates a work to a musical theatre work based on the source work.

is adapted as opera (work)
has unconstrained: P60722
lexical alias: adaptedAsOperaWork.en
name: adaptedAsOperaWork
status: Published
toolkit definition: An opera based on the source work.
toolkit label: adapted as opera (work)
type: Property
domain: C10001
range: C10001
sub property of: P60722
sub property of: is adapted as (work)
inverse of: is opera adaptation of (work)
definition: Relates a work to an opera based on the source work.

is music (work)
has unconstrained: P60723
lexical alias: musicWork.en
name: musicWork
status: Published
toolkit definition: A musical work that is used in a motion picture, play, television program, etc.
toolkit label: music (work)
type: Property
domain: C10001
range: C10001
sub property of: is complemented by (work)
inverse of: is music for (work)
definition: Relates a work to a musical work that is used in a motion picture, play, television program, etc.

is music for (work)
has unconstrained: P60724
lexical alias: musicForWork.en
name: musicForWork
status: Published
toolkit definition: A work such as a motion picture, play, television program, etc. that uses the musical work.
toolkit label: music for (work)
type: Property
domain: C10001
range: C10001
sub property of: is complemented by (work)
inverse of: is music (work)
definition: Relates a work to a work such as a motion picture, play, television program, etc. that uses the musical work.

is video music (work)
has unconstrained: P60725
lexical alias: videoMusicWork.en
name: videoMusicWork
status: Published
toolkit definition: A musical work that is used in a video.
toolkit label: video music (work)
type: Property
domain: C10001
range: C10001
sub property of: P60725
sub property of: is music (work)
inverse of: is music for video (work)
definition: Relates a work to a musical work that is used in a video.

is music for video (work)
has unconstrained: P60726
lexical alias: musicForVideoWork.en
name: musicForVideoWork
status: Published
toolkit definition: A work that uses the musical work in a video.
toolkit label: music for video (work)
type: Property
domain: C10001
range: C10001
sub property of: P60726
sub property of: is music for (work)
inverse of: is video music (work)
definition: Relates a work to a work that uses the musical work in a video.

is television program music (work)
has unconstrained: P60727
lexical alias: televisionProgramMusicWork.en
name: televisionProgramMusicWork
status: Published
toolkit definition: A musical work that is used in a television program.
toolkit label: television program music (work)
type: Property
domain: C10001
range: C10001
sub property of: P60727
sub property of: is music (work)
inverse of: is music for television program (work)
definition: Relates a work to a musical work that is used in a television program.

is music for television program (work)
has unconstrained: P60728
lexical alias: musicForTelevisionProgramWork.en
name: musicForTelevisionProgramWork
status: Published
toolkit definition: A work that uses the musical work in a television program.
toolkit label: music for television program (work)
type: Property
domain: C10001
range: C10001
sub property of: P60728
sub property of: is music for (work)
inverse of: is television program music (work)
definition: Relates a work to a work that uses the musical work in a television program.

is radio program music (work)
has unconstrained: P60729
lexical alias: radioProgramMusicWork.en
name: radioProgramMusicWork
status: Published
toolkit definition: A musical work that is used in a radio program.
toolkit label: radio program music (work)
type: Property
domain: C10001
range: C10001
sub property of: P60729
sub property of: is music (work)
inverse of: is music for radio program (work)
definition: Relates a work to a musical work that is used in a radio program.

is music for radio program (work)
has unconstrained: P60730
lexical alias: musicForRadioProgramWork.en
name: musicForRadioProgramWork
status: Published
toolkit definition: A work that uses the musical work in a radio program.
toolkit label: music for radio program (work)
type: Property
domain: C10001
range: C10001
sub property of: P60730
sub property of: is music for (work)
inverse of: is radio program music (work)
definition: Relates a work to a work that uses the musical work in a radio program.

is music for motion picture (work)
has unconstrained: P60731
lexical alias: musicForMotionPictureWork.en
name: musicForMotionPictureWork
status: Published
toolkit definition: A work that uses the musical work in a motion picture.
toolkit label: music for motion picture (work)
type: Property
domain: C10001
range: C10001
sub property of: P60731
sub property of: is music (work)
inverse of: is motion picture music (work)
definition: Relates a work to a work that uses the musical work in a motion picture.

is motion picture music (work)
has unconstrained: P60732
lexical alias: motionPictureMusicWork.en
name: motionPictureMusicWork
status: Published
toolkit definition: A musical work that is used in a motion picture.
toolkit label: motion picture music (work)
type: Property
domain: C10001
range: C10001
sub property of: P60732
sub property of: is music for (work)
inverse of: is music for motion picture (work)
definition: Relates a work to a musical work that is used in a motion picture.

is choreography (work)
has unconstrained: P60740
lexical alias: choreographyWork.en
name: choreographyWork
status: Published
toolkit definition: A work that provides the choreography for use in the related work.
toolkit label: choreography (work)
type: Property
domain: C10001
range: C10001
sub property of: is complemented by (work)
inverse of: is choreography for (work)
definition: Relates a work to a work that provides the choreography for use in the related work.

is choreography for (work)
has unconstrained: P60741
lexical alias: choreographyForWork.en
name: choreographyForWork
status: Published
toolkit definition: A work that uses the choreography of the related work.
toolkit label: choreography for (work)
type: Property
domain: C10001
range: C10001
sub property of: is complemented by (work)
inverse of: is choreography (work)
definition: Relates a work to a work that uses the choreography of the related work.

is adapted as video game (work)
has unconstrained: P60744
lexical alias: adaptedAsVideoGameWork.en
name: adaptedAsVideoGameWork
status: Published
toolkit definition: A video game based on the source work.
toolkit label: adapted as video game (work)
type: Property
domain: C10001
range: C10001
sub property of: is adapted as (work)
inverse of: is video game adaptation of (work)
definition: Relates a work to a video game based on the source work.

is video game adaptation of (work)
has unconstrained: P60745
lexical alias: videoGameAdaptationOfWork.en
name: videoGameAdaptationOfWork
status: Published
toolkit definition: A work that has been adapted as a video game.
toolkit label: video game adaptation of (work)
type: Property
domain: C10001
range: C10001
sub property of: is adaptation of (work)
inverse of: is adapted as video game (work)
definition: Relates a work to a work that has been adapted as a video game.

is adapted as graphic novel (work)
has unconstrained: P60742
lexical alias: adaptedAsGraphicNovelWork.en
name: adaptedAsGraphicNovelWork
status: Published
toolkit definition: A graphic novel based on the source work.
toolkit label: adapted as graphic novel (work)
type: Property
domain: C10001
range: C10001
sub property of: is adapted as (work)
inverse of: is graphic novelization of (work)
definition: Relates a work to a graphic novel based on the source work.

is graphic novelization of (work)
has unconstrained: P60743
lexical alias: graphicNovelizationOfWork.en
name: graphicNovelizationOfWork
status: Published
toolkit definition: A work that has been adapted as a graphic novel.
toolkit label: graphic novelization of (work)
type: Property
domain: C10001
range: C10001
sub property of: is adaptation of (work)
inverse of: is adapted as graphic novel (work)
definition: Relates a work to a work that has been adapted as a graphic novel.

has calligrapher
has unconstrained: P60752
lexical alias: calligrapher.en
name: calligrapher
status: Published
toolkit definition: An artist responsible for creating a work of calligraphy where the focus of interest lies in the aesthetic value of its penmanship or graphic artistry, regardless of whether the same person, etc., also authored the inscribed text.
toolkit label: calligrapher
type: Property
domain: C10001
range: C10002
sub property of: has artist
inverse of: P50246
definition: Relates a work to an artist responsible for creating a work of calligraphy where the focus of interest lies in the aesthetic value of its penmanship or graphic artistry, regardless of whether the same person, etc., also authored the inscribed text.

has book artist
has unconstrained: P60753
lexical alias: bookArtist.en
name: bookArtist
status: Published
toolkit definition: An artist responsible for creating art works that exploit the book form or alter its physical structure as part of the content of the work.
toolkit label: book artist
type: Property
domain: C10001
range: C10002
sub property of: has artist
inverse of: P50247
definition: Relates a work to an artist responsible for creating art works that exploit the book form or alter its physical structure as part of the content of the work.

has rapporteur
has unconstrained: P60751
lexical alias: rapporteur.en
name: rapporteur
status: Published
toolkit definition: An author who is appointed by an organization to report on the proceedings of its meetings.
toolkit label: rapporteur
type: Property
domain: C10001
range: C10002
sub property of: has author
inverse of: P50248
definition: Relates a work to an author who is appointed by an organization to report on the proceedings of its meetings.

has subject relationship
has subproperty: has subject (work)
has subproperty: has subject (expression)
has subproperty: has subject (manifestation)
has subproperty: has subject (item)
has subproperty: has subject (person)
has subproperty: has subject (family)
has subproperty: has subject (corporate body)
has unconstrained: P60805
lexical alias: subjectRelationship.en
name: subjectRelationship
status: Published
instruction number: 23.4
toolkit definition: The relationship between a work and an identifier, an authorized access point, and/or a description that indicates what the work is about.
toolkit label: subject relationship
type: Property
domain: C10001
inverse of: is subject relationship of
definition: Relates a work to a term, phrase, classification number, etc., that indicates what the work is about.

has subject (work)
has unconstrained: P60805
lexical alias: subjectWork.en
name: subjectWork
status: Published
toolkit definition: A work that the work is about.
toolkit label: subject (work)
type: Property
domain: C10001
range: C10001
sub property of: has subject relationship
inverse of: is subject of (work)
definition: Relates a work to a work that the work is about.

has subject (expression)
has subproperty: is description of (expression)
has unconstrained: P60805
lexical alias: subjectExpression.en
name: subjectExpression
status: Published
toolkit definition: An expression that the work is about.
toolkit label: subject (expression)
type: Property
domain: C10001
range: C10006
sub property of: has subject relationship
inverse of: P20268
definition: Relates a work to an expression that the work is about.

has subject (manifestation)
has subproperty: is description of (manifestation)
has unconstrained: P60805
lexical alias: subjectManifestation.en
name: subjectManifestation
status: Published
toolkit definition: A work to a manifestation that the work is about.
toolkit label: subject (manifestation)
type: Property
domain: C10001
range: C10007
sub property of: has subject relationship
inverse of: P30253
definition: Relates a work to a manifestation that the work is about.

has subject (item)
has subproperty: is description of (item)
has unconstrained: P60805
lexical alias: subjectItem.en
name: subjectItem
status: Published
toolkit definition: An item that the work is about.
toolkit label: subject (item)
type: Property
domain: C10001
range: C10003
sub property of: has subject relationship
inverse of: P40061
definition: Relates a work to an item that the work is about.

has subject (person)
has unconstrained: P60805
lexical alias: subjectPerson.en
name: subjectPerson
status: Published
toolkit definition: A person that the work is about.
toolkit label: subject (person)
type: Property
domain: C10001
range: C10004
sub property of: has subject relationship
inverse of: P50249
definition: Relates a work to a person that the work is about.

has subject (family)
has unconstrained: P60805
lexical alias: subjectFamily.en
name: subjectFamily
status: Published
toolkit definition: A family that the work is about.
toolkit label: subject (family)
type: Property
domain: C10001
range: C10008
sub property of: has subject relationship
inverse of: P50250
definition: Relates a work to a family that the work is about.

has subject (corporate body)
has unconstrained: P60805
lexical alias: subjectCorporateBody.en
name: subjectCorporateBody
status: Published
toolkit definition: A corporate body that the work is about.
toolkit label: subject (corporate body)
type: Property
domain: C10001
range: C10005
sub property of: has subject relationship
inverse of: P50251
definition: Relates a work to a corporate body that the work is about.

is subject of (work)
has unconstrained: P60806
lexical alias: subjectOfWork.en
name: subjectOfWork
status: Published
toolkit definition: A work to a work that is about the work.
toolkit label: subject of (work)
type: Property
domain: C10001
range: C10001
sub property of: is subject relationship of
inverse of: has subject (work)
definition: Relates a work to a work that is about the work.

is description of (item)
has subproperty: is analysis of (item)
has subproperty: is evaluation of (item)
has subproperty: is review of (item)
has subproperty: is critique of (item)
has subproperty: is commentary on (item)
has unconstrained: P60190
lexical alias: descriptionOfItem.en
name: descriptionOfItem
status: Published
toolkit definition: An item described by a describing work.
toolkit label: description of (item)
type: Property
domain: C10001
range: C10003
sub property of: has subject (item)
inverse of: P40062
definition: Relates a work to an item described by a describing work.

is analysis of (item)
has unconstrained: P60239
lexical alias: analysisOfItem.en
name: analysisOfItem
status: Published
toolkit definition: An item that has been examined to identify its components and their relations.
toolkit label: analysis of (item)
type: Property
domain: C10001
range: C10003
sub property of: is description of (item)
inverse of: P40063
definition: Relates a work to an item that has been examined to identify its components and their relations.

is evaluation of (item)
has unconstrained: P60255
lexical alias: evaluationOfItem.en
name: evaluationOfItem
status: Published
toolkit definition: An item that is examined or judged.
toolkit label: evaluation of (item)
type: Property
domain: C10001
range: C10003
sub property of: is description of (item)
inverse of: P40066
definition: Relates a work to an item that is examined or judged.

is review of (item)
has unconstrained: P60288
lexical alias: reviewOfItem.en
name: reviewOfItem
status: Published
toolkit definition: An item used as the basis for a brief evaluation.
toolkit label: review of (item)
type: Property
domain: C10001
range: C10003
sub property of: is description of (item)
inverse of: P40067
definition: Relates a work to an item used as the basis for a brief evaluation.

is critique of (item)
has unconstrained: P60292
lexical alias: critiqueOfItem.en
name: critiqueOfItem
status: Published
toolkit definition: An item used as the basis for a critical evaluation.
toolkit label: critique of (item)
type: Property
domain: C10001
range: C10003
sub property of: is description of (item)
inverse of: P40065
definition: Relates a work to an item used as the basis for a critical evaluation.

is commentary on (item)
has unconstrained: P60298
lexical alias: commentaryOnItem.en
name: commentaryOnItem
status: Published
toolkit definition: An item used as the basis for a set of explanatory or critical notes.
toolkit label: commentary on (item)
type: Property
domain: C10001
range: C10003
sub property of: is description of (item)
inverse of: P40064
definition: Relates a work to an item used as the basis for a set of explanatory or critical notes.

is description of (manifestation)
has subproperty: is analysis of (manifestation)
has subproperty: is evaluation of (manifestation)
has subproperty: is review of (manifestation)
has subproperty: is critique of (manifestation)
has subproperty: is commentary on (manifestation)
has unconstrained: P60190
lexical alias: descriptionOfManifestation.en
name: descriptionOfManifestation
status: Published
toolkit definition: A manifestation described by a describing work.
toolkit label: description of (manifestation)
type: Property
domain: C10001
range: C10007
sub property of: has subject (manifestation)
inverse of: P30254
definition: Relates a work to a manifestation described by a describing work.

is analysis of (manifestation)
has unconstrained: P60239
lexical alias: analysisOfManifestation.en
name: analysisOfManifestation
status: Published
toolkit definition: A manifestation that has been examined to identify its components and their relations.
toolkit label: analysis of (manifestation)
type: Property
domain: C10001
range: C10007
sub property of: is description of (manifestation)
inverse of: P30255
definition: Relates a work to a manifestation that has been examined to identify its components and their relations.

is evaluation of (manifestation)
has unconstrained: P60255
lexical alias: evaluationOfManifestation.en
name: evaluationOfManifestation
status: Published
toolkit definition: A manifestation that is examined or judged.
toolkit label: evaluation of (manifestation)
type: Property
domain: C10001
range: C10007
sub property of: is description of (manifestation)
inverse of: P30258
definition: Relates a work to a manifestation that is examined or judged.

is review of (manifestation)
has unconstrained: P60288
lexical alias: reviewOfManifestation.en
name: reviewOfManifestation
status: Published
toolkit definition: A manifestation used as the basis for a brief evaluation.
toolkit label: review of (manifestation)
type: Property
domain: C10001
range: C10007
sub property of: is description of (manifestation)
inverse of: P30259
definition: Relates a work to a manifestation used as the basis for a brief evaluation.

is critique of (manifestation)
has unconstrained: P60292
lexical alias: critiqueOfManifestation.en
name: critiqueOfManifestation
status: Published
toolkit definition: A manifestation used as the basis for a critical evaluation.
toolkit label: critique of (manifestation)
type: Property
domain: C10001
range: C10007
sub property of: is description of (manifestation)
inverse of: P30257
definition: Relates a work to a manifestation used as the basis for a critical evaluation.

is commentary on (manifestation)
has unconstrained: P60298
lexical alias: commentaryOnManifestation.en
name: commentaryOnManifestation
status: Published
toolkit definition: A manifestation used as the basis for a set of explanatory or critical notes.
toolkit label: commentary on (manifestation)
type: Property
domain: C10001
range: C10007
sub property of: is description of (manifestation)
inverse of: P30256
definition: Relates a work to a manifestation used as the basis for a set of explanatory or critical notes.

is description of (expression)
has subproperty: is analysis of (expression)
has subproperty: is evaluation of (expression)
has subproperty: is review of (expression)
has subproperty: is critique of (expression)
has subproperty: is commentary on (expression)
has unconstrained: P60190
lexical alias: descriptionOfExpression.en
name: descriptionOfExpression
status: Published
toolkit definition: An expression described by a describing work.
toolkit label: description of (expression)
type: Property
domain: C10001
range: C10006
sub property of: has subject (expression)
inverse of: P20269
definition: Relates a work to an expression described by a describing work.

is analysis of (expression)
has unconstrained: P60239
lexical alias: analysisOfExpression.en
name: analysisOfExpression
status: Published
toolkit definition: An expression that has been examined to identify its components and their relations.
toolkit label: analysis of (expression)
type: Property
domain: C10001
range: C10006
sub property of: is description of (expression)
inverse of: P20270
definition: Relates a work to an expression that has been examined to identify its components and their relations.

is evaluation of (expression)
has unconstrained: P60255
lexical alias: evaluationOfExpression.en
name: evaluationOfExpression
status: Published
toolkit definition: An expression that is examined or judged.
toolkit label: evaluation of (expression)
type: Property
domain: C10001
range: C10006
sub property of: is description of (expression)
inverse of: P20273
definition: Relates a work to an expression that is examined or judged.

is review of (expression)
has unconstrained: P60288
lexical alias: reviewOfExpression.en
name: reviewOfExpression
status: Published
toolkit definition: An expression used as the basis for a brief evaluation.
toolkit label: review of (expression)
type: Property
domain: C10001
range: C10006
sub property of: is description of (expression)
inverse of: P20274
definition: Relates a work to an expression used as the basis for a brief evaluation.

is critique of (expression)
has unconstrained: P60292
lexical alias: critiqueOfExpression.en
name: critiqueOfExpression
status: Published
toolkit definition: An expression used as the basis for a critical evaluation.
toolkit label: critique of (expression)
type: Property
domain: C10001
range: C10006
sub property of: is description of (expression)
inverse of: P20272
definition: Relates a work to an expression used as the basis for a critical evaluation.

is commentary on (expression)
has unconstrained: P60298
lexical alias: commentaryOnExpression.en
name: commentaryOnexpression
status: Published
toolkit definition: An expression used as the basis for a set of explanatory or critical notes.
toolkit label: commentary on (expression)
type: Property
domain: C10001
range: C10006
sub property of: is description of (expression)
inverse of: P20271
definition: Relates a work to an expression used as the basis for a set of explanatory or critical notes.

is subject relationship of
has subproperty: P50249
has subproperty: P50250
has subproperty: P50251
has subproperty: P20268
has subproperty: P40061
has subproperty: P30253
has subproperty: is subject of (work)
has unconstrained: P60806
lexical alias: SubjectRelationshipOf.en
name: subjectOf
status: Published
toolkit definition: A work that is about the entity.
toolkit label: subject relationship of
type: Property
range: C10001
inverse of: has subject relationship
definition: Relates an entity to a work that is about the entity.

has degree committee member
has unconstrained: P60815
lexical alias: degreeCommitteeMember.en
name: degreeCommitteeMember
status: Published
toolkit definition: A person serving on a committee that supervises a student's thesis or dissertation.
toolkit label: degree committee member
type: Property
domain: C10001
range: C10004
sub property of: has other person, family, or corporate body associated with a work
inverse of: P50257
definition: Relates a work to a person serving on a committee that supervises a student's thesis or dissertation.

has defendant corporate body
has unconstrained: P60462
lexical alias: defendantCorporateBody.en
name: defendantCorporateBody
status: Published
toolkit definition: A corporate body who is accused in a criminal proceeding or sued in a civil proceeding.
toolkit label: defendant corporate body
type: Property
domain: C10001
range: C10005
sub property of: has defendant
inverse of: P50258
definition: Relates a work to a corporate body who is accused in a criminal proceeding or sued in a civil proceeding.

has defendant person
has unconstrained: P60462
lexical alias: defendantPerson.en
name: defendantPerson
status: Published
toolkit definition: A person who is accused in a criminal proceeding or sued in a civil proceeding.
toolkit label: defendant person
type: Property
domain: C10001
range: C10004
sub property of: has defendant
inverse of: P50259
definition: Relates a work to a person who is accused in a criminal proceeding or sued in a civil proceeding.

has commissioning body
has unconstrained: P60826
lexical alias: commissioningBody.en
name: commissioningBody
status: Published
toolkit definition: A person, family, or corporate body responsible for commissioning a work.
toolkit label: commissioning body
type: Property
domain: C10001
range: C10002
sub property of: has other person, family, or corporate body associated with a work
inverse of: P50262
definition: Relates a work to a person, family, or corporate body responsible for commissioning a work.

is oratorio adaptation of (work)
has unconstrained: P60830
lexical alias: oratorioAdaptationWork.en
name: oratorioAdaptationOfWork
status: Published
toolkit definition: A work that has been adapted as an oratorio.
toolkit label: oratorio adaptation of (work)
type: Property
domain: C10001
range: C10001
sub property of: is adaptation of (work)
inverse of: is adapted as oratorio (work)
definition: Relates a work to a work that has been adapted as an oratorio.

is adapted as oratorio (work)
has unconstrained: P60831
lexical alias: adaptedAsOratorioWork.en
name: adaptedAsOratorioWork
status: Published
toolkit definition: An oratorio based on the source work.
toolkit label: adapted as oratorio (work)
type: Property
domain: C10001
range: C10001
sub property of: is adapted as (work)
inverse of: is oratorio adaptation of (work)
definition: Relates a work to an oratorio based on the source work.

is inspired by
has unconstrained: P60832
lexical alias: inspiredBy.en
name: inspiredBy
status: Published
toolkit definition: A work which serves as the inspiration for another work.
toolkit label: inspired by
type: Property
domain: C10001
range: C10001
sub property of: is based on (work)
inverse of: is inspiration for
definition: Relates a work to a work which serves as the inspiration for another work.

is inspiration for
has unconstrained: P60833
lexical alias: inspirationFor.en
name: inspirationFor
status: Published
toolkit definition: A work which was inspired by another work.
toolkit label: inspiration for
type: Property
domain: C10001
range: C10001
sub property of: is derivative (work)
inverse of: is inspired by
definition: Relates a work to a work which was inspired by another work.

has participant in a treaty
has unconstrained: P60834
lexical alias: participantInATreaty.en
name: participantInATreaty
status: Published
toolkit definition: A government, international intergovernmental body, or other corporate body that has signed, ratified, or acceded to a treaty.
toolkit label: participant in a treaty
type: Property
domain: C10001
range: C10005
sub property of: has other person, family, or corporate body associated with a work
inverse of: P50264
definition: Relates a work to a government, international intergovernmental body, or other corporate body that has signed, ratified, or acceded to a treaty.

has researcher
has unconstrained: P60836
lexical alias: researcher.en
name: researcher
status: Published
toolkit definition: A person, family, or corporate body who does research in support of the creation of a work.
toolkit label: researcher
type: Property
domain: C10001
range: C10002
sub property of: has other person, family, or corporate body associated with a work
inverse of: P50265
definition: Relates a work to a person, family, or corporate body who does research in support of the creation of a work.

has commemoration
has unconstrained: P60846
lexical alias: commemoration.en
name: commemoration
status: Published
toolkit definition: A work commemorated by the other work.
toolkit label: commemoration
type: Property
domain: C10001
range: C10001
sub property of: has referential work relationship with
inverse of: is commemoration of
definition: Relates a work to a work commemorated by the other work.

is commemoration of
has unconstrained: P60847
lexical alias: commemorationOf.en
name: commemorationOf
status: Published
toolkit definition: A work created to commemorate the other work.
toolkit label: commemoration of
type: Property
domain: C10001
range: C10001
sub property of: has referential work relationship with
inverse of: has commemoration
definition: Relates a work to a work created to commemorate the other work.

has referential work relationship with
has subproperty: has commemoration
has subproperty: is commemoration of
has unconstrained: P60848
lexical alias: referentialWorkRelationship.en
name: referentialWorkRelationship
status: Published
toolkit definition: A work that references the work.
toolkit label: referential work relationship
type: Property
domain: C10001
range: C10001
sub property of: has related work
definition: Relates a work to a work that references the work.

has organizer
has unconstrained: P60849
lexical alias: organizer.en
name: organizer
status: Published
toolkit definition: A person, family, or corporate body organizing the exhibit, event, conference, etc., which gave rise to a work.
toolkit label: organizer
type: Property
domain: C10001
range: C10002
sub property of: has other person, family, or corporate body associated with a work
inverse of: P50270
definition: Relates a work to a person, family, or corporate body organizing the exhibit, event, conference, etc., which gave rise to a work.