Presenter (Expression)
type: Property
domain: Expression
sub property of: Contributor
name: presenterExpression
status: New-Proposed
definition: Eine Person, Familie oder Körperschaft, die in einem "X präsentiert"-Vorspann für Bewegtbildmaterialien erwähnt wird und die wahrscheinlich in gewisser Weise mit Produktion, Finanzierung oder Vertrieb in Zusammenhang steht. In den frühen Jahren der Filmproduktion wurde dies häufig als "vanity credit" verwendet. @de
definition: A person, family, or corporate body mentioned in an “X presents” credit for moving image materials and who is probably associated with production, finance, or distribution in some way. In the early years of film production, this was often used as a vanity credit.

Costume designer (Expression)
type: Property
domain: Expression
label: Kostümbildner (Expression) @de
sub property of: Contributor
name: costumeDesignerExpression
status: New-Proposed
definition: Eine Person, Familie oder Körperschaft, die für das Design der Kostüme für eine Bewegtbildproduktion, ein Musical, eine Theateraufführung oder Entertainment verantwortlich ist. @de
definition: A person, family, or corporate body responsible for designing the costumes for a moving image production or for a musical or dramatic presentation or entertainment.

Annotator
type: Property
has subproperty: Annotator (Item)
name: annotator
status: New-Proposed

Illuminator (Item)
type: Property
domain: Item
label: Illuminator (Exemplar) @de
sub property of: Illuminator
name: illuminatorItem
status: New-Proposed
definition: A person providing decoration to a specific item using precious metals or color, often with elaborate designs and motifs.
definition: Eine Person, die ein bestimmtes Exemplar durch Edelmetalle oder Farben (aus-)gestaltet, häufig mit kunstvollen Mustern und Motiven. @de

Animator
type: Property
has subproperty: Animator (Expression)
name: animator
status: New-Proposed

Distributor (Manifestation)
type: Property
domain: Manifestation
label: Vertrieb (Manifestation) @de
sub property of: Distributor
has subproperty: Film distributor (Manifestation)
name: distributorManifestation
status: New-Proposed
definition: Eine Person, Familie oder Körperschaft, die für den Vertrieb einer Ressource verantwortlich ist. @de
definition: A person, family, or corporate body responsible for distributing a resource.

Commentator (Expression)
type: Property
domain: Expression
label: Kommentator (mündlich) (Expression) @de
name: commentatorExpression
status: New-Proposed
definition: Jemand, der zu einer Expression eines Werkes in einer Aufnahme, in einem Film oder in einem anderen audiovisuellen Medium in Form einer Interpretation, einer Analyse oder einer Diskussion des Themas beiträgt. @de
definition: A performer contributing to an expression of a work by providing interpretation, analysis, or a discussion of the subject matter on a recording, film, or other audiovisual medium.

Appellant (Work)
type: Property
domain: Work
label: Berufungskläger / Revisionskläger (Werk) @de
sub property of: Appellant
name: appellantWork
status: New-Proposed
definition: A person or corporate body who appeals a lower court's decision.
definition: Eine natürliche oder juristische Person, die gegen ein Gerichtsurteil einer unteren Instanz Rechtsmittel (Berufung / Revision) einlegt. @de

Choreographer (Expression)
type: Property
domain: Expression
label: Choreograph (Expression) @de
sub property of: Contributor
name: choreographerExpression
status: New-Proposed
definition: Eine Person, Familie oder Körperschaft, die für ein aus Bewegung bestehendes Werk verantwortlich ist. @de
definition: A person, family, or corporate body contributing to an expression of a work by providing additional choreography, or by modifying the previous choreography.

Speaker (Expression)
type: Property
domain: Expression
label: Sprecher (Expression) @de
sub property of: Performer (Expression)
name: speakerExpression
status: New-Proposed
definition: A performer contributing to an expression of a work by speaking words, such as a lecture, speech, etc.
definition: Ein Darsteller, der an einer Expression eines Werkes durch das Sprechen von Worten, wie z.B. einen Vortrag, eine Rede o.ä. mitwirkt. @de

Defendant
type: Property
label: Angeklagter/Beklagter (Werk) @de
has subproperty: Defendant (Work)
name: defendant
status: New-Proposed

Programmer
type: Property
label: Programmierer @de
name: programmer
status: New-Proposed

Caster
type: Property
label: Formgießer @de
sub property of: Manufacturer
name: caster
status: New-Proposed

Composer of Music for Sound Film (Expression)
type: Property
label: Filmkomponist (Expression) @de
sub property of: Composer of Music for Sound Film
name: composerOfMusicForSoundFilmExpression
status: New-Proposed
definition: Eine Person, Familie oder Körperschaft, die für Kompositionen verantwortlich ist, die einen Teil eines Bewegtbildwerkes bilden, das mit synchronisiertem und integriertem Ton aufgenommen wurde. Diese Musikwerke können entweder eigens für das bewegte Bild geschriebene oder bereits bestehende Werke sein, die in den Bewegtbildsoundtrack eingebunden wurden. @de
definition: A person, family, or corporate body responsible for contributing compositions that form part of the presentation of a moving image work recorded with a synchronized, integrated soundtrack. These musical works may be originally written for the moving image or be pre-existing works that are incorporated into the moving image soundtrack.

Film producer (Work)
type: Property
domain: Work
label: Filmproduzent (Werk) @de
sub property of: Producer (Work)
name: filmProducerWork
status: New-Proposed
definition: Eine Person, Familie oder Körperschaft, die für einen Film die Verantwortung für die meisten geschäftlichen Aspekte übernimmt. Der Produzent ist hauptsächlich verantwortlich für die Geldbeschaffung, das Produktionsmanagement, die Einstellung der Kompetenzträger, die Organisation des Vertriebs, die Absicherung des kommerziellen Erfolges usw. @de
definition: A producer responsible for most of the business aspects of a film.

Presenter
type: Property
name: presenter
status: New-Proposed

Issuing body
type: Property
label: Veröffentlichendes Organ @de
has subproperty: Issuing body (Work)
name: issuingBody
status: New-Proposed

Teacher (Expression)
type: Property
domain: Expression
label: Lehrer (Expression) @de
name: teacherExpression
status: New-Proposed
definition: Ein Darsteller, der im Zusammenhang mit einer Expression eines Werkes Anleitungen gibt oder Demonstrationen bietet. @de
definition: A performer contributing to an expression of a work by giving instruction or providing a demonstration.

Instrumentalist
type: Property
label: Instrumentalmusiker @de
sub property of: Performer
name: instrumentalist
status: New-Proposed

Composer of Music for Silent Film
type: Property
label: Komponist von Stummfilm-Musik @de
has subproperty: Composer of Music for Silent Film (Expression)
name: composerOfMusicForSilentFilm
status: New-Proposed
definition: Eine Person, Familie oder Körperschaft, die für Kompositionen zur Begleitung von Bewegtbildwerken aus der Stummfilmzeit, die ohne synchronisierten und integrierten Ton aufgenommen wurden, verantwortlich ist. Diese Musikwerke können entweder eigens für das bewegte Bild geschrieben sein oder aber aus bereits existierenden Werken bestehen bzw. sich zusammensetzen, die vorgesehen sind, das bewegte Bild zu ergänzen. @de
definition: A person, family, or corporate body responsible for contributing compositions to accompany the presentation of a moving image work produced in the silent film era and recorded without a synchronized, integrated soundtrack. These musical works may be originally written for the moving image or may consist of or incorporate pre-existing works in a manner that is intended to complement the moving image.

Stage director
type: Property
label: Theaterregisseur @de
name: stageDirector
status: New-Proposed

Speaker
type: Property
label: Sprecher @de
sub property of: Performer
name: speaker
status: New-Proposed

Editor
type: Property
label: Herausgeber @de
name: editor
status: New-Proposed

Editor of moving image work (Expression)
type: Property
domain: Expression
label: Cutter (Expression) @de
sub property of: Contributor
name: editorOfMovingImageWorkExpression
status: New-Proposed
definition: A person, family, or corporate body responsible for assembling, arranging, and trimming film, video, or other moving image formats, including both visual and audio aspects.
definition: Eine Person, Familie oder Körperschaft, die für das Zusammensetzen, Arrangieren und Nachschneiden von Film-, Video- oder anderen Bewegtbildformaten zuständig ist, sowohl Video- als auch Audio-Aspekte umfassend. @de

Television director
type: Property
label: Fernsehintendant @de
sub property of: Director
name: televisionDirector
status: New-Proposed

Seller
type: Property
label: Verkäufer @de
sub property of: Former owner
name: seller
status: New-Proposed

Enacting jurisdiction
type: Property
label: Normerlassender Rechtsträger @de
name: enactingJurisdiction
status: New-Proposed

Designer (Work)
type: Property
domain: Work
label: Designer (Werk) @de
sub property of: Creator
name: designerWork
status: New-Proposed
definition: Eine Person, Familie oder Körperschaft, die für die Gestaltung des Designs eines Objekts verantwortlich ist. @de
definition: A person, family, or corporate body responsible for creating a design for an object.

Editor of compilation
type: Property
label: Compilation Editor @de
name: editorOfCompilation
status: New-Proposed

Puppeteer
type: Property
label: Puppenspieler @de
sub property of: Performer
name: puppeteer
status: New-Proposed

Collection registrar (Item)
type: Property
domain: Item
label: Registrar (Exemplar) @de
name: collectionRegistrarItem
status: New-Proposed
definition: Jemand, der die Exemplare eines zusammengestellten Werkes, wie beispielsweise eine Sammlung von Exemplaren oder Werken, verzeichnet und inventarisiert. @de
definition: A type of curator who lists or inventories the items in an aggregate work such as a collection of items or works.

Restorationist (Item)
type: Property
domain: Item
label: Restaurator @de
sub property of: Restorationist
name: restorationistItem
status: New-Proposed
definition: A person, family, or corporate body responsible for the set of technical, editorial and intellectual procedures aimed at compensating for the degradation of an artifact, such as bringing it back to a state as close as possible to its original condition.
definition: Eine Person, Familie oder Körperschaft, die für den Vertrieb einer Bewegtbildmanifestation an Kinos oder andere Vertriebskanäle verantwortlich ist. @de

Musical director
type: Property
label: Musikalischer Leiter @de
name: musicalDirector
status: New-Proposed

Writer of added commentary (Expression)
type: Property
domain: Expression
label: Kommentator (schriftlich) (Eypression) @de
sub property of: Contributor
name: writerOfAddedCommentaryExpression
status: New-Proposed
definition: Eine Person, Familie oder Körperschaft, die an einer Expression eines Werkes mitwirkt, indem sie eine Interpretation oder kritische Erläuterung des Originalwerkes verfasst. @de
definition: A person, family, or corporate body contributing to an expression of a work by providing an interpretation or critical explanation of the original work.

Performer
type: Property
label: Darsteller @de
has subproperty: Instrumentalist
has subproperty: Storyteller
has subproperty: Actor
has subproperty: Commentator
has subproperty: Host
has subproperty: Dancer
has subproperty: Singer
has subproperty: Narrator
has subproperty: Teacher
has subproperty: Moderator
has subproperty: Speaker
has subproperty: Puppeteer
has subproperty: Conductor
has subproperty: Panelist
has subproperty: On-screen presenter
name: performer
status: New-Proposed

Inventor
type: Property
label: Erfinder @de
name: inventor
status: New-Proposed

Platemaker (Manifestation)
type: Property
domain: Manifestation
label: Druckformhersteller (Manifestation) @de
sub property of: Manufacturer (Manifestation)
name: platemakerManifestation
status: New-Proposed
definition: Eine Person, Familie oder Körperschaft, die an der Produktion einer Manifestation beteiligt ist, indem sie Druckformen für die Produktion von gedruckten Bildern und/oder Text anfertigt. @de
definition: A person, family, or corporate body involved in producing a manifestation by preparing plates used in the production of printed images and/or text.

Jurisdiction governed
type: Property
label: Normunterworfener Rechtsträger @de
has subproperty: Jurisdiction governed (Work)
name: jurisdictionGoverned
status: New-Proposed

Judge
type: Property
label: Richter @de
has subproperty: Judge (Work)
name: judge
status: New-Proposed

Seller (Item)
type: Property
domain: Item
label: Verkäufer (Exemplar) @de
sub property of: Former owner (Item)
name: sellerItem
status: New-Proposed
definition: Ein ehemaliger Eigentümer eines Exemplars, der dieses Exemplar an einen anderen Eigentümer verkauft hat. @de
definition: A former owner of an item who sold that item to another owner.

Panelist (Expression)
type: Property
domain: Expression
label: Diskussionsteilnehmer (Expression) @de
name: panelistExpression
status: New-Proposed
definition: Ein Darsteller, der an einem Programm (oft einer Rundfunk-Sendung) teilnimmt, in dem Themen diskutiert werden, normalerweise mit Experten auf den diskutierten Gebieten. @de
definition: A performer contributing to an expression of a work by participating in a program (often broadcast) where topics are discussed, usually with participation of experts in fields related to the discussion.

Jurisdiction governed (Work)
type: Property
domain: Work
label: Normunterworfener Rechtsträger (Werk) @de
sub property of: Jurisdiction governed
name: jurisdictionGovernedWork
status: New-Proposed
definition: Ein Rechtsträger, der Gesetzen, Verordnungen o. ä. unterworfen ist, die von einem anderen Rechtsträger erlassen wurden. @de
definition: A jurisdiction governed by a law, regulation, etc., that was enacted by another jurisdiction.

Autographer (item)
type: Property
domain: Item
label: Unterzeichner (Exemplar) @de
sub property of: Autographer
name: autographerItem
status: New-Proposed
definition: Eine Person, deren handschriftliche Unterschrift auf einem Exemplar steht. @de
definition: A person whose manuscript signature appears on an item.

Radio director
type: Property
label: Hörfunkintendant @de
sub property of: Director
name: radioDirector
status: New-Proposed

RDA Roles

Film distributor (Manifestation)
type: Property
domain: Manifestation
label: Filmverleiher (Manifestation) @de
sub property of: Distributor (Manifestation)
name: filmDistributorManifestation
status: New-Proposed
definition: Eine Person, Familie oder Körperschaft, die für den Vertrieb einer verfilmten Bewegtbildmanifestation an Kinos oder andere Vertriebskanäle verantwortlich ist. @de
definition: A person, family, or corporate body responsible for distributing a moving image manifestation to theatres or other distribution channels.

Author
type: Property
label: Verfasser @de
has subproperty: Screenwriter
has subproperty: Lyricist
has subproperty: Librettist
name: author
status: New-Proposed
definition: Eine Person, Familie oder Körperschaft, die verantwortlich für die Erstellung eines Werkes ist, das im Wesentlichen aus Text besteht, unabhängig vom Medientyp (gedruckter Text, gesprochenes Wort, elektronischer Text, taktiler Text usw.) oder von der Gattung (Gedichte, Romane, Drehbücher, Blogs usw.). Die Rolle wird auch für Personen verwendet, die den Charakter und den Inhalt eines Originalwerkes wesentlich durch Paraphrasieren, Umschreiben oder Adaption verändern und so ein neues Werk erschaffen, oder den Medientyp einer Expression ändern. @de

Custodian
type: Property
label: Besitzer @de
has subproperty: Custodian (Item)
name: custodian
status: New-Proposed
definition: Eine Person, Familie oder Körperschaft, die der rechtmäßige Besitzer eines Objekts ist (d.h., einer bestimmten Kopie oder Instanz einer Ressource). @de

Binder
type: Property
label: Buchbinder @de
has subproperty: Binder (Item)
name: binder
status: New-Proposed
definition: Eine Person, die ein Exemplar bindet. @de

Former owner
type: Property
label: Früherer Besitzer @de
sub property of: Owner
has subproperty: Seller
has subproperty: Donor
name: formerOwner
status: New-Proposed

Dancer (Expression)
type: Property
domain: Expression
label: Tänzer (Expression) @de
sub property of: Performer (Expression)
name: dancerExpression
status: New-Proposed
definition: A performer contributing to an expression of a work by dancing in a musical, dramatic, etc., presentation.
definition: Ein Darsteller, der durch Tanzen in einer musikalischen, dramatischen oder ähnlichen Darbietung an einer Expression eines Werkes mitwirkt. @de

Artist
type: Property
label: Künstler @de
has subproperty: Sculptor
name: artist
status: New-Proposed

Illustrator (Expression)
type: Property
comment: If the work is primarily the artistic content created by this entity, see artist and photographer.
domain: Expression
sub property of: Contributor
name: illustratorExpression
status: New-Proposed
definition: Eine Person, Familie oder Körperschaft, die an einer Expression eines Werkes mitwirkt, indem sie den primären Inhalt mit Zeichnungen, Diagrammen, Fotografien usw. ausschmückt / ergänzt. @de
definition: A person, family, or corporate body contributing to an expression of a work by supplementing the primary content with drawings, diagrams, photographs, etc.

Honouree of item
type: Property
domain: Item
label: Mit einem Exemplar geehrte Person. @de
sub property of: Honouree
name: honoureeOfItem
status: New-Proposed
definition: A person, family, or corporate body honoured by an item, e.g., a person to whom a copy is presented.
definition: Eine Person, Familie oder Körperschaft, die durch ein Exemplar geehrt wird, z.B. die Person, der ein Exemplar gewidmet wird. @de

Braille embosser
type: Property
label: Brailleschriftpräger @de
sub property of: Manufacturer
name: brailleEmbosser
status: New-Proposed

Honouree (Work)
type: Property
domain: Work
label: Gefeierte Person (Werk) @de
sub property of: Honouree
name: honoureeWork
status: New-Proposed
definition: Eine Person, Familie oder Körperschaft, die durch ein Werk geehrt wird, z.B. die mit einer Festschrift gefeierte Person. @de
definition: A person, family, or corporate body honoured by a work, e.g., the honouree of a festschrift.

Performer (Expression)
type: Property
domain: Expression
label: Darsteller (Expression) @de
sub property of: Contributor
has subproperty: Instrumentalist (Expression)
has subproperty: Actor (Expression)
has subproperty: Dancer (Expression)
has subproperty: Singer (Expression)
has subproperty: Narrator (Expression)
has subproperty: Speaker (Expression)
has subproperty: Storyteller (Expression)
name: performerExpression
status: New-Proposed
definition: A person, family, or corporate body contributing to an expression of a work by performing music, acting, dancing, speaking, etc., often in a musical or dramatic presentation, etc.
definition: Eine Person, Familie oder Körperschaft, die für die Expression eines Werkes Musik aufführen, auftreten, tanzen, sprechen usw., oft in einer musikalischen oder dramatischen Darbietung usw. @de

Narrator (Expression)
type: Property
domain: Expression
label: Erzähler (Expression) @de
sub property of: Performer (Expression)
name: narratorExpression
status: New-Proposed
definition: Ein Darsteller, der eine Expression eines Werkes liest oder spricht, um einen Akt, ein Geschehnis, einen Ereignisablauf usw. darzustellen. @de
definition: A performer contributing to an expression of a work by reading or speaking in order to give an account of an act, occurrence, course of events, etc.

Composer of Incidental Music (Expression)
type: Property
sub property of: Composer of Incidental Music
name: composerOfIncidentalMusicExpression
status: New-Proposed
definition: A person, family, or corporate body contributing to an expression of a work by composing music for a pre-existing, usually textual, work.

Enacting jurisdiction (Work)
type: Property
domain: Work
label: Normerlassender Rechtsträger (Werk) @de
sub property of: Creator
name: enactingJurisdictionWork
status: New-Proposed
definition: A jurisdiction enacting a law, regulation, constitution, court rule, etc.
definition: Ein Rechtsträger, der Gesetze, Verordnungen, eine Satzung, gerichtliche Anordnungen usw. erlassen kann. @de

Draftsman (Expression)
type: Property
domain: Expression
label: Technischer Zeichner (Expression) @de
sub property of: Contributor
name: draftsmanExpression
status: New-Proposed
definition: Eine Person, Familie oder Körperschaft, die an einer Expression eines Werkes eines Architekten, Erfinders oder ähnlichen mitwirkt, indem sie detaillierte Pläne oder Zeichnungen für Gebäude, Schiffe, Flugzeuge, Maschinen, Objekte o.ä. erstellt. @de
definition: A person, family, or corporate body contributing to an expression of a work by an architect, inventor, etc., by making detailed plans or drawings for buildings, ships, aircraft, machines, objects, etc.

Depositor (Item)
type: Property
domain: Item
label: Leihgeber (Exemplar) @de
name: depositorItem
status: New-Proposed
definition: Der gegenwärtige Eigentümer eines Exemplars, der das Exemplar in die Obhut einer anderen Person, Familie oder Körperschaft gegeben hat, während er weiterhin der Eigentümer bleibt. @de
definition: A current owner of an item who deposited the item into the custody of another person, family, or corporate body, while still retaining ownership.

Filmmaker (Work)
type: Property
domain: Work
label: Filmemacher (Werk) @de
sub property of: Creator
name: filmmakerWork
status: New-Proposed
definition: A person, family, or corporate body responsible for creating an independent or personal film. A filmmaker is individually responsible for the conception, and execution of all aspects of the film.
definition: Eine Person, Familie oder Körperschaft, die für die Erstellung eines unabhängigen oder privaten Films verantwortlich ist. Ein Filmemacher ist individuell verantwortlich für das Konzept und die Ausführung aller Aspekte des Films. @de

Abridger (Expression)
type: Property
domain: Expression
sub property of: Contributor
name: abridgerExpression
status: New-Proposed
definition: Eine Person, Familie oder Körperschaft, die eine Expression eines Werkes kürzt oder zusammenfasst, dabei aber das Wesen des Originalwerkes unverändert lässt. @de
definition: A person, family, or corporate body contributing to an expression of a work by shortening or condensing the original work but leaving the nature and content of the original work substantially unchanged.

Cartographer
type: Property
label: Kartograf @de
name: cartographer
status: New-Proposed

Collotyper
type: Property
label: Drucker (im Lichtdruckverfahren) @de
sub property of: Manufacturer
name: collotyper
status: New-Proposed

Braille embosser (Manifestation)
type: Property
domain: Manifestation
label: Brailleschriftpräger (Manifestation) @de
sub property of: Manufacturer (Manifestation)
name: brailleEmbosserManifestation
status: New-Proposed
definition: Eine Person, Familie oder Körperschaft, die im Herstellungsprozess einer Manifestation in Form von Braillezeichen involviert ist. Für das Prägen wird ein Griffel, ein spezieller Brailledrucker oder ein anderes Gerät verwendet. @de
definition: A person, family, or corporate body involved in producing a manifestation by embossing Braille cells using a stylus, special embossing printer, or other device.

Director of photography
type: Property
label: Verantwortlicher Kameramann @de
has subproperty: Director of photography (Work)
name: directorOfPhotography
status: New-Proposed

Surveyor
type: Property
label: Vermesser @de
name: surveyor
status: New-Proposed

Degree granting institution
type: Property
label: Institution, die einen akademischen Grad verleiht @de
has subproperty: Degree granting institution (Work)
name: degreeGrantingInstitution
status: New-Proposed
definition: Eine Körperschaft, die einen akademischen Grad verleiht, z.T. basierend auf der Einreichung einer Hochschulschrift o.ä. @de

Owner (Item)
type: Property
domain: Item
label: Besitzer (Exemplar) @de
sub property of: Owner
has subproperty: Former owner (Item)
has subproperty: Current owner (Item)
name: ownerItem
status: New-Proposed
definition: Eine Person, Familie oder Körperschaft, die im rechtmäßigen Besitz eines Exemplars ist (z.B. einer bestimmten Kopie oder einer bestimmten Instanz einer Ressource). @de
definition: A person, family, or corporate body having legal possession of an item (i.e., a specific copy or instance of a resource).

Owner
type: Property
label: Besitzer @de
has subproperty: Owner (Item)
has subproperty: Former owner
has subproperty: Current owner
name: owner
status: New-Proposed
definition: Eine Person, Familie oder Körperschaft, die im rechtmäßigen Besitz eines Exemplars ist (z.B. einer bestimmten Kopie oder einer bestimmten Instanz einer Ressource). @de

Film producer
type: Property
label: Filmproduzent @de
sub property of: Producer
name: filmProducer
status: New-Proposed

Director
type: Property
has subproperty: Radio director
has subproperty: Film director
has subproperty: Television director
has subproperty: Director (Work)
name: director
status: New-Proposed
definition: Eine Person, Familie oder Körperschaft, die für die allgemeine Leitung und Betreuung einer verfilmten Aufführung, einer Radio- oder Fernsehsendung usw. verantwortlich ist. @de

Plaintiff (Work)
type: Property
domain: Work
label: Zivilkläger @de
sub property of: Plaintiff
name: plaintiffWork
status: New-Proposed
definition: A person or corporate body who brings a suit in a civil proceeding.
definition: Eine Person oder Körperschaft, die eine Klage in ein Zivilverfahren einbringt. @de

Librettist (Work)
type: Property
domain: Work
label: Librettist (Werk) @de
sub property of: Author (Work)
name: librettistWork
status: New-Proposed
definition: Ein Verfasser eines Librettos einer Oper oder anderer Bühnenwerke oder eines Oratoriums. @de
definition: An author of a libretto of an opera or other stage work, or an oratorio.

Photographer
type: Property
label: Fotograf @de
name: photographer
status: New-Proposed
definition: Eine Person, Familie oder Körperschaft, die für die Erstellung eines fotografischen Werks verantwortlich ist. @de

Teacher
type: Property
label: Lehrer @de
sub property of: Performer
name: teacher
status: New-Proposed

Television director (Work)
type: Property
domain: Work
label: Fernsehintendant (Werk) @de
sub property of: Director (Work)
name: televisionDirectorWork
status: New-Proposed
definition: A director responsible for the general management and supervision of a television program.
definition: Eine Person, Familie oder Körperschaft, die für das allgemeine Management und die Leitung eines Fernsehprogramms verantwortlich ist. @de

Editor of compilation (Expression)
type: Property
domain: Expression
label: Compilation Editor @de
sub property of: Contributor
name: editorOfCompilationExpression
status: New-Proposed
definition: A person, family, or corporate body contributing to an expression of a collective or aggregate work by selecting and putting together works, or parts of works, by one or more creators. The editor of compilation may also be involved in elucidating the content, e.g., adding an introduction, notes, or other critical matter, of the compilation. For compilations of data, information, etc., that result in new works, see Compiler.
definition: Eine Person, Familie oder Körperschaft, die an einem gemeinschaftlichen oder gesammelten Werk mitwirken, indem sie die Werke oder Teile von Werken von einem oder mehreren Schöpfern auswählen und zusammenstellen. @de
scope note: For compilations of data, information, etc., that result in new works, see Compiler.

Composer
type: Property
label: Komponist @de
name: composer
status: New-Proposed

Radio director (Work)
type: Property
domain: Work
label: Hörfunkintendant (Werk) @de
sub property of: Director (Work)
name: radioDirectorWork
status: New-Proposed
definition: Eine Person, Familie oder Körperschaft, die für das allgemeine Management und die Leitung eines Radioprogramms verantwortlich ist. @de
definition: A director responsible for the general management and supervision of a radio program.

Publisher (Manifestation)
type: Property
domain: Manifestation
label: Verlag (Manifestation) @de
sub property of: Publisher
has subproperty: Broadcaster (Manifestation)
name: publisherManifestation
status: New-Proposed
definition: Eine Person, Familie oder Körperschaft, die für das Veröffentlichen, die Freigabe oder die Herausgabe einer Ressource verantwortlich ist. @de

Choreographer
type: Property
label: Choreograf @de
name: choreographer
status: New-Proposed

Etcher (Manifestation)
type: Property
domain: Manifestation
label: Radierer (Manifestation) @de
sub property of: Manufacturer (Manifestation)
name: etcherManifestation
status: New-Proposed
definition: A person, family, or corporate body involved in manufacturing a manifestation by subjecting metal, glass, or some other surface used for printing, to acid or another corrosive substance.
definition: Eine Person, Familie oder Körperschaft, die in die Produktion einer Manifestation eingebunden ist, indem sie Metall, Glas oder eine andere Oberfläche, die zum Drucken benutzt wird, mit Säure oder einer anderen ätzenden Substanz behandelt. @de

Contributor
type: Property
domain: Expression
label: Mitwirkender @de
has subproperty: Choreographer (Expression)
has subproperty: Composer (Expression)
has subproperty: Editor of moving image work (Expression)
has subproperty: Court reporter (Expression)
has subproperty: Stage director (Expression)
has subproperty: Recordist (Expression)
has subproperty: Recording engineer (Expression)
has subproperty: Illustrator (Expression)
has subproperty: Abridger (Expression)
has subproperty: Transcriber (Expression)
has subproperty: Art director (Expression)
has subproperty: Interviewee (Expression)
has subproperty: Writer of added text (Expression)
has subproperty: Translator (Expression)
has subproperty: Production designer (Expression)
has subproperty: Editor of compilation (Expression)
has subproperty: Presenter (Expression)
has subproperty: Performer (Expression)
has subproperty: Interviewer (Expression)
has subproperty: Animator (Expression)
has subproperty: Surveyor (Expression)
has subproperty: Arranger of music (Expression)
has subproperty: Editor (Expression)
has subproperty: Draftsman (Expression)
has subproperty: Musical director (Expression)
has subproperty: Writer of added commentary (Expression)
has subproperty: Costume designer (Expression)
name: contributor
status: New-Proposed
definition: Eine Person, Familie oder Körperschaft, die an der Realisierung eines Werkes durch eine Expression mitwirkt. Zu den Mitwirkenden gehören Herausgeber, Übersetzer, Arrangeure/Bearbeiter für Musik, Darsteller, usw. @de
definition: A person, family, or corporate body contributing to the realization of a work through an expression. Contributors include editors, translators, arrangers of music, performers, etc.

Film distributor
type: Property
label: Filmverleiher @de
sub property of: Distributor
name: filmDistributor
status: New-Proposed

Arranger of music
type: Property
label: Arrangeur @de
name: arrangerOfMusic
status: New-Proposed

Designer
type: Property
name: designer
status: New-Proposed

Issuing body (Work)
type: Property
domain: Work
label: Veröffentlichendes Organ (Werk) @de
sub property of: Issuing body
name: issuingBodyWork
status: New-Proposed
definition: A person, family or corporate body issuing the work, such as an official organ of the body.
definition: Eine Person, Familie oder Körperschaft, die ein Werk herausgibt, wie z.B. ein offizielles Organ der Körperschaft. @de

Lyricist
type: Property
label: Textdichter @de
sub property of: Author
name: lyricist
status: New-Proposed

Production designer (Expression)
type: Property
domain: Expression
label: Production Designer (Expression) @de
sub property of: Contributor
name: productionDesignerExpression
status: New-Proposed
definition: A person, family, or corporate body responsible for designing the overall visual appearance of a moving image production.
definition: Eine Person, Familie oder Körperschaft, die für die Gestaltung des gesamten visuellen Erscheinungsbildes einer Bewegtbildproduktion verantwortlich ist. @de

Production company (Work)
type: Property
domain: Work
label: Produktionsunternehmen (Werk) @de
sub property of: Production company
name: productionCompanyWork
status: New-Proposed
definition: Eine Körperschaft, die für das finanzielle, technische und organisatorische Management einer Produktion für Bühne, Leinwand, Tonaufnahme, Fernsehen, Internetübertragung o.ä. verantwortlich ist. @de
definition: A corporate body that is responsible for financial, technical, and organizational management of a production for stage, screen, audio recording, television, webcast, etc.

Arranger of music (Expression)
type: Property
domain: Expression
label: Arrangeur (Expression) @de
sub property of: Contributor
name: arrangerOfMusicExpression
status: New-Proposed
definition: Eine Person, Familie oder Körperschaft, die zu einer Expression eines Musikwerkes beiträgt, indem sie eine Komposition mit einer bestimmen Originalbesetzung für eine andere Besetzung umschreibt oder das Werk für die Originalbesetzung modifiziert. Das Wesen des originären Musikstückes bleibt dabei unverändert. @de
definition: A person, family, or corporate body contributing to an expression of a musical work by rewriting the composition for a medium of performance different from that for which the work was originally intended, modifying the work for the same medium of performance, etc., such that the musical substance of the original composition remains essentially unchanged.

Costume designer
type: Property
label: Kostümbildner @de
name: costumeDesigner
status: New-Proposed

Singer
type: Property
label: Sänger @de
sub property of: Performer
name: singer
status: New-Proposed

Moderator (Expression)
type: Property
domain: Expression
name: moderatorExpression
status: New-Proposed
definition: Ein Darsteller, der an einer Expression eines Werkes mitwirkt, indem er ein Programm leitet (oft eine Rundfunk-Sendung), in dem Themen diskutiert werden, normalerweise mit Teilnahme von Experten auf den diskutierten Gebieten. @de
definition: A performer contributing to an expression of a work by leading a program (often broadcast) where topics are discussed, usually with participation of experts in fields related to the discussion.

On-screen presenter
type: Property
label: On-screen Presenter @de
sub property of: Performer
name: onScreenPresenter
status: New-Proposed

Recording engineer
type: Property
label: Toningenieur @de
name: recordingEngineer
status: New-Proposed

addressee (Work)
type: Property
domain: Work
label: Adressat (Werk) @de
sub property of: addressee
name: addresseeWork
status: New-Proposed
definition: Eine Person, Familie oder Körperschaft, an die Korrespondenz in einem Werk adressiert ist. @de
definition: A person, family, or corporate body to whom the work or part of the work is addressed.

Sponsoring body
type: Property
label: Sponsor @de
has subproperty: Sponsoring body (Work)
name: sponsoringBody
status: New-Proposed

Current owner
type: Property
label: Derzeitiger Besitzer @de
sub property of: Owner
has subproperty: Depositor
name: currentOwner
status: New-Proposed

Interviewee (Work)
type: Property
domain: Work
label: Interviewer (Werk) @de
sub property of: Creator
name: intervieweeWork
status: New-Proposed
definition: Eine Person, Familie oder Körperschaft, die für die Erschaffung eines Werkes verantwortlich ist, indem sie einem Interviewer antwortet, normalerweise einem Reporter, einem Meinungsforscher oder einem anderen, der Informationen zusammenträgt. @de
definition: A person, family, or corporate body responsible for creating a work by responding to an interviewer, usually a reporter, pollster, or some other information gathering agent.

Dancer
type: Property
label: Tänzer @de
sub property of: Performer
name: dancer
status: New-Proposed

Composer (Work)
type: Property
domain: Work
label: Komponist (Werk) @de
sub property of: Creator
name: composerWork
status: New-Proposed
definition: A person, family, or corporate body responsible for creating a musical work. Use also for persons, etc., adapting another musical work to form a distinct alteration (e.g., free transcription), paraphrasing a work or creating a work in the general style of another composer, or creating a work that is based on the music of another composer (e.g., variations on a theme).
definition: Eine Person, Familie oder Körperschaft, die für ein Musikwerk verantwortlich ist. Die Bezeichnung wird auch für Personen usw. verwendet, die ein anderes Musikwerk adaptiert haben, das sich deutlich vom Original unterscheidet, beispielsweise eine freie Bearbeitung. Oder die ein Werk im Stil eines anderen Komponisten umgeschrieben oder erschaffen hat oder ein Werk, das auf der Musik eines anderen Komponisten basiert, wie beispielsweise Variationen eines Themas. @de

Broadcaster
type: Property
sub property of: Publisher
name: broadcaster
status: New-Proposed
definition: Eine Person, eine Familie oder eine Körperschaft, die für Ausstrahlung einer Manifestation über Hörfunk, Fernsehen oder Webcast usw. verantwortlich ist. @de

Art director
type: Property
label: Art Director @de
name: artDirector
status: New-Proposed

Lithographer
type: Property
label: Lithograf @de
sub property of: Manufacturer
name: lithographer
status: New-Proposed

Caster (Manifestation)
type: Property
domain: Manifestation
label: Formgießer (Manifestation) @de
sub property of: Manufacturer (Manifestation)
name: casterManifestation
status: New-Proposed
definition: Eine Person, Familie oder Körperschaft, die in den Herstellungsprozess einer Manifestation durch das Gießen einer Flüssigkeit oder einer geschmolzenen Substanz in eine Form involviert ist. Die Substanz verbleibt in der Gießform, bis sie ausgehärtet ist. @de
definition: A person, family, or corporate body involved in producing a manifestation by pouring a liquid or molten substance into a mold and leaving it to solidify to take the shape of the mold.

Composer (Expression)
type: Property
domain: Expression
label: Komponist (Expression) @de
sub property of: Contributor
name: composerExpression
status: New-Proposed
definition: Eine Person, Familie oder Körperschaft, die zu einer Expression eines Werkes beiträgt, indem sie als Ersatz für die Originalmusik neue Musik komponiert oder neue Musik komponiert, die die existierende Musik ergänzt. @de
definition: A person, family, or corporate body contributing to an expression by composing new music to substitute for the original music, or by composing new music to supplement the existing music.

Draftsman
type: Property
label: Technischer Zeichner @de
name: draftsman
status: New-Proposed

Etcher
type: Property
label: Radierer @de
sub property of: Manufacturer
name: etcher
status: New-Proposed

Respondent
type: Property
name: respondent
status: New-Proposed

Surveyor (Expression)
type: Property
domain: Expression
label: Vermesser (Expression) @de
sub property of: Contributor
name: surveyorExpression
status: New-Proposed
definition: Eine Person, Familie oder Körperschaft, die an der Expression eines kartografischen Werkes mitwirkt, indem sie Messwerte oder Abmessungsverhältnisse für den dargestellten geografischen Bereich zur Verfügung stellt. @de
definition: A person, family, or corporate body contributing to an expression of a cartographic work by providing measurements or dimensional relationships for the geographic area represented.

Translator (Expression)
type: Property
domain: Expression
label: Übersetzer (Expression) @de
sub property of: Contributor
name: translatorExpression
status: New-Proposed
definition: Eine Person, Familie oder Körperschaft, die an einer Expression eines Werkes mitwirkt, indem sie eine Sprache in eine andere übersetzt, oder aus einer älteren Sprachform in die moderne Form, die mehr oder weniger eng dem Originaltext des Werkes folgt. @de
definition: A person, family, or corporate body contributing to an expression of a work by rendering one language into another, or from an older form of a language into the modern form, that more or less closely follows the original text of the work.

Judge (Work)
type: Property
domain: Work
label: Richter (Werk) @de
sub property of: Judge
name: judgeWork
status: New-Proposed
definition: A person who hears and decides on legal matters in court.
definition: Eine Person, die bei Gericht gesetzliche Angelegenheiten anhört und darüber entscheidet. @de

Printmaker
type: Property
label: Druckgrafiker @de
sub property of: Manufacturer
name: printmaker
status: New-Proposed

Annotator (Item)
type: Property
domain: Item
label: Annotator (Exemplar) @de
sub property of: Annotator
name: annotatorItem
status: New-Proposed
definition: Eine Person, die handschriftlich Anmerkungen in ein spezifisches Exemplar schreibt. @de
definition: A person who makes manuscript annotations on a specific item.

Photographer (Work)
type: Property
domain: Work
label: Fotograf (Werk) @de
sub property of: Creator
name: photographerWork
status: New-Proposed
definition: A person, family, or corporate body responsible for creating a photographic work.
definition: Eine Person, Familie oder Körperschaft, die für die Erstellung eines fotografischen Werks verantwortlich ist. @de

Writer of added text
type: Property
label: Verfasser von Zusatztexten @de
has subproperty: Writer of added lyrics
name: writerOfAddedText
status: New-Proposed

Sculptor
type: Property
label: Bildhauer @de
sub property of: Artist
name: sculptor
status: New-Proposed

Collection registrar
type: Property
label: Registrar @de
sub property of: Curator
name: collectionRegistrar
status: New-Proposed

Radio producer
type: Property
label: Hörfunkproduzent @de
sub property of: Producer
name: radioProducer
status: New-Proposed

Host institution (Work)
type: Property
domain: Work
label: Veranstalter (Werk) @de
sub property of: Host institution
name: hostInstitutionWork
status: New-Proposed
definition: A corporate body hosting an event, exhibit, conference, etc., which gave rise to the work, but having little or no responsibility for the content of the work.
definition: Eine Körperschaft, die eine Veranstaltung, eine Ausstellung, einen Kongress usw. ausrichtet, die/der ein Werk zur Folge hat, die aber für den Inhalt des Werkes wenig oder gar keine Verantwortung für trägt. @de

Host
type: Property
label: Gastgeber @de
sub property of: Performer
name: host
status: New-Proposed

Lithographer (Manifestation)
type: Property
domain: Manifestation
label: Lithograf (Manifestation) @de
sub property of: Manufacturer (Manifestation)
name: lithographerManifestation
status: New-Proposed
definition: A person, family, or corporate body involved in producing a manifestation by preparing a stone or plate for lithographic printing, including a graphic artist creating a design directly on the surface from which printing will be done.
definition: Eine Person, Familie oder Körperschaft, die in die Erstellung einer Manifestation eingebunden ist, indem sie einen Stein oder eine Platte für lithografischen Druck vorbereitet, einschließlich eines Grafikers, der ein Muster direkt auf der Oberfläche erstellt, von der aus gedruckt werden wird. @de

Interviewer (Work)
type: Property
domain: Work
label: Interviewter (Werk) @de
sub property of: Creator
name: interviewerWork
status: New-Proposed
definition: A person, family, or corporate body responsible for creating a work by acting as an interviewer, reporter, pollster, or some other information gathering agent.
definition: Eine Person, Familie oder Körperschaft, die für die Erschaffung eines Werkes verantwortlich ist, indem sie einem Interviewer antwortet, normalerweise einem Reporter, einem Meinungsforscher oder einem anderen, der Informationen zusammenträgt. @de

Director (Work)
type: Property
domain: Work
sub property of: Director
has subproperty: Television director (Work)
has subproperty: Radio director (Work)
has subproperty: Film director (Work)
name: directorWork
status: New-Proposed
definition: A person, family, or corporate body responsible for the general management and supervision of a filmed performance, a radio or television program, etc.

Inventor (Work)
type: Property
domain: Work
label: Erfinder (Werk) @de
sub property of: Creator
name: inventorWork
status: New-Proposed
definition: Eine Person, Familie oder Körperschaft, die für die Erschaffung eines neuen Gerätes oder Prozesses verantwortlich ist. @de
definition: A person, family, or corporate body responsible for creating a new device or process.

Singer (Expression)
type: Property
domain: Expression
label: Sänger (Expression) @de
sub property of: Performer (Expression)
name: singerExpression
status: New-Proposed
definition: A performer contributing to an expression of a work by using his/her/their voice, with or without instrumental accompaniment, to produce music. A singer’s performance may or may not include actual words.
definition: Ein Darsteller, der an einer Expression eines Werkes mitwirkt, indem er durch seine Stimme mit oder ohne instrumentale Begleitung Musik erzeugt. Die Darbietung eines Sängers kann Worte enthalten oder nicht. @de

Puppeteer (Expression)
type: Property
domain: Expression
label: Puppenspieler (Expression) @de
name: puppeteerExpression
status: New-Proposed
definition: Ein Darsteller, der an einer Expression eines Werkes mitwirkt, indem er Puppen oder Marionetten in einer Bewegtbildproduktion oder einer musikalischen oder dramatischen Darbietung oder Aufführung bewegt, kontrolliert oder lenkt. @de
definition: A performer contributing to an expression of a work by manipulating, controlling, or directing puppets or marionettes in a moving image production or a musical or dramatic presentation or entertainment.

Plaintiff
type: Property
label: Zivilkläger @de
has subproperty: Plaintiff (Work)
name: plaintiff
status: New-Proposed

Donor (Item)
type: Property
domain: Item
label: Stifter (Exemplar) @de
sub property of: Former owner (Item)
name: donorItem
status: New-Proposed
definition: Ein ehemaliger Eigentümer eines Exemplars, der dieses Exemplar jemand anderem überlassen hat. @de
definition: A former owner of an item who donated that item to the another owner.

Composer of Additional Music
type: Property
label: Komponist eines zusätzlichen Musikstückes @de
has subproperty: Composer of Additional Music (Expression)
name: composerOfAdditionalMusic
status: New-Proposed
definition: Eine Person, Familie oder Körperschaft, die zu einer Expression eines Musikwerkes durch Begleitkompositionen oder Zusätze (wie zusätzliche Parts für Stimmen/Instrumente oder weitere Musikstücke) beiträgt, welche die Musik des ursprünglichen Komponisten ergänzen. @de
definition: A person, family, or corporate body contributing to an expression of a musical work by composing accompaniments or additional parts (e.g., vocal/instrumental parts, musical numbers) that supplement the music written by the original composer.

Director of photography (Work)
type: Property
comment: Use this designation also for videographers.
domain: Work
label: Verantwortlicher Kameramann (Werk) @de
sub property of: Director of photography
name: directorOfPhotographyWork
status: New-Proposed
definition: A person, family, or corporate body that captures images, either electronically or on film or video stock, and often selects and arranges the lighting. The director of photography for a movie is also called the chief cinematographer.
definition: Eine Person, Familie oder Körperschaft, die Bilder festhält, entweder elektronisch oder auf Film- oder Videomaterial, und häufig die Belichtung auswählt und arrangiert. Der verantwortliche Kameramann für einen Film wird auch als "Leitender Kamermann" bezeichnet. Diese Bezeichnung wird auch für "Videograph" verwendet. @de

Creator
type: Property
domain: Work
label: geistiger Schöpfer @de
has subproperty: Interviewer (Work)
has subproperty: Designer (Work)
has subproperty: Filmmaker (Work)
has subproperty: Compiler (Work)
has subproperty: Composer (Work)
has subproperty: Artist (Work)
has subproperty: Cartographer (Work)
has subproperty: Inventor (Work)
has subproperty: Architect (Work)
has subproperty: Author (Work)
has subproperty: Interviewee (Work)
has subproperty: Photographer (Work)
has subproperty: Programmer (Work)
has subproperty: Enacting jurisdiction (Work)
has subproperty: Choreographer (Work)
has subproperty: Praeses (Work)
has subproperty: Respondent (Work)
name: creator
status: New-Proposed
definition: A person, family, or corporate body responsible for the creation of a work.
definition: Eine Person, Familie oder Körperschaft, die für die Schaffung eines Werkes verantwortlich ist. @de

Production company
type: Property
label: Produktionsunternehmen @de
has subproperty: Production company (Work)
name: productionCompany
status: New-Proposed
definition: Eine Körperschaft, die für das finanzielle, technische und organisatorische Management einer Produktion für Bühne, Leinwand, Tonaufnahme, Fernsehen, Internetübertragung o.ä. verantwortlich ist. @de

Storyteller
type: Property
label: Geschichtenerzähler @de
sub property of: Performer
name: storyteller
status: New-Proposed

Screenwriter (Work)
type: Property
domain: Work
label: Drehbuchautor (Werk) @de
sub property of: Author (Work)
name: screenwriterWork
status: New-Proposed
definition: An author of a screenplay, script, or scene.
definition: Ein Autor eines Drehbuchs, eines Manuskripts oder einer Szene. @de

Panelist
type: Property
label: Diskussionsteilnehmer @de
sub property of: Performer
name: panelist
status: New-Proposed

Landscape architect
type: Property
label: Landschaftsarchitekt @de
sub property of: Architect
name: landscapeArchitect
status: New-Proposed

Translator
type: Property
label: Übersetzer @de
name: translator
status: New-Proposed

Screenwriter
type: Property
label: Drehbuchautor @de
sub property of: Author
name: screenwriter
status: New-Proposed

Film director (Work)
type: Property
domain: Work
label: Filmregisseur (Werk) @de
sub property of: Director (Work)
name: filmDirectorWork
status: New-Proposed
definition: A director responsible for the general management and supervision of a filmed performance.
definition: Eine Person, Familie oder Körperschaft, die für das allgemeine Management und die Leitung einer verfilmten Darbietung verantwortlich ist. @de

Book designer (Manifestation)
type: Property
domain: Manifestation
label: Buchgestalter (Manifestation) @de
sub property of: Manufacturer (Manifestation)
name: bookDesignerManifestation
status: New-Proposed
definition: Eine Person, Familie oder Körperschaft, die für das gesamte grafische Design eines Buches verantwortlich ist, einschließlich Schriftbild, Bildgestaltung, Materialwahl und der angewandten Verfahren. @de
definition: A person, family, or corporate body involved in manufacturing a manifestation by being responsible for the entire graphic design of a book, including arrangement of type and illustration, choice of materials, and process used.

Writer of added lyrics
type: Property
label: Verfasser eines Textes, der nachträglich einem Musikwerk unterlegt wird @de
sub property of: Writer of added text
name: writerOfAddedLyrics
status: New-Proposed

Autographer
type: Property
label: Unterzeichner @de
has subproperty: Autographer (item)
name: autographer
status: New-Proposed

Printer
type: Property
label: Drucker @de
sub property of: Manufacturer
name: printer
status: New-Proposed

Interviewee (Expression)
type: Property
domain: Expression
label: Interviewter (Expression) @de
sub property of: Contributor
name: intervieweeExpression
status: New-Proposed
definition: Eine Person, Familie oder Körperschaft, die für die Erschaffung eines Werkes verantwortlich ist, indem sie einem Interviewer antwortet, normalerweise einem Reporter, einem Meinungsforscher oder einem anderen, der Informationen zusammenträgt. @de
definition: A person, family, or corporate body contributing to an expression of a work by responding to an interviewer, usually a reporter, pollster, or some other information gathering agent.

Producer
type: Property
label: Produzent @de
has subproperty: Film producer
has subproperty: Producer (Work)
has subproperty: Television producer
has subproperty: Radio producer
name: producer
status: New-Proposed

Collector (Item)
type: Property
domain: Item
label: Sammler (Exemplar) @de
name: collectorItem
status: New-Proposed
definition: Jemand, der Materialien aus unterschiedlichen Quellen zusammenträgt, die zu einer Sammlung zusammengestellt, beschrieben und katalogisiert werden. @de
definition: A curator who brings together material from various sources that are then arranged, described, and cataloged as a collection.

Manufacturer (Manifestation)
type: Property
domain: Manifestation
label: Hersteller (Manifestation) @de
sub property of: Manufacturer
has subproperty: Lithographer (Manifestation)
has subproperty: Engraver (Manifestation)
has subproperty: Book designer (Manifestation)
has subproperty: Platemaker (Manifestation)
has subproperty: Caster (Manifestation)
has subproperty: Printer (Manifestation)
has subproperty: Etcher (Manifestation)
has subproperty: Braille embosser (Manifestation)
has subproperty: Printmaker (Manifestation)
has subproperty: Collotyper (Manifestation)
name: manufacturerManifestation
status: New-Proposed
definition: A person, family, or corporate body responsible for printing, duplicating, casting, etc., a resource in a published form.
definition: Eine Person, Familie oder Körperschaft, die für den Druck, die Vervielfältigung, Auswahl etc. einer Ressource in einer veröffentlichten Form verantwortlich ist. @de

Librettist
type: Property
sub property of: Author
name: librettist
status: New-Proposed

Host (Expression)
type: Property
domain: Expression
label: Gastgeber (Expression) @de
name: hostExpression
status: New-Proposed
definition: Ein Darsteller, der an einer Expression eines Werkes mitwirkt, indem er ein Programm leitet, häufig im Rundfunk, an dem auch andere Gäste, Darsteller usw. teilnehmen (z.B. der Gastgeber einer Talkshow). @de
definition: A performer contributing to an expression of a work by leading a program (often broadcast) that includes other guests, performers, etc. (e.g., talk show host).

Honouree
type: Property
label: Gefeierte Person @de
has subproperty: Honouree of item
has subproperty: Honouree (Work)
name: honouree
status: New-Proposed

Printer (Manifestation)
type: Property
domain: Manifestation
label: Drucker (Manifestation) @de
sub property of: Manufacturer (Manifestation)
name: printerManifestation
status: New-Proposed
definition: A person, family, or corporate body involved in producing a manifestation of printed text, notated music, etc., from type or plates, such as a book, newspaper, magazine, broadside, score, etc.
definition: Eine Person, Familie oder Körperschaft, die an der Produktion einer Manifestation von gedrucktem Text, notierter Musik usw. durch Drucktypen oder Druckformen, wie z.B. ein Buch, eine Zeitung, ein Magazin, ein Einblattdruck, eine Partitur o.ä. beteiligt ist. @de

Engraver (Manifestation)
type: Property
domain: Manifestation
label: Graveur (Manifestation) @de
sub property of: Manufacturer (Manifestation)
name: engraverManifestation
status: New-Proposed
definition: Eine Person, Familie oder Körperschaft, die in die Produktion einer Manifestation eingebunden ist, indem sie Buchstaben, Zahlen usw. in eine Oberfläche, wie z.B. eine Holz- oder Metallplatte, die zum Drucken benutzt wird, schneidet. @de
definition: A person, family, or corporate body involved in manufacturing a manifestation by cutting letters, figures, etc., on a surface such as a wooden or metal plate used for printing.

Editor of moving image work
type: Property
label: Cutter @de
name: editorOfMovingImageWork
status: New-Proposed

Transcriber (Expression)
type: Property
domain: Expression
label: Transkribierer (Expression) @de
sub property of: Contributor
name: transcriberExpression
status: New-Proposed
definition: A person, family, or corporate body contributing to an expression of a work by changing it from one system of notation to another.
definition: Eine Person, Familie oder Körperschaft, die an einer Expression eines Werkes mitwirkt, indem sie es von einem Notationssystem in ein anderes überträgt. @de

Manufacturer
type: Property
label: Hersteller @de
has subproperty: Printer
has subproperty: Printmaker
has subproperty: Caster
has subproperty: Braille embosser
has subproperty: Engraver
has subproperty: Collotyper
has subproperty: Manufacturer (Manifestation)
has subproperty: Lithographer
has subproperty: Book designer
has subproperty: Etcher
has subproperty: Platemaker
name: manufacturer
status: New-Proposed
definition: Eine Person, Familie oder Körperschaft, die für den Druck, die Vervielfältigung, Auswahl etc. einer Ressource in einer veröffentlichten Form verantwortlich ist. @de

Curator
type: Property
label: Kurator @de
has subproperty: Collection registrar
has subproperty: Collector
has subproperty: Curator (Item)
name: curator
status: New-Proposed

Recordist (Expression)
type: Property
domain: Expression
sub property of: Contributor
name: recordistExpression
status: New-Proposed
definition: A person, family, or corporate body contributing to an expression of a work by using a recording device to capture sound and/or video during a recording session, including field recordings of natural sounds, folkloric events, music, etc.
definition: Eine Person, Familie oder Körperschaft, die an einer Expression eines Werkes mitwirkt, indem sie mit einem Aufzeichnungsgerät Ton und/oder Bild aufnimmt, einschließlich Außenaufnahmen natürlicher Geräusche, folkloristischer Veranstaltungen, Musik o.ä. @de

Composer of Music for Sound Film
type: Property
label: Filmkomponist @de
has subproperty: Composer of Music for Sound Film (Expression)
name: composerOfMusicForSoundFilm
status: New-Proposed
definition: Eine Person, Familie oder Körperschaft, die für Kompositionen verantwortlich ist, die einen Teil eines Bewegtbildwerkes bilden, das mit synchronisiertem und integriertem Ton aufgenommen wurde. Diese Musikwerke können entweder eigens für das bewegte Bild geschriebene oder bereits bestehende Werke sein, die in den Bewegtbildsoundtrack eingebunden wurden. @de
definition: A person, family, or corporate body responsible for contributing compositions that form part of the presentation of a moving image work recorded with a synchronized, integrated soundtrack. These musical works may be originally written for the moving image or be pre-existing works that are incorporated into the moving image soundtrack.

Inscriber
type: Property
label: Person, deren handschriftliche Anmerkungen in einem Exemplar erscheinen @de
has subproperty: Inscriber (Item)
name: inscriber
status: New-Proposed

Appellee
type: Property
label: Berufungsbeklagter / Revisionsbeklagter @de
has subproperty: Appellee (Work)
name: appellee
status: New-Proposed
definition: Eine natürliche oder juristische Person, gegen die Rechtsmittel (Berufung / Revision) eingelegt wurde. @de

Inscriber (Item)
type: Property
domain: Item
label: Person, deren handschriftliche Anmerkungen in einem Exemplar erscheinen (Exemplar) @de
sub property of: Inscriber
name: inscriberItem
status: New-Proposed
definition: A person whose manuscript notes appear on an item.
definition: Eine Person, deren handschriftliche Anmerkungen in einem Exemplar erkennbar sind. @de

Thesis Advisor
type: Property
name: thesisAdvisor
status: New-Proposed

Abridger
type: Property
has subproperty: Abridger (Expression)
name: abridger
status: New-Proposed

Illuminator
type: Property
has subproperty: Illuminator (Item)
name: illuminator
status: New-Proposed

Respondent (Work)
type: Property
domain: Work
label: Respondent (Werk) @de
sub property of: Creator
name: respondentWork
status: New-Proposed
definition: Ein Kandidat für einen akademischen Grad, der eine These, die von dem Disputationsleiter in einer akademischen Disputation aufgestellt wurde, verteidigt oder ablehnt. Auch Proponent / Opponent genannt. @de
definition: A candidate for a degree who defends or opposes a theses provided by the praeses in an academic disputation. Also called defendant.

Editor (Expression)
type: Property
domain: Expression
label: Herausgeber (Expression) @de
sub property of: Contributor
name: editorExpression
status: New-Proposed
definition: A person, family, or corporate body contributing to an expression of a work by revising or elucidating the content, e.g., adding an introduction, notes, or other critical matter. An editor may also prepare an expression of a work for production, publication, or distribution.
definition: Eine Person, Familie oder Körperschaft, die an einer Expression eines Werkes mitwirkt, indem sie den Inhalt überarbeitet oder erläutert, beispielsweise indem sie eine Einleitung oder Anmerkungen oder anderes kritisches Material hinzufügt. Ein Herausgeber kann ebenso eine Expression eines Werkes für die Produktion, die Herausgabe oder den Vertrieb vorbereiten. @de

Commentator
type: Property
label: Kommentator (mündlich) @de
sub property of: Performer
name: commentator
status: New-Proposed

Court reporter
type: Property
label: Gerichtsstenograf @de
name: courtReporter
status: New-Proposed
definition: Eine Person, Familie oder Körperschaft, die zu einer Expression eines Werkes beiträgt, indem sie die Auffassung eines Gerichts zur Veröffentlichung vorbereitet. @de

Artist (Work)
type: Property
domain: Work
label: Künstler (Werk) @de
sub property of: Creator
name: artistWork
status: New-Proposed
definition: Eine Person, Familie oder Körperschaft, die für die Idee und meist auch Umsetzung eines Werkes in Form einer Grafik, einer Zeichnung oder eines Gemäldes verantwortlich ist. @de
definition: A person, family, or corporate body responsible for creating a work by conceiving, and often implementing, an original graphic design, drawing, painting, etc.

Transcriber
type: Property
label: Transkribierer @de
name: transcriber
status: New-Proposed

Sculptor (Work)
type: Property
domain: Work
label: Bildhauer (Werk) @de
name: sculptorWork
status: New-Proposed
definition: Ein Künstler, der für die Erstellung eines dreidimensionalen Werkes durch Modellierung, Schnitzen oder ähnliche Techniken verantwortlich ist. @de
definition: An artist responsible for creating a three-dimensional work by modeling, carving, or similar technique.

Court governed
type: Property
has subproperty: Court governed (Work)
name: courtGoverned
status: New-Proposed
definition: Ein Gericht geregelt von der Prozessordnung (unabhängig von deren förmlicher Rechtsnatur, zum Beispiel Gesetze, Verwaltungsvorschriften). @de

Narrator
type: Property
label: Erzähler @de
sub property of: Performer
name: narrator
status: New-Proposed

Lyricist (Work)
type: Property
domain: Work
label: Textdichter (Werk) @de
sub property of: Author (Work)
name: lyricistWork
status: New-Proposed
definition: An author of the words of a non-dramatic musical work, except for oratorios.
definition: Ein Verfasser des Textes eines nicht-dramatischen musikalischen Werkes, ausgenommen für Oratorien. @de

Television producer (Work)
type: Property
domain: Work
label: Fernsehproduzent (Werk) @de
sub property of: Producer (Work)
name: televisionProducerWork
status: New-Proposed
definition: Eine Person, Familie oder Körperschaft, die die Verantwortung für die meisten geschäftlichen Aspekte eines Fernsehprogramms übernimmt. Der Fernsehproduzent ist hauptsächlich verantwortlich für die Geldbeschaffung, das Produktionsmanagement, die Einstellung der Kompetenzträger, die Organisation des Vertriebs, die Absicherung des kommerziellen Erfolges usw. @de
definition: A producer responsible for most of the business aspects of a television program.

Actor
type: Property
label: Schauspieler @de
sub property of: Performer
name: actor
status: New-Proposed

Writer of added lyrics (Expression)
type: Property
domain: Expression
label: Verfasser eines Textes, der nachträglich einem Musikwerk unterlegt wird (Expression). @de
name: writerOfAddedLyricsExpression
status: New-Proposed
definition: Ein Verfasser eines Textes, der einer Expression eines Musikwerkes beigefügt wird. @de
definition: A writer of words added to an expression of a musical work.

Radio producer (Work)
type: Property
domain: Work
label: Hörfunkproduzent (Werk) @de
sub property of: Producer (Work)
name: radioProducerWork
status: New-Proposed
definition: Eine Person, Familie oder Körperschaft, die die Verantwortung für die meisten geschäftlichen Aspekte eines Radioprogramms übernimmt. Der Radioproduzent ist hauptsächlich verantwortlich für die Geldbeschaffung, das Produktionsmanagement, die Einstellung der Kompetenzträger, die Organisation des Vertriebs, die Absicherung des kommerziellen Erfolges usw. @de
definition: A producer responsible for most of the business aspects of a radio program.

Degree granting institution (Work)
type: Property
domain: Work
label: Institution, die einen akademischen Grad verleiht (Werk) @de
sub property of: Degree granting institution
name: degreeGrantingInstitutionWork
status: New-Proposed
definition: Eine Körperschaft, die einen akademischen Grad verleiht, z.T. basierend auf der Einreichung einer Hochschulschrift o.ä. @de
definition: A corporate body granting an academic degree, based in part on the submission of a thesis, dissertation, etc.

Host institution
type: Property
label: Veranstalter @de
has subproperty: Host institution (Work)
name: hostInstitution
status: New-Proposed

Writer of added commentary
type: Property
label: Kommentator (schriftlich) @de
name: writerOfAddedCommentary
status: New-Proposed

Dedicatee of Item
type: Property
domain: Item
label: Person, der ein Exemplar gewidmet ist @de
sub property of: Dedicatee
name: dedicateeOfItem
status: New-Proposed
definition: A person, family, or corporate body to whom an item is dedicated.
definition: Eine Person, Familie oder Körperschaft, der ein Exemplar gewidmet ist. @de

Landscape architect (Work)
type: Property
domain: Work
label: Landschaftsarchitekt (Werk) @de
name: landscapeArchitectWork
status: New-Proposed
definition: Ein Architekt, der für die Erschaffung landschaftlicher Werke verantwortlich ist. @de
definition: An architect responsible for creating landscape works.

Restorationist
type: Property
label: Restaurator @de
has subproperty: Restorationist (Item)
name: restorationist
status: New-Proposed

Dedicatee
type: Property
label: Person, der ein Werk gewidmet ist @de
has subproperty: Dedicatee of Item
has subproperty: Dedicatee (Work)
name: dedicatee
status: New-Proposed

Broadcaster (Manifestation)
type: Property
domain: Manifestation
sub property of: Publisher (Manifestation)
name: broadcasterManifestation
status: New-Proposed
definition: A person, family, or corporate body responsible for broadcasting a manifestation to an audience via radio, television, webcast, etc.
definition: Eine Person, eine Familie oder eine Körperschaft, die für Ausstrahlung einer Manifestation über Hörfunk, Fernsehen oder Webcast usw. verantwortlich ist. @de

Interviewer (Expression)
type: Property
domain: Expression
sub property of: Contributor
name: interviewerExpression
status: New-Proposed
definition: Eine Person, Familie oder Körperschaft, die für die Erschaffung eines Werkes verantwortlich ist, indem sie als Interviewer, Reporter, Meinungsforscher oder anderer Informationssammler tätig ist. @de
definition: A person, family, or corporate body contributing to an expression of a work by acting as an interviewer, reporter, pollster, or some other information gathering agent.

Instrumentalist (Expression)
type: Property
domain: Expression
label: Instrumentalmusiker (Expression) @de
sub property of: Performer (Expression)
name: instrumentalistExpression
status: New-Proposed
definition: A performer contributing to an expression of a work by playing a musical instrument.
definition: Ein Darsteller, der durch das Spielen eines Musikinstruments an einer Expression eines Werkes mitwirkt. @de

Filmmaker
type: Property
name: Filmmaker
status: New-Proposed
definition: A person, family, or corporate body responsible for creating an independent or personal film. A filmmaker is individually responsible for the conception, and execution of all aspects of the film.

Art director (Expression)
type: Property
domain: Expression
label: Art Director (Expression) @de
sub property of: Contributor
name: artDirectorExpression
status: New-Proposed
definition: A person, family or corporate body responsible for overseeing the artists and craftspeople who build the sets for moving image productions.
definition: Eine Person, Familie oder Körperschaft, die für die Künstler und Kunsthandwerker, die ein Set für eine Bewegtbildproduktion aufbauen, verantwortlich ist. @de

Composer of Additional Music (Expression)
type: Property
sub property of: Composer of Additional Music
name: composerOfAdditionalMusicExpression
status: New-Proposed
definition: A person, family, or corporate body contributing to an expression of a musical work by composing accompaniments or additional parts (e.g., vocal/instrumental parts, musical numbers) that supplement the music written by the original composer.

Author (Work)
type: Property
domain: Work
label: Verfasser (Werk) @de
sub property of: Creator
has subproperty: Librettist (Work)
has subproperty: Screenwriter (Work)
has subproperty: Lyricist (Work)
name: authorWork
status: New-Proposed
definition: Eine Person, Familie oder Körperschaft, die verantwortlich für die Erstellung eines Werkes ist, das im Wesentlichen aus Text besteht, unabhängig vom Medientyp (gedruckter Text, gesprochenes Wort, elektronischer Text, taktiler Text usw.) oder von der Gattung (Gedichte, Romane, Drehbücher, Blogs usw.). Die Rolle wird auch für Personen verwendet, die den Charakter und den Inhalt eines Originalwerkes wesentlich durch Paraphrasieren, Umschreiben oder Adaption verändern und so ein neues Werk erschaffen, oder den Medientyp einer Expression ändern. @de
definition: A person, family, or corporate body responsible for creating a work that is primarily textual in content, regardless of media type (e.g., printed text, spoken word, electronic text, tactile text) or genre (e.g., poems, novels, screenplays, blogs). Use also for persons, etc., creating a new work by paraphrasing, rewriting, or adapting works by another creator such that the modification has substantially changed the nature and content of the original or changed the medium of expression.

Conductor (Expression)
type: Property
domain: Expression
label: Dirigent (Expression) @de
name: conductorExpression
status: New-Proposed
definition: Jemand, der zu einer Expression eines Musikwerkes beiträgt, indem er ein aufführendes Ensemble (Orchester, Chor, Oper usw.) in einer musikalischen oder darstellenden Vorführung leitet. @de
definition: A performer contributing to an expression of a musical work by leading a performing group (orchestra, chorus, opera, etc.) in a musical or dramatic presentation, etc.

Recordist
type: Property
name: recordist
status: New-Proposed

Actor (Expression)
type: Property
domain: Expression
label: Schauspieler (Expression) @de
sub property of: Performer (Expression)
name: actorExpression
status: New-Proposed
definition: A performer contributing to an expression of a work by acting as a cast member or player in a musical or dramatic presentation, etc.
definition: Ein Darsteller, der zu einer Expression eines Werkes als Ensemble-Mitglied oder Darsteller in einer musikalischen oder dramatischen Darbietung usw. beiträgt. @de

Compiler
type: Property
name: compiler
status: New-Proposed

Moderator
type: Property
sub property of: Performer
name: moderator
status: New-Proposed

Cartographer (Work)
type: Property
domain: Work
label: Kartograf (Werk) @de
sub property of: Creator
name: cartographerWork
status: New-Proposed
definition: A person, family, or corporate body responsible for creating a map, atlase, globe, or other cartographic work.
definition: Eine Person, Familie oder Körperschaft, die für das Erstellen einer Karte, eines Atlasses, eines Globusses oder eines anderen kartografischen Werkes verantwortlich ist. @de

Sponsoring body (Work)
type: Property
domain: Work
label: Sponsor (Werk) @de
sub property of: Sponsoring body
name: sponsoringBodyWork
status: New-Proposed
definition: A person, family, or corporate body sponsoring some aspect of the work, e.g., funding research, sponsoring an event.
definition: Eine Person, Familie oder Körperschaft, die einzelne Aspekte des Werks finanziell unterstützt, z. B. Forschungsförderung, finanzielle Unterstützung einer Veranstaltung. @de

Publisher
type: Property
label: Verlag @de
has subproperty: Broadcaster
has subproperty: Publisher (Manifestation)
name: publisher
status: New-Proposed
definition: Eine Person, Familie oder Körperschaft, die für das Veröffentlichen, die Freigabe oder die Herausgabe einer Ressource verantwortlich ist. @de

addressee
type: Property
label: Adressat @de
has subproperty: addressee (Work)
name: addressee
status: New-Proposed

Storyteller (Expression)
type: Property
domain: Expression
label: Geschichtenerzähler (Expression) @de
sub property of: Performer (Expression)
name: storytellerExpression
status: New-Proposed
definition: Ein Darsteller, der an einer Expression eines Werks mitwirkt, indem er die ursprüngliche Geschichte eines geistigen Schöpfers mit dramatischer oder theatralischer Interpretation weitergibt. @de
definition: A performer contributing to an expression of a work by relaying a creator’s original story with dramatic or theatrical interpretation.

Interviewer
type: Property
name: interviewer
status: New-Proposed
definition: Eine Person, Familie oder Körperschaft, die für die Erschaffung eines Werkes verantwortlich ist, indem sie als Interviewer, Reporter, Meinungsforscher oder anderer Informationssammler tätig ist. @de

Praeses
type: Property
label: Disputationsleiter @de
name: praeses
status: New-Proposed

Musical director (Expression)
type: Property
domain: Expression
label: Musikalischer Leiter (Expression) @de
sub property of: Contributor
name: musicalDirectorExpression
status: New-Proposed
definition: Eine Person, Familie oder Körperschaft, die für die Koordinierung der Arbeit des Komponisten, des Tonbearbeiters und Tonmeisters für eine Bewegtbildproduktion oder eine musikalische oder dramatische Darbietung oder Aufführung verantwortlich ist. @de
definition: A person, family, or corporate body contributing to an expression of a work by coordinating the activities of the composer, the sound editor, and sound mixers for a moving image production or for a musical or dramatic presentation or entertainment.

Binder (Item)
type: Property
domain: Item
label: Eine Person, die ein Exemplar bindet. @de
label: Buchbinder (Exemplar) @de
sub property of: Binder
name: binderItem
status: New-Proposed
definition: A person who binds a specific item.

Composer of Incidental Music
type: Property
label: Komponist von Begleitmusik @de
has subproperty: Composer of Incidental Music (Expression)
name: composerOfIncidentalMusic
status: New-Proposed
definition: Eine Person, Familie oder Körperschaft, die zu einer Expression eines Werkes durch die Komposition von Musik für ein bereits bestehendes, meist textliches, Werk beiträgt. @de
definition: A person, family, or corporate body contributing to an expression of a work by composing music for a pre-existing, usually textual, work.

Collotyper (Manifestation)
type: Property
domain: Manifestation
label: Drucker (im Lichtdruckverfahren) (Manifestation) @de
sub property of: Manufacturer (Manifestation)
name: collotyperManifestation
status: New-Proposed
definition: Eine Person, Familie oder Körperschaft, die an der Produktion einer Manifestation aus Fotodrucken von Film oder einem anderem Kolloiden, der Druckerfarbe anziehende und abstoßende Flächen aufweist, beteiligt ist. @de
definition: A person, family, or corporate body involved in producing a manifestation of photographic prints from film or other colloid that has ink-receptive and ink-repellent surfaces.

Illustrator
type: Property
name: illustrator
status: New-Proposed

Book designer
type: Property
label: Buchgestalter @de
sub property of: Manufacturer
name: bookDesigner
status: New-Proposed

Composer of Music for Silent Film (Expression)
type: Property
sub property of: Composer of Music for Silent Film
name: composerOfMusicForSilentFilmExpression
status: New-Proposed
definition: A person, family, or corporate body responsible for contributing compositions to accompany the presentation of a moving image work produced in the silent film era and recorded without a synchronized, integrated soundtrack. These musical works may be originally written for the moving image or may consist of or incorporate pre-existing works in a manner that is intended to complement the moving image.

New-Proposed
type: Concept

Interviewee
type: Property
label: Interviewter @de
name: interviewee
status: New-Proposed
definition: Eine Person, Familie oder Körperschaft, die für die Erschaffung eines Werkes verantwortlich ist, indem sie einem Interviewer antwortet, normalerweise einem Reporter, einem Meinungsforscher oder einem anderen, der Informationen zusammenträgt. @de

Architect
type: Property
label: Architekt @de
has subproperty: Landscape architect
name: architect
status: New-Proposed

Appellant
type: Property
label: Berufungskläger / Revisionskläger @de
has subproperty: Appellant (Work)
name: appellant
status: New-Proposed
definition: Eine natürliche oder juristische Person, die gegen ein Gerichtsurteil einer unteren Instanz Rechtsmittel (Berufung / Revision) einlegt. @de

Architect (Work)
type: Property
domain: Work
label: Architekt (Werk) @de
sub property of: Creator
name: architectWork
status: New-Proposed
definition: Eine Person, Familie oder Körperschaft, die für eine architektonische Gestaltung verantwortlich ist, einschließlich einer bildlichen Darstellung, die zeigt, wie ein Gebäude o. ä. aussieht, wenn es fertig gebaut sein wird. @de
definition: A person, family, or corporate body responsible for creating an architectural design, including a pictorial representation intended to show how a building, etc., will look when completed.

Court governed (Work)
type: Property
domain: Work
label: Court governed @de
sub property of: Court governed
name: courtGovernedWork
status: New-Proposed
definition: A court governed by court rules (regardless of their official nature, e.g., laws, administrative regulations).
definition: Ein Gericht geregelt von der Prozessordnung (unabhängig von deren förmlicher Rechtsnatur, zum Beispiel Gesetze, Verwaltungsvorschriften). @de

Donor
type: Property
label: Stifter @de
sub property of: Former owner
name: donor
status: New-Proposed

Current owner (Item)
type: Property
domain: Item
label: Derzeitiger Besitzer (Exemplar) @de
sub property of: Owner (Item)
name: currentOwnerItem
status: New-Proposed
definition: A person, family, or corporate body currently having legal possession of an item (i.e., a specific copy or instance of a resource).
definition: Eine Person, Familie oder Körperschaft, die derzeit rechtmäßig im Besitz eines Exemplars ist (z. B. einer bestimmten Kopie oder eines bestimmten Exemplars einer Ressource). @de

Defendant (Work)
type: Property
domain: Work
label: Angeklagter/Beklagter (Werk) @de
sub property of: Defendant
name: defendantWork
status: New-Proposed
definition: Eine Person oder Körperschaft, die in einem Strafverfahren angeklagt oder in einem Zivilprozess verklagt ist. @de
definition: A person or corporate body who is accused in a criminal proceeding or sued in a civil proceeding.

Choreographer (Work)
type: Property
domain: Work
label: Choreograf (Werk) @de
sub property of: Creator
name: choreographerWork
status: New-Proposed
definition: A person, family, or corporate body responsible for creating a work of movement.
definition: Eine Person, Familie oder Körperschaft, die für ein aus Bewegung bestehendes Werk verantwortlich ist. @de

Appellee (Work)
type: Property
domain: Work
label: Berufungsbeklagter / Revisionsbeklagter (Werk) @de
sub property of: Appellee
name: appelleeWork
status: New-Proposed
definition: A person or corporate body against whom an appeal is taken.
definition: Eine natürliche oder juristische Person, gegen die Rechtsmittel (Berufung / Revision) eingelegt wurde. @de

Writer of added text (Expression)
type: Property
domain: Expression
label: Verfasser von Zusatztexten (Expression) @de
sub property of: Contributor
name: writerOfAddedTextExpression
status: New-Proposed
definition: Eine Person, Familie oder Körperschaft, die an einer Expression eines primär nicht-textlichen Werkes mitwirkt, indem sie Texte für das nicht-textliche Werk eines anderen Schöpfers verfasst (z.B. Bildunterschriften für Fotografien, Beschreibungen von Karten). @de
definition: A person, family, or corporate body contributing to an expression of a primarily non-textual work by providing text for the non-textual work (e.g., writing captions for photographs, descriptions of maps).

Animator (Expression)
type: Property
domain: Expression
sub property of: Contributor
name: animatorExpression
status: New-Proposed
definition: A person, family, or corporate body contributing to an expression of a moving image work or computer program by giving apparent movement to inanimate objects or drawings.
definition: Eine Person, Familie oder Körperschaft, an die Korrespondenz in einem Werk adressiert ist. @de

Curator (Item)
type: Property
domain: Item
label: Kurator (Exemplar) @de
sub property of: Curator
name: curatorItem
status: New-Proposed
definition: Eine Person, Familie oder Körperschaft, die Zusammenstellungen entwirft und/oder eine Ausstellung, eine Sammlung oder andere Exemplare organisiert. @de
definition: A person, family, or corporate body conceiving, aggregating, and/or organizing an exhibition, collection, or other item.

Former owner (Item)
type: Property
domain: Item
label: Früherer Besitzer (Exemplar) @de
sub property of: Owner (Item)
has subproperty: Donor (Item)
has subproperty: Seller (Item)
name: formerOwnerItem
status: New-Proposed
definition: A person, family, or corporate body formerly having legal possession of an item (i.e., a specific copy or instance of a resource).
definition: Eine Person, Familie oder Körperschaft, die früher rechtmäßiger Besitzer eines Exemplars war (d.h. einer bestimmten Kopie oder eines Exemplars einer Ressource) @de

Conductor
type: Property
label: Dirigent @de
sub property of: Performer
name: conductor
status: New-Proposed

Printmaker (Manifestation)
type: Property
domain: Manifestation
label: Druckgrafiker (Manifestation) @de
sub property of: Manufacturer (Manifestation)
name: printmakerManifestation
status: New-Proposed
definition: Eine Person, Familie oder Körperschaft, die an der Produktion einer Manifestation durch die Erstellung einer Hochdruck-, Tiefdruck- oder Flachdruckoberfläche beteiligt ist. @de
definition: A person, family, or corporate body involved in manufacturing a manifestation by making a relief, intaglio, or planographic printing surface.

Stage director (Expression)
type: Property
domain: Expression
label: Theaterregisseur @de
sub property of: Contributor
name: stageDirectorExpression
status: New-Proposed
definition: A person, family, or corporate body contributing to an expression of a stage work through the general management and supervision of a performance.
definition: Eine Person, Familie oder Körperschaft, die an der Expression eines Bühnenwerks durch die allgemeine Betreuung und Leitung einer Darbietung mitwirken. @de

Producer (Work)
type: Property
domain: Work
label: Produzent (Werk) @de
sub property of: Producer
has subproperty: Radio producer (Work)
has subproperty: Film producer (Work)
has subproperty: Television producer (Work)
name: producerWork
status: New-Proposed
definition: A person, family, or corporate body responsible for most of the business aspects of a production for screen, audio recording, television, webcast, etc. The producer is generally responsible for fund raising, managing the production, hiring key personnel, arranging for distributors, etc.
definition: Eine Person, Familie oder Körperschaft, die Verantwortung für die meisten geschäftlichen Aspekte einer Darbietung für die Bühne, die Leinwand, eine Tonaufnahme, das Fernsehen, eine Internetübertragung usw. übernimmt. Der Produzent ist allgemein verantwortlich für die Geldbeschaffung, das Produktionsmanagement, die Einstellung der Kompetenzträger, die Organisation des Vertriebs, o.ä. @de

Praeses (Work)
type: Property
domain: Work
label: Disputationsleiter (Werk) @de
sub property of: Creator
name: praesesWork
status: New-Proposed
definition: Angehöriger des Lehrpersonals, der eine akademische Disputation moderiert, normalerweise indem er eine These aufstellt und an der folgenden Disputation teilnimmt, aber nur indirekte Verbindung mit dem Inhalt der These hat. @de
definition: A person who is the faculty moderator of an academic disputation, normally proposing a thesis and participating in the ensuing disputation.

Cinematographer
type: Property
label: Kameramann @de
name: cinematographer
status: New-Proposed
definition: Eine Person, eine Familie oder eine Körperschaft, die zu einer Expression eines Bewegtbildwerkes beiträgt, indem sie die Bilder mit einem Aufzeichnungsgerät aufnimmt, entweder in elektronischer Form oder auf Film oder Video. Häufig gehört auch die Auswahl der Bilder und die Beleuchtung dazu. Der leitende Kameramann wird auch verantwortlicher Kameramann genannt. Die Bezeichnung „Kameramann" wird auch für einen Videografen verwendet. @de
definition: A person, family, or corporate body contributing to an expression of a moving image work by capturing images either electronically or on film or video stock using a visual recording device, and often the selection and arrangement of lighting. The chief cinematographer for a movie is also called the director of photography. Use this designation also for videographers.

Custodian (Item)
type: Property
domain: Item
label: Besitzer (Exemplar) @de
sub property of: Custodian
name: custodianItem
status: New-Proposed
definition: Eine Person, Familie oder Körperschaft, die der rechtmäßige Besitzer eines Objekts ist (d.h., einer bestimmten Kopie oder Instanz einer Ressource). @de
definition: A person, family, or corporate body having legal custody of an item (i.e., a specific copy or instance of a resource).

Distributor
type: Property
label: Vertrieb @de
has subproperty: Film distributor
has subproperty: Distributor (Manifestation)
name: distributor
status: New-Proposed
definition: Eine Person, Familie oder Körperschaft, die für den Vertrieb einer Ressource verantwortlich ist. @de

Programmer (Work)
type: Property
domain: Work
label: Programmierer (Werk) @de
sub property of: Creator
name: programmerWork
status: New-Proposed
definition: Eine Person, Familie oder Körperschaft, die für die Erstellung eines Computerprogramms verantwortlich ist. @de
definition: A person, family, or corporate body responsible for creating a computer program.

Platemaker
type: Property
label: Druckformhersteller @de
sub property of: Manufacturer
name: platemaker
status: New-Proposed

Film director
type: Property
label: Filmregisseur @de
sub property of: Director
name: filmDirector
status: New-Proposed

Dedicatee (Work)
type: Property
domain: Work
label: Person, der ein Werk gewidmet ist @de
sub property of: Dedicatee
name: dedicateeWork
status: New-Proposed
definition: A person, family, or corporate body to whom the work is dedicated.
definition: Eine Person, Familie oder Körperschaft, der das Werk gewidmet ist. @de

Compiler (Work)
type: Property
domain: Work
label: Compiler (Werk) @de
sub property of: Creator
name: compilerWork
status: New-Proposed
definition: Eine Person, Familie oder Körperschaft, die für das Erstellen eines Werkes durch eine Zusammenstellung verantwortlich ist, beispielsweise durch Selektieren, Gliedern, Zusammenstellen und Editieren von Daten, Information, usw. @de
definition: A person, family, or corporate body responsible for creating a new work (e.g., a bibliography, a directory) through the act of compilation, e.g., selecting, arranging, aggregating, and editing data, information, etc.

Depositor
type: Property
label: Leihgeber @de
sub property of: Current owner
name: depositor
status: New-Proposed

Engraver
type: Property
label: Graveur @de
sub property of: Manufacturer
name: engraver
status: New-Proposed

Collector
type: Property
label: Sammler @de
sub property of: Curator
name: collector
status: New-Proposed

Television producer
type: Property
label: Fernsehproduzent @de
sub property of: Producer
has subproperty: Television producer (Work)
name: televisionProducer
status: New-Proposed

Recording engineer (Expression)
type: Property
domain: Expression
label: Toningenieur (Expression) @de
sub property of: Contributor
name: recordingEngineerExpression
status: New-Proposed
definition: Eine Person, Familie oder Körperschaft, die an einer Expression eines Werkes mitwirkt, indem sie die technischen Aspekte einer Ton- oder Videoaufnahme überwacht @de
definition: A person, family, or corporate body contributing to an expression of a work by supervising the technical aspects of a sound or video recording session.

Production designer
type: Property
label: Production Designer @de
name: productionDesigner
status: New-Proposed

Court reporter (Expression)
type: Property
domain: Expression
label: Gerichtsstenograf (Expression) @de
sub property of: Contributor
name: courtReporterExpression
status: New-Proposed
definition: A person, family, or corporate body contributing to an expression of a work by preparing a court’s opinions for publication.
definition: Eine Person, Familie oder Körperschaft, die zu einer Expression eines Werkes beiträgt, indem sie die Auffassung eines Gerichts zur Veröffentlichung vorbereitet. @de

On-screen presenter (Expression)
type: Property
comment: Use when a more specific term (e.g., Narrator or Host) is either not applicable or not desired.
domain: Expression
label: On-screen Presenter (Expression) @de
name: onScreenPresenterExpression
status: New-Proposed
definition: Ein Darsteller, der an einer Expression eines Werkes mitwirkt, indem er über den Bildschirm Kontext- und Hintergrundinformationen zu nicht-fiktiven Bewegtbildmaterialien oder zu Einleitungen zu fiktivenBewegtbildmaterialien beisteuert. Die Funktionsbezeichnung wird verwendet, wenn ein spezifischerer Begriff (z. B. Erzähler oder Gastgeber) nicht anwendbar ist. @de
definition: A performer contributing to an expression of a work by appearing on screen in nonfiction moving image materials or introductions to fiction moving image materials to provide contextual or background information.