Indexed in (Expression)
type: Property
domain: Expression
sub property of: Indexed in
sub property of: derivativeExpression
name: indexedInExpression
status: New-Proposed
definition: The expression of the work (asn abstracting and indexing service) that indexes the contents of a source entity.

Whole-part relationship (Manifestation)
type: Property
domain: Manifestation
sub property of: Whole-part relationship
has subproperty: Contains (Manifestation)
has subproperty: Contained in (Manifestation)
name: wholePartRelationshipManifestation
status: New-Proposed

Screenplay based on (Expression)
type: Property
domain: Expression
sub property of: Screenplay based on
sub property of: Adaptation of
has subproperty: Video screenplay based on (Expression)
has subproperty: Motion picture screenplay based on (Expression)
has subproperty: Television screenplay based on (Expression)
name: screenplayBasedOnExpression
status: New-Proposed
definition: An expression of a work that has been adapted as the screenplay for a motion picture, television program, or video.

Adapted as a motion picture screenplay (Work)
type: Property
domain: Work
sub property of: Adapted as a motion picture screenplay
sub property of: Adapted as a screenplay (Work)
name: adaptedAsAMotionPictureScreenplayWork
status: New-Proposed
definition: A work comprising the screenplay for a motion picture, based on the source work.

Adapted as a television screenplay (Expression)
type: Property
domain: Expression
sub property of: Adapted as a television screenplay
sub property of: Adapted as a screenplay (Expression)
name: adaptedAsATelevisionScreenplayExpression
status: New-Proposed
definition: An expression of a work comprising the screenplay for a television programme, based on the source work.

Continued in part by (Work)
type: Property
comment: Apply generally to serials.
domain: Work
sub property of: Succeeded by (Work)
sub property of: Continued in part by
name: continuedInPartByWork
status: New-Proposed
definition: A work part of whose content separated from an earlier work to form a new work.

Imitation of
type: Property
sub property of: Based on
has subproperty: Imitation of (Work)
has subproperty: Imitation of (Expression)
has subproperty: Parody of
name: imitationOf
status: New-Proposed

Adapted as a radio script (Work)
type: Property
domain: Work
sub property of: Adapted as a radio script
sub property of: Adapted as (Work)
name: adaptedAsARadioScriptWork
status: New-Proposed
definition: A work comprising the script for a radio programme, based on the source work.

Catalogue (Work)
type: Property
domain: Work
sub property of: Catalogue
sub property of: Augmented by (Work)
name: catalogueWork
status: New-Proposed
definition: A work used as the basis for a catalogue, i.e., a complete enumeration of items arranged systematically.

Freely translated as (Expression)
type: Property
domain: Expression
sub property of: Freely translated as
sub property of: derivativeExpression
name: freelyTranslatedAsExpression
status: New-Proposed
definition: An expression of a work that presents the text in another language, preserving the spirit of the original, but not its linguistic details.

Summary of
type: Property
sub property of: Based on
has subproperty: Summary of (Work)
has subproperty: Summary of (Expression)
name: summaryOf
status: New-Proposed

Screenplay
type: Property
sub property of: Complemented by
has subproperty: Video screenplay
has subproperty: Television screenplay
has subproperty: Screenplay (Expression)
name: screenplay
status: New-Proposed

Musical setting of
type: Property
sub property of: Based on
has subproperty: Musical setting of (Work)
has subproperty: Musical setting of (Expression)
name: musicalSettingOf
status: New-Proposed

Illustrations (Expression)
type: Property
domain: Expression
sub property of: Illustrations
sub property of: Augmented by (Expression)
name: illustrationsExpression
status: New-Proposed
definition: An expression of a work comprising pictorial content designed to elucidate or decorate the augmented entity.

Finding aid
type: Property
sub property of: Augmented by
has subproperty: Finding aid (Work)
has subproperty: Finding aid (Expression)
name: findingAid
status: New-Proposed

Finding aid for (Work)
type: Property
domain: Work
sub property of: Finding aid for
sub property of: Augmentation of (Work)
name: findingAidForWork
status: New-Proposed
definition: An archival collection that is described in a finding aid, i.e., a guide to the organization, arrangement, and contents of the collection.

Electronic reproduction of (Item)
type: Property
domain: Item
sub property of: Electronic reproduction of
sub property of: Reproduction of (Item)
name: electronicReproductionOfItem
status: New-Proposed
definition: An analog item used as the basis for an electronic reproduction.

New-Proposed
type: Concept

Whole-part relationship
type: Property
has subproperty: Contained in
has subproperty: Contains
name: wholePartRelationship
status: New-Proposed

Continued by (Work)
type: Property
comment: Apply generally to serials.
domain: Work
sub property of: Continued by
sub property of: Succeeded by (Work)
name: continuedByWork
status: New-Proposed
definition: A work whose content continues an earlier work under a new title.

Imitation of (Work)
type: Property
domain: Work
sub property of: Based on (Work)
sub property of: Imitation of
has subproperty: Parody of (Work)
name: imitationOfWork
status: New-Proposed
definition: A work whose style is copied in a derivative work.

Remade as (Work)
type: Property
domain: Work
sub property of: Remade as
sub property of: derivativeWork
name: remadeAsWork
status: New-Proposed
definition: A new motion picture, radio programme, television programme, or video based on an earlier work.

Motion picture screenplay based on (Work)
type: Property
domain: Work
sub property of: Motion picture screenplay based on
sub property of: Screenplay based on (Work)
name: motionPictureScreenplayBasedOnWork
status: New-Proposed
definition: A work that has been adapted as the screenplay for a motion picture.

Evaluated in (Expression)
type: Property
domain: Expression
sub property of: Evaluated in
sub property of: Described in (Expression)
name: evaluatedInExpression
status: New-Proposed
definition: An expression of a work that examines or judges the source entity.

Absorbed in part
type: Property
sub property of: Preceded by
has subproperty: Absorbed in part (Work)
has subproperty: Absorbed in part (Expression)
name: absorbedInPart
status: New-Proposed

Adapted as a video (Expression)
type: Property
domain: Expression
sub property of: Adapted as a video
sub property of: Adapted as (Expression)
name: adaptedAsAVideoExpression
status: New-Proposed
definition: A video based on the source entity.

Catalogue of (Work)
type: Property
domain: Work
sub property of: Catalogue of
sub property of: Augmentation of (Work)
name: catalogueOfWork
status: New-Proposed
definition: A work used as the basis for a catalogue, i.e., a complete enumeration of items arranged systematically.

Described in (Work)
type: Property
domain: Work
sub property of: Described in
sub property of: Descriptive relationships (Work)
has subproperty: Commentary in (Work)
has subproperty: Critiqued in (Work)
has subproperty: Analysed in (Work)
has subproperty: Reviewed in (Work)
has subproperty: Evaluated in (Work)
name: describedInWork
status: New-Proposed
definition: A work that describes a described entity.

Libretto based on (Expression)
type: Property
domain: Expression
sub property of: Libretto based on
sub property of: Based on (Expression)
name: librettoBasedOnExpression
status: New-Proposed
definition: An expression of a work used as the basis for the text of an opera or other work for the musical stage, or an oratorio.

Parodied as (Expression)
type: Property
domain: Expression
sub property of: Parodied as
sub property of: Imitated as (Expression)
name: parodiedAsExpression
status: New-Proposed
definition: An expression of a work that imitates the style or content of the source work for comic effect.

Adapted as a motion picture (Expression)
type: Property
domain: Expression
sub property of: Adapted as a motion picture
sub property of: Adapted as (Expression)
name: adaptedAsAMotionPictureExpression
status: New-Proposed
definition: A motion picture based on the source entity.

Continues
type: Property
sub property of: Preceded by
has subproperty: Continues (Work)
has subproperty: Continues (Expression)
name: continues
status: New-Proposed

Adapted as a video (Work)
type: Property
domain: Work
sub property of: Adapted as a video
sub property of: Adapted as (Work)
name: adaptedAsAVideoWork
status: New-Proposed
definition: A video based on the source work.

Screenplay based on (Work)
type: Property
domain: Work
sub property of: Adaptation of (Work)
sub property of: Screenplay based on
has subproperty: Television screenplay based on (Work)
has subproperty: Motion picture screenplay based on (Work)
has subproperty: Video screenplay based on (Work)
name: screenplayBasedOnWork
status: New-Proposed
definition: A work that has been adapted as the screenplay for a motion picture, television programme, or video.

Remake of
type: Property
sub property of: Based on
has subproperty: Remake of (Work)
has subproperty: Remake of (Expression)
name: remakeOf
status: New-Proposed

Absorbed
type: Property
sub property of: Preceded by
has subproperty: Absorbed (Work)
has subproperty: Absorbed (Expression)
name: absorbed
status: New-Proposed

Descriptive relationships (Item)
type: Property
domain: Item
sub property of: Descriptive relationships
has subproperty: Description of (Item)
name: descriptiveRelationshipsItem
status: New-Proposed

Augmentation of
type: Property
has subproperty: Appendix to
has subproperty: Catalogue of
has subproperty: Augmentation of (Expression)
has subproperty: Supplement to
has subproperty: Concordance to
has subproperty: Finding aid for
has subproperty: Errata to
has subproperty: Addenda to
has subproperty: Index to
has subproperty: Illustrations for
has subproperty: Guide to
name: augmentationOf
status: New-Proposed

Electronic reproduction of
type: Property
sub property of: Reproduction of
has subproperty: Electronic reproduction of (Manifestation)
has subproperty: Electronic reproduction of (Item)
name: electronicReproductionOf
status: New-Proposed

Supersedes in part (Expression)
type: Property
comment: Apply generally to single-part units, multipart monographs, and integrating resources.
domain: Expression
sub property of: Supersedes in part
sub property of: Preceded by (Expression)
name: supersedesInPartExpression
status: New-Proposed
definition: An expression of an earlier work whose content has been partially replaced by a later entity, usually because the later entity contains updated or new information that makes part of the earlier entity obsolete.

Sequential relationship (Manifestation)
type: Property
domain: Manifestation
sub property of: Sequential relationship
name: sequentialRelationshipManifestation
status: New-Proposed

Screenplay for the motion picture (Expression)
type: Property
domain: Expression
sub property of: Screenplay for the motion picture
sub property of: Screenplay for (Expression)
name: screenplayForTheMotionPictureExpression
status: New-Proposed
definition: An expression of a work that uses the text as a screenplay for a motion picture.

Merged with to form
type: Property
sub property of: Succeeded by
has subproperty: Merged with to form (Work)
has subproperty: Merged with to form (Expression)
name: mergedWithToForm
status: New-Proposed

Verse adaptation (Work)
type: Property
domain: Work
sub property of: Verse adaptation
sub property of: Adapted as (Work)
name: verseAdaptationWork
status: New-Proposed
definition: A literary composition in verse form adapted from the source work.

Supplement
type: Property
sub property of: Augmented by
has subproperty: Supplement (Work)
has subproperty: Supplement (Expression)
name: supplement
status: New-Proposed

Adapted as a television programme
type: Property
sub property of: Adapted as
has subproperty: Adapted as a television programme (Work)
has subproperty: Adapted as a television programme (Expression)
name: adaptedAsATelevisionProgramme
status: New-Proposed

Augmentation of (Expression)
type: Property
domain: Expression
sub property of: Augmentation of
sub property of: Accompanying expression
has subproperty: Addenda to (Expression)
has subproperty: Catalogue of (Expression)
has subproperty: Illustrations for (Expression)
has subproperty: Guide to (Expression)
has subproperty: Appendix to (Expression)
has subproperty: Index to (Expression)
has subproperty: Supplement to (Expression)
has subproperty: Errata to (Expression)
has subproperty: Concordance to (Expression)
has subproperty: Finding aid for (Expression)
name: augmentationOfExpression
status: New-Proposed
definition: An expression whose content is added to by another entity.

Imitated as (Expression)
type: Property
domain: Expression
sub property of: Imitated as
sub property of: derivativeExpression
has subproperty: Parodied as (Expression)
name: imitatedAsExpression
status: New-Proposed
definition: An expression of a work that copies the style of the source work.

Preservation facsimile of (Item)
type: Property
domain: Item
sub property of: Preservation facsimile of
sub property of: Facsimile of (Item)
name: preservationFacsimileOfItem
status: New-Proposed
definition: An item used as the basis for an exact reproduction on preservation-quality media, such as acid-free permanent or archival paper.

Expanded version of (Work)
type: Property
domain: Work
sub property of: Expanded version of
sub property of: Based on (Work)
name: expandedVersionOfWork
status: New-Proposed
definition: A work used as the basis for a derivative work that enlarges upon the content of the source work.

Supersedes in part (Work)
type: Property
comment: Apply generally to single-part units, multipart monographs, and integrating resources.
domain: Work
sub property of: Preceded by (Work)
sub property of: Supersedes in part
name: supersedesInPartWork
status: New-Proposed
definition: An earlier work whose content has been partially replaced by a later work, usually because the later work contains updated or new information that makes part of the earlier work obsolete.

Accompanied by (Manifestation)
type: Property
domain: Manifestation
sub property of: Accompanied by
has subproperty: Issued with (Manifestation)
name: accompaniedByManifestation
status: New-Proposed
definition: A manifestation issued with another manifestation, without any relationship to its content.

Concordance to (Work)
type: Property
domain: Work
sub property of: Concordance to
sub property of: Augmentation of (Work)
name: concordanceToWork
status: New-Proposed
definition: A work used as the basis for a concordance, i.e. an index of all the words in the augmented work.

Description of (Item)
type: Property
domain: Item
sub property of: Descriptive relationships (Item)
sub property of: Description of
has subproperty: Commentary on (Item)
has subproperty: Analysis of (Item)
has subproperty: Evaluation of (Item)
has subproperty: Critique of (Item)
has subproperty: Review of (Item)
name: descriptionOfItem
status: New-Proposed
definition: An item described by a describing entity.

Abstracted in (Expression)
type: Property
domain: Expression
name: abstractedInExpression
status: New-Proposed
definition: An expression of a work (an abstracting and indexing service) that abstracts the contents of a source entity.

Video adaptation of (Expression)
type: Property
domain: Expression
sub property of: Video adaptation of
sub property of: Adaptation of (Expression)
name: videoAdaptationOfExpression
status: New-Proposed
definition: An expression of a work that has been adapted for video.

On disc with (Manifestation)
type: Property
domain: Manifestation
sub property of: On disc with
sub property of: Issued with (Manifestation)
name: onDiscWithManifestation
status: New-Proposed
definition: A manifestation that is issued on the same disc with the manifestation being described.

Motion picture screenplay based on
type: Property
sub property of: Screenplay based on
has subproperty: Motion picture screenplay based on (Work)
has subproperty: Motion picture screenplay based on (Expression)
name: motionPictureScreenplayBasedOn
status: New-Proposed

Digest (Work)
type: Property
domain: Work
sub property of: Digest
sub property of: derivativeWork
name: digestWork
status: New-Proposed
definition: A work that systematically, comprehensively condenses the source work.

Adapted as (Expression)
type: Property
domain: Expression
sub property of: Adapted as
sub property of: derivativeExpression
has subproperty: Novelization (Expression)
has subproperty: Verse adaptation (Expression)
has subproperty: Dramatized as (Expression)
has subproperty: Adapted as a radio script (Expression)
has subproperty: Adapted as a television programme (Expression)
has subproperty: Adapted as a motion picture (Expression)
has subproperty: Adapted as a video (Expression)
has subproperty: Adapted as a radio programme (Expression)
has subproperty: Adapted as a screenplay (Expression)
name: adaptedAsExpression
status: New-Proposed
definition: An expression of a work that modifies the source entity for a purpose, use, or medium other than that for which it was originally intended.

Preceded by
type: Property
sub property of: Sequential relationship
has subproperty: Supersedes
has subproperty: Absorbed in part
has subproperty: Preceded by (Expression)
has subproperty: Preceded by (Work)
has subproperty: Continues
has subproperty: Separated from
has subproperty: Sequel to
has subproperty: Prequel
has subproperty: Merger of
has subproperty: Continues in part
has subproperty: Supersedes in part
has subproperty: Absorbed
name: precededBy
status: New-Proposed

Digest
type: Property
sub property of: derivativeRelationships
has subproperty: Digest (Work)
has subproperty: Digest (Expression)
name: digest
status: New-Proposed

Adapted as a television programme (Work)
type: Property
domain: Work
sub property of: Adapted as a television programme
sub property of: Adapted as (Work)
name: adaptedAsATelevisionProgrammeWork
status: New-Proposed
definition: A television programme based on the source work.

Digital transfer of
type: Property
domain: Manifestation
sub property of: Reproduction of
has subproperty: Digital transfer of (Manifestation)
has subproperty: Digital transfer of (Item)
name: digitalTransferOf
status: New-Proposed

Index (Expression)
type: Property
domain: Expression
sub property of: Index
sub property of: Augmented by (Expression)
name: indexExpression
status: New-Proposed
definition: An expression of a work that provides a systematic, alphabetical guide to the contents of the predominant entity, usually keyed to page numbers or other reference codes.

Adapted as a video
type: Property
sub property of: Adapted as
has subproperty: Adapted as a video (Work)
has subproperty: Adapted as a video (Expression)
name: adaptedAsAVideo
status: New-Proposed

Insert
type: Property
sub property of: Contains
has subproperty: Insert (Manifestation)
name: insert
status: New-Proposed

Supplement to (Work)
type: Property
domain: Work
sub property of: Supplement to
sub property of: Augmentation of (Work)
name: supplementToWork
status: New-Proposed
definition: A work that is updated or otherwise complemented by the augmenting work.

Screenplay for the television programme (Work)
type: Property
domain: Work
sub property of: Screenplay for the television programme
sub property of: Screenplay for (Work)
name: screenplayForTheTelevisionProgrammeWork
status: New-Proposed
definition: A work that adapts the source work as the screenplay for a television program.

Screenplay for the motion picture (Work)
type: Property
domain: Work
sub property of: Screenplay for the motion picture
sub property of: Screenplay for (Work)
name: screenplayForTheMotionPictureWork
status: New-Proposed
definition: A work that adapts the source work as the screenplay for a motion picture work.

Prequel to
type: Property
sub property of: Succeeded by
has subproperty: Prequel to (Work)
name: prequelTo
status: New-Proposed

Described in (Expression)
type: Property
domain: Expression
sub property of: Described in
sub property of: Descriptive relationships (Expression)
has subproperty: Analysed in (Expression)
has subproperty: Critiqued in (Expression)
has subproperty: Evaluated in (Expression)
has subproperty: Commentary in (Expression)
has subproperty: Reviewed in (Expression)
name: describedInExpression
status: New-Proposed
definition: An expression that describes a described entity.

Bound with (Item)
type: Property
domain: Item
sub property of: Bound with
sub property of: Accompanied by (Item)
name: boundWithItem
status: New-Proposed
definition: An item that has been bound within the same binding as the item being described.

Appendix to (Expression)
type: Property
domain: Expression
sub property of: Appendix to
sub property of: Augmentation of (Expression)
name: appendixToExpression
status: New-Proposed
definition: An expression of a predominant work that is augmented by another work that consists of material that is not essential to the completeness of the content, such as a list of references, statistical tables, and explanatory matter; the augmenting work may come at the end of the content, or may be issued separately.

Musical arrangement
type: Property
sub property of: derivativeRelationships
has subproperty: Musical arrangement (Expression)
name: musicalArrangement
status: New-Proposed

Reviewed in
type: Property
sub property of: Described in
has subproperty: Reviewed in (Work)
has subproperty: Reviewed in (Expression)
name: reviewedIn
status: New-Proposed

Choreography (Expression)
type: Property
domain: Expression
sub property of: Choreography
sub property of: derivativeExpression
name: choreographyExpression
status: New-Proposed
definition: An expression of a work comprising dance based on the source work.

Based on (Expression)
type: Property
domain: Expression
sub property of: derivativeExpression
sub property of: Based on
has subproperty: Translation of (Expression)
has subproperty: Musical arrangement of (Expression)
has subproperty: Digest of (Expression)
has subproperty: Free translation of (Expression)
has subproperty: Revision of (expression)
has subproperty: Libretto based on (Expression)
has subproperty: Musical setting of (Expression)
has subproperty: Imitation of (Expression)
has subproperty: Summary of (Expression)
has subproperty: Choreography for (Expression)
has subproperty: Indexing for (Expression)
has subproperty: Paraphrase of (Expression)
has subproperty: Musical variations based on (Expression)
has subproperty: Adaptation of (Expression)
has subproperty: Remake of (Expression)
has subproperty: Abstracts for (Expression)
has subproperty: Abridgement of (Expression)
has subproperty: Abstract of (Expression)
has subproperty: Expanded version of (Expression)
name: basedOnExpression
status: New-Proposed
definition: An expression used as the basis for a derivative entity.

Libretto based on
type: Property
sub property of: Based on
has subproperty: Libretto based on (Work)
has subproperty: Libretto based on (Expression)
name: librettoBasedOn
status: New-Proposed

Special issue of
type: Property
sub property of: Contained in
has subproperty: Special issue of (Manifestation)
name: specialIssueOf
status: New-Proposed

Index
type: Property
sub property of: Augmented by
has subproperty: Index (Work)
has subproperty: Index (Expression)
name: index
status: New-Proposed

Adapted as a radio script (Expression)
type: Property
domain: Expression
sub property of: Adapted as a radio script
sub property of: Adapted as (Expression)
name: adaptedAsARadioScriptExpression
status: New-Proposed
definition: An expression of a work comprising the script for a radio programme, based on the source work.

Guide
type: Property
sub property of: Augmented by
has subproperty: Guide (Work)
has subproperty: Guide (Expression)
name: guide
status: New-Proposed

Merger of (Work)
type: Property
domain: Work
sub property of: Merger of
sub property of: Preceded by (Work)
name: mergerOfWork
status: New-Proposed
definition: One of two or more works which came together to form a new work.

Contained in (Expression)
type: Property
domain: Expression
sub property of: Whole-part relationship (Expression)
sub property of: Contained in
name: containedInExpression
status: New-Proposed
definition: An expression of a larger work of which a part is a discrete component.

Adapted as a video screenplay (Expression)
type: Property
domain: Expression
sub property of: Adapted as a video screenplay
sub property of: Adapted as a screenplay (Expression)
name: adaptedAsAVideoScreenplayExpression
status: New-Proposed
definition: An expression of a work comprising the screenplay for a video, based on the source work.

Special issue
type: Property
sub property of: Contains
name: specialIssue
status: New-Proposed

Radio script based on (Expression)
type: Property
domain: Expression
sub property of: Adaptation of (Expression)
sub property of: Radio script based on
name: radioScriptBasedOnExpression
status: New-Proposed
definition: An expression of a work that has been adapted as the script for a radio program.

Preservation facsimile
type: Property
sub property of: Facsimile
has subproperty: Preservation facsimile (Manifestation)
name: preservationFacsimile
status: New-Proposed

Screenplay for the video
type: Property
sub property of: Screenplay for
has subproperty: Screenplay for the video (Work)
has subproperty: Screenplay for the video (Expression)
name: screenplayForTheVideo
status: New-Proposed

Description of (Work)
type: Property
domain: Work
sub property of: Description of
sub property of: Descriptive relationships (Work)
has subproperty: Commentary on (Work)
has subproperty: Critique of (Work)
has subproperty: Review of (Work)
has subproperty: Evaluation of (Work)
has subproperty: Analysis of (Work)
name: descriptionOfWork
status: New-Proposed
definition: A work described by a describing entity.

Adapted as a screenplay (Work)
type: Property
domain: Work
sub property of: Adapted as a screenplay
sub property of: Adapted as (Work)
has subproperty: Adapted as a motion picture screenplay (Work)
has subproperty: Adapted as a video screenplay (Work)
has subproperty: Adapted as a television screenplay (Work)
name: adaptedAsAScreenplayWork
status: New-Proposed
definition: A work comprising the screenplay for a motion picture, television programme, or video, based on the source work.

Abstract of (Work)
type: Property
domain: Work
sub property of: Abstract of
sub property of: Based on (Work)
name: abstractOfWork
status: New-Proposed
definition: A work that has been abstracted, i.e., abbreviated in a brief, objective manner.

Addenda
type: Property
sub property of: Augmented by
name: addenda
status: New-Proposed

Continues in part (Expression)
type: Property
comment: Apply generally to serials.
domain: Expression
sub property of: Continues in part
sub property of: Preceded by (Expression)
name: continuesInPartExpression
status: New-Proposed
definition: An expression of a work that split into two or more separate entities with new titles.

RDA Relationships for Works, Expressions, Manifestations, Items

Television adaptation of
type: Property
sub property of: Adaptation of
has subproperty: Television adaptation of (Work)
has subproperty: Television adaptation of (Expression)
name: televisionAdaptationOf
status: New-Proposed

Translation of
type: Property
sub property of: Based on
has subproperty: Translation of (Expression)
name: translationOf
status: New-Proposed

Novelization of
type: Property
sub property of: Adaptation of
has subproperty: Novelization of (Work)
has subproperty: Novelization of (Expression)
name: novelizationOf
status: New-Proposed

Abridgement of (Expression)
type: Property
domain: Expression
sub property of: Abridgement of
sub property of: Based on (Expression)
name: abridgementOfExpression
status: New-Proposed
definition: An expression of a work that has been abridged, i.e., shortened without changing the general meaning or manner of presentation of the source work.

Musical variations based on
type: Property
sub property of: Based on
has subproperty: Musical variations based on (Work)
has subproperty: Musical variations based on (Expression)
name: musicalVariationsBasedOn
status: New-Proposed

Guide (Expression)
type: Property
domain: Expression
sub property of: Guide
sub property of: Augmented by (Expression)
name: guideExpression
status: New-Proposed
definition: An expression of a work that guides a user through the use of the predominant work, using notes, learning and study aids, exercises, problems, questions and answers, instructor or student materials, etc.

Evaluation of (Item)
type: Property
domain: Item
sub property of: Evaluation of
sub property of: Description of (Item)
name: evaluationOfItem
status: New-Proposed
definition: An item that is examined or judged.

Revision of (expression)
type: Property
sub property of: Revision of
sub property of: Based on (Expression)
name: revisionOfExpression
status: New-Proposed
definition: An expression of a work used as the basis for an updated, corrected, or expanded version.

Electronic reproduction of (Manifestation)
type: Property
domain: Manifestation
sub property of: Electronic reproduction of
sub property of: Reproduction of (Manifestation)
name: electronicReproductionOfManifestation
status: New-Proposed
definition: An analog manifestation used as the basis for an electronic reproduction.

Novelization of (Work)
type: Property
domain: Work
sub property of: Novelization of
sub property of: Adaptation of (Work)
name: novelizationOfWork
status: New-Proposed
definition: A work that has been adapted as a novel.

Video adaptation of
type: Property
sub property of: Adaptation of
has subproperty: Video adaptation of (Work)
has subproperty: Video adaptation of (Expression)
name: videoAdaptationOf
status: New-Proposed

Preceded by (Work)
type: Property
domain: Work
sub property of: Preceded by
sub property of: Sequential relationship (Work)
has subproperty: Merger of (Work)
has subproperty: Continues (Work)
has subproperty: Supersedes in part (Work)
has subproperty: Absorbed (Work)
has subproperty: Prequel (Work)
has subproperty: Absorbed in part (Work)
has subproperty: Separated from (Work)
has subproperty: Continues in part (Work)
has subproperty: Supersedes (Work)
has subproperty: Sequel to (Work)
name: precededByWork
status: New-Proposed
definition: A work that precedes (e.g., is earlier in time or before in a narrative) the succeeding work.

Adapted as a screenplay (Expression)
type: Property
domain: Expression
sub property of: Adapted as (Expression)
sub property of: Adapted as a screenplay
has subproperty: Adapted as a video screenplay (Expression)
has subproperty: Adapted as a television screenplay (Expression)
has subproperty: Adapted as a motion picture screenplay (Expression)
name: adaptedAsAScreenplayExpression
status: New-Proposed
definition: An expression of a work comprising the screenplay for a motion picture, television programme, or video, based on the source work.

Basis for libretto
type: Property
has subproperty: Basis for libretto (Work)
has subproperty: Basis for libretto (Expression)
name: basisForLibretto
status: New-Proposed

Television screenplay
type: Property
sub property of: Screenplay
has subproperty: Television screenplay (Expression)
name: televisionScreenplay
status: New-Proposed

Musical variations based on (Work)
type: Property
domain: Work
sub property of: Musical variations based on
sub property of: Based on (Work)
name: musicalVariationsBasedOnWork
status: New-Proposed
definition: A musical work from which melodic, thematic, or harmonic material is taken to form a discrete theme, which is repeated one or more times with subsequent modifications.

Musical setting (Expression)
type: Property
domain: Expression
sub property of: Musical setting
sub property of: derivativeExpression
name: musicalSettingExpression
status: New-Proposed
definition: An expression of a non-dramatic musical work, except for an oratorio, that uses the text of the source work.

Mirror site (Manifestation)
type: Property
domain: Manifestation
sub property of: Mirror site
sub property of: equivalentManifestation
name: mirrorSiteManifestation
status: New-Proposed
definition: A manifestation of a Web site that is an exact copy, used to reduce network traffic or improve the availability of the original site.

Expression of work
type: Property
domain: Work
name: expressionOfWork
status: New-Proposed
definition: A realization of the work in a form of alpha-numeric, musical or choreographic notation, sound, image, object, movement, etc., or any combination of such forms.

Analysis of (Expression)
type: Property
domain: Expression
sub property of: Analysis of
sub property of: Description of (Expression)
name: analysisOfExpression
status: New-Proposed
definition: An expression of a work that has been examined to identify its components and their relations.

Adapted as a radio programme
type: Property
sub property of: Adapted as
has subproperty: Adapted as a radio programme (Work)
has subproperty: Adapted as a radio programme (Expression)
name: adaptedAsARadioProgramme
status: New-Proposed

Continued in part by
type: Property
sub property of: Succeeded by
has subproperty: Continued in part by (Work)
has subproperty: Continued in part by (Expression)
name: continuedInPartBy
status: New-Proposed

Absorbed in part by (Work)
type: Property
domain: Work
sub property of: Absorbed in part by
sub property of: Succeeded by (Work)
name: absorbedInPartByWork
status: New-Proposed
definition: A work that incorporates part of the content of another work.

Basis for libretto (Work)
type: Property
domain: Work
sub property of: Basis for libretto
sub property of: derivativeWork
name: BasisForLibrettoWork
status: New-Proposed
definition: A work that comprises the text of an opera or other work for the musical stage, or an oratorio, based on the source work.

Superseded by (Expression)
type: Property
comment: Apply generally to single-part units, multipart monographs, and integrating resources.
domain: Expression
sub property of: Succeeded by (Expression)
sub property of: Superseded by
name: supersededByExpression
status: New-Proposed
definition: An expression of a later entity used in place of the earlier entity, usually because the later entity contains updated or new information that makes the earlier entity obsolete.

Contains (Expression)
type: Property
domain: Expression
sub property of: Whole-part relationship (Expression)
sub property of: Contains
has subproperty: Libretto (Expression)
name: containsExpression
status: New-Proposed
definition: An expression of a work that is a discrete component of a larger entity.

Musical variations based on (Expression)
type: Property
domain: Expression
sub property of: Musical variations based on
sub property of: Based on (Expression)
name: musicalVariationsBasedOnExpression
status: New-Proposed
definition: An expression of a musical work from which melodic, thematic, or harmonic material is taken to form a discrete theme, which is repeated one or more times with subsequent modifications.

Adapted as
type: Property
has subproperty: Verse adaptation
has subproperty: Adapted as (Work)
has subproperty: Adapted as a motion picture
has subproperty: Novelization
has subproperty: Adapted as a video
has subproperty: Adapted as a screenplay
has subproperty: Adapted as a television programme
has subproperty: Adapted as a radio script
has subproperty: Adapted as a radio programme
has subproperty: Dramatized as
has subproperty: Adapted as (Expression)
name: adaptedAs
status: New-Proposed

Concordance (Expression)
type: Property
domain: Expression
sub property of: Concordance
sub property of: Augmented by (Expression)
name: concordanceExpression
status: New-Proposed
definition: An expression of a work that comprises an index of all the words in the predominant entity.

Expanded as (Work)
type: Property
domain: Work
sub property of: Expanded as
sub property of: derivativeWork
name: expandedAsWork
status: New-Proposed
definition: A work that enlarges upon the content of the source work.

Complemented by (Expression)
type: Property
domain: Expression
sub property of: Accompanying expression
sub property of: Complemented by
has subproperty: Screenplay for (Expression)
has subproperty: Libretto (Expression)
has subproperty: Cadenza (Expression)
has subproperty: Cadenza composed for (Expression)
has subproperty: Script for the radio programme (Expression)
has subproperty: Motion picture screenplay (Expression)
has subproperty: Radio script (Expression)
has subproperty: Screenplay (Expression)
name: complementedByExpression
status: New-Proposed
definition: An expression paired with another entity without either entity being considered to predominate.

Abridged as
type: Property
has subproperty: Abridged as (Work)
has subproperty: Abridged as (Expression)
name: abridgedAs
status: New-Proposed

Whole-part relationship (Expression)
type: Property
domain: Expression
sub property of: Whole-part relationship
has subproperty: Contains (Expression)
has subproperty: Contained in (Expression)
name: wholePartRelationshipExpression
status: New-Proposed

On disc with
type: Property
sub property of: Accompanied by
has subproperty: On disc with (Manifestation)
has subproperty: On disc with (Item)
name: onDiscWith
status: New-Proposed

Illustrations for (Work)
type: Property
domain: Work
sub property of: Illustrations for
sub property of: Augmentation of (Work)
name: illustrationsForWork
status: New-Proposed
definition: A work that is augmented by pictorial content designed to elucidate or decorate it.

Whole-part relationship (Item)
type: Property
domain: Item
sub property of: Whole-part relationship
has subproperty: Contains (Item)
has subproperty: Contained in (item)
name: wholePartRelationshipItem
status: New-Proposed

Subseries of
type: Property
sub property of: Contained in
has subproperty: Subseries of (Work)
name: subseriesOf
status: New-Proposed

Musical variations
type: Property
sub property of: derivativeRelationships
has subproperty: Musical variations (Work)
has subproperty: Musical variations (Expression)
name: musicalVariations
status: New-Proposed

In series (Work)
type: Property
domain: Work
sub property of: In series
sub property of: Contained in (Work)
name: inSeriesWork
status: New-Proposed
definition: A work in which the part has been issued; the part bears the title of the larger work.

Abridged as (Work)
type: Property
domain: Work
sub property of: Abridged as
sub property of: derivativeWork
name: abridgedAsWork
status: New-Proposed
definition: A work that shortens the source work without changing the general meaning or manner of presentation.

Finding aid (Expression)
type: Property
domain: Expression
sub property of: Finding aid
sub property of: Augmented by (Expression)
name: findingAidExpression
status: New-Proposed
definition: An expression of a work that provides a guide to the organization, arrangement, and contents of an archival collection.

Musical arrangement of (Expression)
type: Property
domain: Expression
sub property of: Musical arrangement of
sub property of: Based on (Expression)
name: musicalArrangementOfExpression
status: New-Proposed
definition: An expression of a work that has been rewritten for a medium of performance different from that for which the work was originally intended.

Verse adaptation
type: Property
sub property of: Adapted as
has subproperty: Verse adaptation (Work)
has subproperty: Verse adaptation (Expression)
name: verseAdaptation
status: New-Proposed

Abstracted in (Work)
type: Property
domain: Work
name: abstractedInWork
status: New-Proposed
definition: A work (an abstracting and indexing service) that abstracts the contents of a source entity.

Errata
type: Property
sub property of: Augmented by
has subproperty: Errata (Work)
has subproperty: Errata (Expression)
name: errata
status: New-Proposed

Radio script (Expression)
type: Property
domain: Expression
sub property of: Complemented by (Expression)
sub property of: Radio script
name: radioScriptExpression
status: New-Proposed
definition: An expression of a work that provides the text for a radio programme.

Related work
type: Property
domain: Work
has subproperty: Numbering of part (Work)
name: relatedWork
status: New-Proposed
definition: A work related to the work represented by an identifier, a preferred access point, or a description (e.g., an adaptation, commentary, supplement, sequel, part of a larger work).

Derivative relationship (Work)
type: Property
domain: Work
sub property of: Derivative relationship
has subproperty: Summary (Work)
has subproperty: Imitated as (Work)
has subproperty: Paraphrased as (Work)
has subproperty: Musical variations (Work)
has subproperty: Choreography (Work)
has subproperty: Adapted as (Work)
has subproperty: Digest (Work)
has subproperty: Indexed in (Work)
has subproperty: Remade as (Work)
has subproperty: Basis for libretto (Work)
has subproperty: Based on (Work)
has subproperty: Freely translated as (Work)
has subproperty: Expanded as (Work)
has subproperty: Abridged as (Work)
has subproperty: Musical setting (Work)
has subproperty: Abstract (Work)
name: derivativeRelationshipWork
status: New-Proposed
definition: A work that is a modification of a source work.

Superseded by
type: Property
sub property of: Succeeded by
has subproperty: Superseded by (Work)
has subproperty: Superseded by (Expression)
name: supersededBy
status: New-Proposed

Abstracted in
type: Property
name: abstractedIn
status: New-Proposed

Evaluation of (Work)
type: Property
domain: Work
sub property of: Evaluation of
sub property of: Description of (Work)
name: evaluationOfWork
status: New-Proposed
definition: A work that is examined or judged.

Insert (Manifestation)
type: Property
domain: Manifestation
sub property of: Insert
sub property of: Contains (Manifestation)
name: insertManifestation
status: New-Proposed
definition: A manifestation consisting of separately issued material that is not an integral part of the larger manifestation into which it has been inserted.

Verse adaptation (Expression)
type: Property
domain: Expression
sub property of: Verse adaptation
sub property of: Adapted as (Expression)
name: verseAdaptationExpression
status: New-Proposed
definition: An expression of a literary composition in verse form adapted from the source entity.

Continued by
type: Property
sub property of: Succeeded by
has subproperty: Continued by (Work)
has subproperty: Continued by (Expression)
name: continuedBy
status: New-Proposed

Digital transfer of (Item)
type: Property
domain: Item
sub property of: Digital transfer of
sub property of: Reproduction of (Item)
name: digitalTransferOfItem
status: New-Proposed
definition: An item transferred from one digital format to another.

Freely translated as (Work)
type: Property
domain: Work
sub property of: Freely translated as
sub property of: derivativeWork
name: freelyTranslatedAsWork
status: New-Proposed
definition: A work that created by freely rendering the source work into another language, preserving the spirit of the original, but not its linguistic details.

Derivative relationship (Expression)
type: Property
domain: Expression
sub property of: Derivative relationship
has subproperty: Musical arrangement (Expression)
has subproperty: Musical setting (Expression)
has subproperty: Indexed in (Expression)
has subproperty: Translated as (Expression)
has subproperty: Remade as (Expression)
has subproperty: Imitated as (Expression)
has subproperty: Expanded as (Expression)
has subproperty: Adapted as (Expression)
has subproperty: Choreography (Expression)
has subproperty: Digest (Expression)
has subproperty: Abridged as (Expression)
has subproperty: Paraphrased as (Expression)
has subproperty: Musical variations (Expression)
has subproperty: Freely translated as (Expression)
has subproperty: Based on (Expression)
has subproperty: Basis for libretto (Expression)
has subproperty: Abstract (Expression)
has subproperty: Summary (Expression)
name: derivativeRelationshipExpression
status: New-Proposed
definition: An expression that is a modification of a source entity.

Cadenza (Expression)
type: Property
domain: Expression
sub property of: Cadenza
sub property of: Complemented by (Expression)
name: cadenzaExpression
status: New-Proposed
definition: An expression of a musical work comprising an ornamental passage for a soloist, added to a musical work such as a concerto, either by the same or a different composer.

Index to (Expression)
type: Property
domain: Expression
sub property of: Index to
sub property of: Augmentation of (Expression)
name: indexToExpression
status: New-Proposed
definition: An expression of a work used as the basis for an index, i.e., a systematic, alphabetical guide to the contents of the predominant entity, usually keyed to page numbers or other reference codes.

Inserted in (Manifestation)
type: Property
domain: Manifestation
sub property of: Inserted in
sub property of: Contained in (Manifestation)
name: insertedInManifestation
status: New-Proposed
definition: A manifestation into which material has been inserted that is not an integral part of the publication.

Musical setting (Work)
type: Property
domain: Work
sub property of: Musical setting
sub property of: derivativeWork
name: musicalSettingWork
status: New-Proposed
definition: A non-dramatic musical work, except for an oratorio, that uses the text for the source work.

Issued with
type: Property
domain: Manifestation
sub property of: Accompanied by
has subproperty: Issued with (Manifestation)
name: issuedWith
status: New-Proposed

Absorbed (Expression)
type: Property
domain: Expression
sub property of: Absorbed
sub property of: Preceded by (Expression)
name: absorbedExpression
status: New-Proposed
definition: An expression of a work that has been incorporated into another entity.

Radio adaptation of (Expression)
type: Property
domain: Expression
sub property of: Radio adaptation of
sub property of: Adaptation of (Expression)
name: radioAdaptationOfExpression
status: New-Proposed
definition: An expression of a work that has been adapted as a radio program.

Separated from (Expression)
type: Property
domain: Expression
sub property of: Separated from
sub property of: Preceded by (Expression)
name: separatedFromExpression
status: New-Proposed
definition: An expression of a work that spun off a part of its content to form a new entity.

Filmed with (Item)
type: Property
domain: Item
sub property of: Filmed with
sub property of: Accompanied by (Item)
name: filmedWithItem
status: New-Proposed
definition: An item that is contained on the same microfilm with the item being described.

Reproduction of
type: Property
sub property of: Equivalence relationships
has subproperty: Facsimile of
has subproperty: Digital transfer of
has subproperty: Reproduction of (Item)
has subproperty: Reprint of
has subproperty: Electronic reproduction of
has subproperty: Reproduction of (Manifestation)
name: reproductionOf
status: New-Proposed

Paraphrase of
type: Property
sub property of: Based on
has subproperty: Paraphrase of (Work)
has subproperty: Paraphrase of (Expression)
name: paraphraseOf
status: New-Proposed

Abstract of
type: Property
sub property of: Based on
has subproperty: Abstract of (Work)
has subproperty: Abstract of (Expression)
name: abstractOf
status: New-Proposed

Video screenplay based on (Work)
type: Property
domain: Work
sub property of: Video screenplay based on
sub property of: Screenplay based on (Work)
name: videoScreenplayBasedOnWork
status: New-Proposed
definition: A work that has been adapted as the screenplay for a video.

Descriptive relationships (Manifestation)
type: Property
domain: Manifestation
sub property of: Descriptive relationships
has subproperty: Description of (Manifestation)
name: descriptiveRelationshipsManifestation
status: New-Proposed

Musical variations (Expression)
type: Property
domain: Expression
sub property of: Musical variations
sub property of: derivativeExpression
name: musicalVariationsExpression
status: New-Proposed
definition: An expression of a musical work in which melodic, thematic, or harmonic material from the source work is taken to form a discrete theme, which is repeated one or more times with subsequent modifications.

Merger of (Expression)
type: Property
domain: Expression
sub property of: Merger of
sub property of: Preceded by (Expression)
name: mergerOfExpression
status: New-Proposed
definition: An expression of one of two or more works which came together to form a new entity.

Complemented by
type: Property
has subproperty: Complemented by (Work)
has subproperty: Cadenza composed for
has subproperty: Script for the radio programme
has subproperty: Motion picture screenplay
has subproperty: Complemented by (Expression)
has subproperty: Screenplay for
has subproperty: Cadenza
has subproperty: Libretto for
has subproperty: Screenplay
has subproperty: Radio script
has subproperty: Libretto
name: complementedBy
status: New-Proposed

Adapted as a video screenplay
type: Property
sub property of: Adapted as a screenplay
has subproperty: Adapted as a video screenplay (Work)
has subproperty: Adapted as a video screenplay (Expression)
name: adaptedAsAVideoScreenplay
status: New-Proposed

Digital transfer
type: Property
sub property of: Reproduced as
has subproperty: Digital transfer (Manifestation)
name: digitalTransfer
status: New-Proposed

Separated from (Work)
type: Property
domain: Work
sub property of: Separated from
sub property of: Preceded by (Work)
name: separatedFromWork
status: New-Proposed
definition: A work that spun off a part of its content to form a new work.

Supplement to (Expression)
type: Property
domain: Expression
sub property of: Supplement to
sub property of: Augmentation of (Expression)
name: supplementToExpression
status: New-Proposed
definition: An expression of a work that is updated or otherwise complemented by the augmenting entity.

Whole-part relationship (Work)
type: Property
domain: Work
sub property of: Whole-part relationship
has subproperty: Contains (Work)
has subproperty: Contained in (Work)
name: wholePartRelationshipWork
status: New-Proposed

Adapted as a motion picture (Work)
type: Property
domain: Work
sub property of: Adapted as a motion picture
sub property of: Adapted as (Work)
name: adaptedAsAMotionPictureWork
status: New-Proposed
definition: A motion picture based on the source work.

Sequel (Work)
type: Property
domain: Work
sub property of: Sequel
sub property of: Succeeded by (Work)
name: sequelWork
status: New-Proposed
definition: A later work that continues the narrative of an earlier work.

Reproduction of (Item)
type: Property
domain: Item
sub property of: equivalentItem
sub property of: Reproduction of
has subproperty: Facsimile of (Item)
has subproperty: Digital transfer of (Item)
has subproperty: Electronic reproduction of (Item)
has subproperty: Reprint of (Item)
name: reproductionOfItem
status: New-Proposed
definition: A particular item used as the basis for a reproduction.

Adapted as a motion picture screenplay
type: Property
sub property of: Adapted as a screenplay
has subproperty: Adapted as a motion picture screenplay (Work)
has subproperty: Adapted as a motion picture screenplay (Expression)
name: adaptedAsAMotionPictureScreenplay
status: New-Proposed

Preservation facsimile of
type: Property
sub property of: Facsimile of
has subproperty: Preservation facsimile of (Manifestation)
has subproperty: Preservation facsimile of (Item)
name: preservationFacsimileOf
status: New-Proposed

Expression manifested
type: Property
domain: Manifestation
name: expressionManifested
status: New-Proposed
definition: A physical embodiment of an expression.

Imitation of (Expression)
type: Property
domain: Expression
sub property of: Based on (Expression)
sub property of: Imitation of
has subproperty: Parody of (Expression)
name: imitationOfExpression
status: New-Proposed
definition: An expression of a work whose style is copied in a derivative work.

Succeeded by
type: Property
sub property of: Sequential relationship
has subproperty: Sequel
has subproperty: Continued in part by
has subproperty: Split into
has subproperty: Continued by
has subproperty: Succeeded by (Work)
has subproperty: Superseded by
has subproperty: Absorbed in part by
has subproperty: Prequel to
has subproperty: Merged with to form
has subproperty: Absorbed by
has subproperty: Succeeded by (Expression)
has subproperty: Superseded in part by
name: succeededBy
status: New-Proposed

Verse adaptation of
type: Property
sub property of: Adaptation of
has subproperty: Verse adaptation of (Work)
has subproperty: Verse adaptation of (Expression)
name: verseAdaptationOf
status: New-Proposed

Video screenplay
type: Property
sub property of: Screenplay
has subproperty: Video screenplay (Expression)
name: videoScreenplay
status: New-Proposed

Reproduced as (Manifestation)
type: Property
domain: Manifestation
sub property of: Reproduced as
sub property of: equivalentManifestation
has subproperty: Facsimile (Manifestation)
has subproperty: Digital transfer
has subproperty: Digital transfer (Manifestation)
has subproperty: Electronic reproduction (Manifestation)
has subproperty: Reprinted as (Manifestation)
name: reproducedAsManifestation
status: New-Proposed
definition: A manifestation that reproduces another manifestation embodying the same expression of a work.

Summary of (Work)
type: Property
domain: Work
sub property of: Summary of
sub property of: Based on (Work)
name: summaryOfWork
status: New-Proposed
definition: A work used as the basis for a brief recapitulation of its content.

Review of (Expression)
type: Property
domain: Expression
sub property of: Review of
sub property of: Description of (Expression)
name: reviewOfExpression
status: New-Proposed
definition: An expression of a work used as the basis for a summative evaluation.

Libretto
type: Property
sub property of: Complemented by
has subproperty: Libretto (Work)
has subproperty: Libretto (Expression)
name: libretto
status: New-Proposed

Errata to (Work)
type: Property
domain: Work
sub property of: Errata to
sub property of: Augmentation of (Work)
name: errataToWork
status: New-Proposed
definition: A work that is augmented by a list of errors in the predominant work, discovered after publication, with their corrections.

Digest of (Work)
type: Property
domain: Work
sub property of: Digest of
sub property of: Based on (Work)
name: digestOfWork
status: New-Proposed
definition: A work that has been digested, i.e., systematically, comprehensively condensed.

Equivalence relationships (Manifestation)
type: Property
domain: Manifestation
sub property of: Equivalence relationships
has subproperty: Reproduced as (Manifestation)
has subproperty: Also issued as (Manifestation)
has subproperty: Reproduction of (Manifestation)
has subproperty: Mirror site (Manifestation)
name: equivalenceRelationshipsManifestation
status: New-Proposed
definition: A manifestation embodying the same expression of a work.

Appendix
type: Property
sub property of: Augmented by
has subproperty: Appendix (Work)
has subproperty: Appendix (Expression)
name: appendix
status: New-Proposed

Adapted as a television programme (Expression)
type: Property
domain: Expression
sub property of: Adapted as a television programme
sub property of: Adapted as (Expression)
name: adaptedAsATelevisionProgrammeExpression
status: New-Proposed
definition: A television programme based on the source entity.

Digital transfer of (Manifestation)
type: Property
domain: Manifestation
sub property of: Digital transfer of
sub property of: Reproduction of (Manifestation)
name: digitalTransferOfManifestation
status: New-Proposed
definition: A manifestation transferred from one digital format to another.

Translated as
type: Property
sub property of: derivativeRelationships
has subproperty: Translated as (Expression)
name: translatedAs
status: New-Proposed

Commentary on (Manifestation)
type: Property
domain: Manifestation
sub property of: Commentary on
sub property of: Description of (Manifestation)
name: commentaryOnManifestation
status: New-Proposed
definition: A manifestation used as the basis for a set of explanatory or critical notes.

Errata (Work)
type: Property
domain: Work
sub property of: Errata
sub property of: Augmented by (Work)
name: errataWork
status: New-Proposed
definition: A work consisting of errors discovered after the publication of the predominant work, with their corrections.

Reprint of (Manifestation)
type: Property
domain: Manifestation
sub property of: Reprint of
sub property of: Reproduction of (Manifestation)
name: reprintOfManifestation
status: New-Proposed
definition: A printed manifestation that is used as the basis for a reissue with the same content as the resource being described.

Free translation of (Expression)
type: Property
domain: Expression
sub property of: Free translation of
sub property of: Based on (Expression)
name: freeTranslationOfExpression
status: New-Proposed
definition: An expression of a work that has been translated freely, preserving the spirit of the original, but not its linguistic details.

Imitated as (Work)
type: Property
domain: Work
sub property of: Imitated as
sub property of: derivativeWork
has subproperty: Parodied as (Work)
name: imitatedAsWork
status: New-Proposed
definition: A work that copies the style of the source work.

Screenplay for
type: Property
sub property of: Complemented by
has subproperty: Screenplay for the television programme
has subproperty: Special issue (Manifestation)
has subproperty: Screenplay for (Expression)
has subproperty: Screenplay for the video
has subproperty: Screenplay for (Work)
has subproperty: Screenplay for the motion picture
name: screenplayFor
status: New-Proposed

Libretto (Expression)
type: Property
domain: Expression
sub property of: Libretto
sub property of: Complemented by (Expression)
name: librettoExpression
status: New-Proposed
definition: An expression of a work that provides the text of an opera or other work for the musical stage, or an oratorio.

Augmented by (Work)
type: Property
domain: Work
sub property of: Accompanying work
sub property of: Augmented by
has subproperty: Appendix (Work)
has subproperty: Finding aid (Work)
has subproperty: Catalogue (Work)
has subproperty: Illustrations (Work)
has subproperty: Guide (Work)
has subproperty: Addenda (Work)
has subproperty: Concordance (Work)
has subproperty: Index (Work)
has subproperty: Errata (Work)
has subproperty: Supplement (Work)
name: augmentedByWork
status: New-Proposed
definition: A work that adds to the content of a predominant work.

Indexed in (Work)
type: Property
domain: Work
sub property of: Indexed in
sub property of: derivativeWork
name: indexedInWork
status: New-Proposed
definition: A work (an abstracting and indexing service) that indexes the contents of the source work.

Inserted in
type: Property
sub property of: Contained in
has subproperty: Inserted in (Manifestation)
name: insertedIn
status: New-Proposed

Musical setting
type: Property
sub property of: derivativeRelationships
has subproperty: Musical setting (Work)
has subproperty: Musical setting (Expression)
name: musicalSetting
status: New-Proposed

Evaluation of
type: Property
sub property of: Description of
has subproperty: Evaluation of (Expression)
has subproperty: Evaluation of (Work)
has subproperty: Evaluation of (Manifestation)
has subproperty: Evaluation of (Item)
name: evaluationOf
status: New-Proposed

Contains
type: Property
sub property of: Whole-part relationship
has subproperty: Series contains
has subproperty: Contains (Expression)
has subproperty: Subseries
has subproperty: Contains (Manifestation)
has subproperty: Insert
has subproperty: Special issue
has subproperty: Contains (Item)
has subproperty: Contains (Work)
name: contains
status: New-Proposed

Guide to (Expression)
type: Property
domain: Expression
sub property of: Guide to
sub property of: Augmentation of (Expression)
name: guideToExpression
status: New-Proposed
definition: An expression of a work that is augmented by another work comprising material to help the user of the predominant work, such as notes, learning and study aids, exercises, problems, questions and answers, instructor or student materials, etc.

Screenplay for the television programme (Expression)
type: Property
domain: Expression
sub property of: Screenplay for the television programme
sub property of: Screenplay for (Expression)
name: screenplayForTheTelevisionProgrammeExpression
status: New-Proposed
definition: An expression of a work that uses the text as a screenplay for a television programme.

Concordance to
type: Property
sub property of: Augmentation of
has subproperty: Concordance to (Work)
has subproperty: Concordance to (Expression)
name: concordanceTo
status: New-Proposed

Evaluation of (Manifestation)
type: Property
domain: Manifestation
sub property of: Evaluation of
sub property of: Description of (Manifestation)
name: evaluationOfManifestation
status: New-Proposed
definition: A manifestation that is examined or judged.

Television adaptation of (Expression)
type: Property
domain: Expression
sub property of: Television adaptation of
name: televisionAdaptationOfExpression
status: New-Proposed
definition: An expression of a work that has been adapted as a television program.

Augmented by
type: Property
has subproperty: Supplement
has subproperty: Augmented by (Work)
has subproperty: Guide
has subproperty: Appendix
has subproperty: Errata
has subproperty: Index
has subproperty: Concordance
has subproperty: Addenda
has subproperty: Augmented by (Expression)
has subproperty: Catalogue
has subproperty: Finding aid
has subproperty: Illustrations
name: augmentedBy
status: New-Proposed

Index to (Work)
type: Property
domain: Work
sub property of: Index to
sub property of: Augmentation of (Work)
name: indexToWork
status: New-Proposed
definition: A work used as the basis for an index, i.e., a systematic, alphabetical guide to the contents of the augmented work, usually keyed to page numbers or other reference codes.

Reproduction of (Manifestation)
type: Property
domain: Manifestation
sub property of: Reproduction of
sub property of: equivalentManifestation
has subproperty: Facsimile of (Manifestation)
has subproperty: Reprint of (Manifestation)
has subproperty: Digital transfer of (Manifestation)
has subproperty: Electronic reproduction of (Manifestation)
name: reproductionOfManifestation
status: New-Proposed
definition: A manifestation used as the basis for a reproduction.

Evaluation of (Expression)
type: Property
domain: Expression
sub property of: Evaluation of
sub property of: Description of (Expression)
name: evaluationOfExpression
status: New-Proposed
definition: An expression of a work that is examined or judged.

Concordance to (Expression)
type: Property
domain: Expression
sub property of: Concordance to
sub property of: Augmentation of (Expression)
name: concordanceToExpression
status: New-Proposed
definition: An expression of a work used as the basis for a concordance, i.e., an index of all the words in the predominant entity.

Illustrations for (Expression)
type: Property
domain: Expression
sub property of: Illustrations for
sub property of: Augmentation of (Expression)
name: illustrationsForExpression
status: New-Proposed
definition: An expression of a work that is augmented by pictorial content designed to elucidate or decorate it.

Video screenplay (Expression)
type: Property
domain: Expression
sub property of: Video screenplay
sub property of: Screenplay (Expression)
name: videoScreenplayExpression
status: New-Proposed
definition: An expression of a work that provides the text for a video.

Critique of (Manifestation)
type: Property
domain: Manifestation
sub property of: Critique of
sub property of: Description of (Manifestation)
name: critiqueOfManifestation
status: New-Proposed
definition: A manifestation used as the basis for a critical evaluation.

Digest (Expression)
type: Property
domain: Expression
sub property of: Digest
sub property of: derivativeExpression
name: digestExpression
status: New-Proposed
definition: An expression of a work that systematically, comprehensively condenses the source entity.

Reproduced as
type: Property
sub property of: Equivalence relationships
has subproperty: Facsimile
has subproperty: Reproduced as (Manifestation)
has subproperty: Reprinted as
has subproperty: Digital transfer
has subproperty: Electronic reproduction
name: reproducedAs
status: New-Proposed

Remade as
type: Property
sub property of: derivativeRelationships
has subproperty: Remade as (Work)
has subproperty: Remade as (Expression)
name: remadeAs
status: New-Proposed

Script for the radio programme
type: Property
sub property of: Complemented by
has subproperty: Script for the radio programme (Work)
has subproperty: Script for the radio programme (Expression)
name: scriptForTheRadioProgramme
status: New-Proposed

Digest of (Expression)
type: Property
domain: Expression
sub property of: Digest of
sub property of: Based on (Expression)
name: digestOfExpression
status: New-Proposed
definition: An expression of a work that has been digested, i.e., systematically, comprehensively condensed.

Contained in
type: Property
sub property of: Whole-part relationship
has subproperty: Contained in (Manifestation)
has subproperty: Contained in (item)
has subproperty: Inserted in
has subproperty: In series
has subproperty: Contained in (Work)
has subproperty: Subseries of
has subproperty: Contained in (Expression)
has subproperty: Special issue of
name: containedIn
status: New-Proposed

Television screenplay based on (Work)
type: Property
domain: Work
sub property of: Television screenplay based on
sub property of: Screenplay based on (Work)
name: televisionScreenplayBasedOnWork
status: New-Proposed
definition: A work that has been adapted as the screenplay for a television programme.

Exemplar of manifestation
type: Property
domain: Manifestation
name: exemplarOfManifestation
status: New-Proposed
definition: A single exemplar or instance of a manifestation.

Adapted as a screenplay
type: Property
sub property of: Adapted as
has subproperty: Adapted as a motion picture screenplay
has subproperty: Adapted as a screenplay (Expression)
has subproperty: Adapted as a television screenplay
has subproperty: Adapted as a video screenplay
has subproperty: Adapted as a screenplay (Work)
name: adaptedAsAScreenplay
status: New-Proposed

Finding aid for
type: Property
sub property of: Augmentation of
has subproperty: Finding aid for (Work)
has subproperty: Finding aid for (Expression)
name: findingAidFor
status: New-Proposed

Review of
type: Property
sub property of: Description of
has subproperty: Review of (Manifestation)
has subproperty: Review of (Item)
has subproperty: Review of (Work)
has subproperty: Review of (Expression)
name: reviewOf
status: New-Proposed

Dramatized as
type: Property
sub property of: Adapted as
has subproperty: Dramatized as (Work)
has subproperty: Dramatized as (Expression)
name: dramatizedAs
status: New-Proposed

Summary of (Expression)
type: Property
domain: Expression
sub property of: Summary of
sub property of: Based on (Expression)
name: summaryOfExpression
status: New-Proposed
definition: An expression of a work used as the basis for a brief recapitulation of its content.

Index (Work)
type: Property
domain: Work
sub property of: Index
sub property of: Augmented by (Work)
name: indexWork
status: New-Proposed
definition: A work that provides a systematic, alphabetical guide to the contents of the predominant work, usually keyed to page numbers or other reference codes.

Catalogue of (Expression)
type: Property
domain: Expression
sub property of: Catalogue of
sub property of: Augmentation of (Expression)
name: catalogueOfExpression
status: New-Proposed
definition: An expression of a work used as the basis for a catalogue, i.e., a complete enumeration of items arranged systematically.

Sequential relationship (Work)
type: Property
domain: Work
sub property of: Sequential relationship
has subproperty: Succeeded by (Work)
has subproperty: Preceded by (Work)
has subproperty: Prequel (Work)
name: sequentialRelationshipWork
status: New-Proposed

Indexing for
type: Property
sub property of: Based on
has subproperty: Indexing for (Work)
has subproperty: Indexing for (Expression)
name: indexingFor
status: New-Proposed

Screenplay (Expression)
type: Property
domain: Expression
sub property of: Complemented by (Expression)
sub property of: Screenplay
has subproperty: Television screenplay (Expression)
has subproperty: Video screenplay (Expression)
name: screenplayExpression
status: New-Proposed
definition: An expression of a work that provides the text for a motion picture, television programme or video.

Evaluated in (Work)
type: Property
domain: Work
sub property of: Evaluated in
sub property of: Described in (Work)
name: evaluatedInWork
status: New-Proposed
definition: A work that examines or judges the source work.

Critiqued in
type: Property
sub property of: Described in
has subproperty: Critiqued in (Work)
has subproperty: Critiqued in (Expression)
name: critiquedIn
status: New-Proposed

Abridged as (Expression)
type: Property
domain: Expression
sub property of: Abridged as
sub property of: derivativeExpression
name: abridgedAsExpression
status: New-Proposed
definition: An expression of a work that shortens the source entity without changing the general meaning or manner of presentation.

Sequential relationship (Expression)
type: Property
domain: Expression
sub property of: Sequential relationship
has subproperty: Succeeded by (Expression)
has subproperty: Preceded by (Expression)
name: sequentialRelationshipExpression
status: New-Proposed

Adaptation of (Work)
type: Property
domain: Work
sub property of: Based on (Work)
sub property of: Adaptation of
has subproperty: Dramatization of (Work)
has subproperty: Video adaptation of (Work)
has subproperty: Television adaptation of (Work)
has subproperty: Novelization of (Work)
has subproperty: Screenplay based on (Work)
has subproperty: Radio adaptation of (Work)
has subproperty: Verse adaptation of (Work)
has subproperty: Radio script based on (Work)
has subproperty: Motion picture adaptation of (Work)
name: adaptationOfWork
status: New-Proposed
definition: A work that has been modified for a purpose, use, or medium other than that for which it was originally intended.

Novelization (Work)
type: Property
domain: Work
sub property of: Novelization
sub property of: Adapted as (Work)
name: novelizationWork
status: New-Proposed
definition: A novel adapted from the source work.

Succeeded by (Work)
type: Property
comment: For sequentially numbered works with revised content.
domain: Work
sub property of: Sequential relationship
sub property of: Succeeded by
has subproperty: Continued by (Work)
has subproperty: Split into (Work)
has subproperty: Prequel to (Work)
has subproperty: Superseded in part by (Work)
has subproperty: Sequel (Work)
has subproperty: Absorbed in part by (Work)
has subproperty: Absorbed by (Work)
has subproperty: Superseded by (Work)
has subproperty: Merged with to form (Work)
has subproperty: Continued in part by (Work)
name: succeededByWork
status: New-Proposed
definition: A work that succeeds (e.g., later in time or after in a narrative) the preceding work.

Libretto for (work)
type: Property
sub property of: Libretto for
sub property of: Contained in (Work)
name: librettoForWork
status: New-Proposed
definition: A musical work such as an opera or other work for the musical stage concerto that contains a vocal text.

Finding aid for (Expression)
type: Property
domain: Expression
sub property of: Finding aid for
sub property of: Augmentation of (Expression)
name: findingAidForExpression
status: New-Proposed
definition: An expression of an archival collection used as the basis for a finding aid, i.e., a guide to the organization, arrangement, and contents of the collection.

Review of (Manifestation)
type: Property
domain: Manifestation
sub property of: Review of
sub property of: Description of (Manifestation)
name: reviewOfManifestation
status: New-Proposed
definition: A manifestation used as the basis for a summative evaluation.

Supersedes in part
type: Property
sub property of: Preceded by
has subproperty: Supersedes in part (Work)
has subproperty: Supersedes in part (Expression)
name: supersedesInPart
status: New-Proposed

Absorbed (Work)
type: Property
domain: Work
sub property of: Absorbed
sub property of: Preceded by (Work)
name: absorbedWork
status: New-Proposed
definition: A work that has been incorporated into another work.

Filmed with (Manifestation)
type: Property
domain: Manifestation
sub property of: Issued with (Manifestation)
name: filmedWithManifestation
status: New-Proposed
definition: A manifestation that is issued on the same carrier with the manifestation being described.

Commentary in (Expression)
type: Property
domain: Expression
sub property of: Commentary in
sub property of: Described in (Expression)
name: commentaryInExpression
status: New-Proposed
definition: An expression of a work that contains a set of explanatory or critical notes on the described entity.

Abstracts for (Work)
type: Property
domain: Work
sub property of: Abstracts for
sub property of: Based on
name: abstractsForWork
status: New-Proposed
definition: A work whose contents have been abstracted by an abstracting and indexing service.

Free translation of (Work)
type: Property
domain: Work
sub property of: Free translation of
sub property of: Based on (Work)
name: freeTranslationOfWork
status: New-Proposed
definition: A work that has been translated freely, preserving the spirit of the original, but not its linguistic details.

Parody of (Expression)
type: Property
domain: Expression
sub property of: Parody of
sub property of: Imitation of (Expression)
name: parodyOfExpression
status: New-Proposed
definition: An expression of a work whose style or content is imitated for comic effect.

Paraphrased as
type: Property
sub property of: derivativeRelationships
has subproperty: Paraphrased as (Work)
has subproperty: Paraphrased as (Expression)
name: paraphrasedAs
status: New-Proposed

Analysed in
type: Property
sub property of: Described in
has subproperty: Analysed in (Work)
has subproperty: Analysed in (Expression)
name: analysedIn
status: New-Proposed

Description of (Expression)
type: Property
domain: Expression
sub property of: Description of
sub property of: Descriptive relationships (Expression)
has subproperty: Review of (Expression)
has subproperty: Critique of (Expression)
has subproperty: Commentary on (Expression)
has subproperty: Analysis of (Expression)
has subproperty: Evaluation of (Expression)
name: descriptionOfExpression
status: New-Proposed
definition: An expression described by a describing entity.

Musical variations (Work)
type: Property
domain: Work
sub property of: Musical variations
sub property of: derivativeWork
name: musicalVariationsWork
status: New-Proposed
definition: A musical work in which melodic, thematic, or harmonic material from the source work is taken to form a discrete theme, which is repeated one or more times with subsequent modifications.

Continued by (Expression)
type: Property
comment: Apply generally to serials.
domain: Expression
sub property of: Succeeded by (Expression)
sub property of: Continued by
name: continuedByExpression
status: New-Proposed
definition: An expression of a work whose content separated from an earlier entity to form a new entity.

Adapted as a television screenplay (Work)
type: Property
domain: Work
sub property of: Adapted as a television screenplay
sub property of: Adapted as a screenplay (Work)
name: adaptedAsATelevisionScreenplayWork
status: New-Proposed
definition: A work comprising the screenplay for a television programme, based on the source work.

Expanded version of (Expression)
type: Property
domain: Expression
sub property of: Expanded version of
sub property of: Based on (Expression)
name: expandedVersionOfExpression
status: New-Proposed
definition: An expression of a work used as the basis for a derivative work that enlarges upon the content of the source work.

Abstract (Expression)
type: Property
domain: Expression
sub property of: Abstract
sub property of: derivativeExpression
name: abstractExpression
status: New-Proposed
definition: An expression of a work that abbreviates the source entity in a brief, objective manner.

Revision of
type: Property
sub property of: Based on
has subproperty: Revision of (expression)
name: revisionOf
status: New-Proposed

Addenda to (Work)
type: Property
domain: Work
sub property of: Addenda to
sub property of: Augmentation of (Work)
name: addendaToWork
status: New-Proposed
definition: A work to which is added, usually at the end of the work, but sometimes separately from it, brief additional material, less extensive than a supplement, which is essential to the completeness of the content of the work.

Absorbed in part by
type: Property
sub property of: Succeeded by
has subproperty: Absorbed in part by (Work)
has subproperty: Absorbed in part by (Expression)
name: absorbedInPartBy
status: New-Proposed

Sequel
type: Property
sub property of: Succeeded by
has subproperty: Sequel (Work)
name: sequel
status: New-Proposed

Motion picture adaptation of (Expression)
type: Property
domain: Expression
sub property of: Motion picture adaptation of
name: motionPictureAdaptationOfExpression
status: New-Proposed
definition: An expression of a work that has been adapted as a motion picture.

Addenda (Work)
type: Property
domain: Work
sub property of: Addenda
sub property of: Augmented by (Work)
name: addendaWork
status: New-Proposed
definition: A work that consists of brief additional material, less extensive than a supplement, which is essential to the completeness of the text of the predominant work and is usually added to the end of the content, but may also be issued separately.

Critiqued in (Expression)
type: Property
domain: Expression
sub property of: Critiqued in
sub property of: Described in (Expression)
name: critiquedInExpression
status: New-Proposed
definition: An expression of a work contains a critical evaluation of the described entity.

Motion picture screenplay
type: Property
sub property of: Complemented by
has subproperty: Motion picture screenplay (Expression)
name: motionPictureScreenplay
status: New-Proposed

Adaptation of (Expression)
type: Property
domain: Expression
sub property of: Based on (Expression)
sub property of: Adaptation of
has subproperty: Video adaptation of (Expression)
has subproperty: Radio script based on (Expression)
has subproperty: Radio adaptation of (Expression)
name: adaptationOfExpression
status: New-Proposed
definition: An expression of a work that modifies the source entity for a purpose, use, or medium other than that for which it was originally intended.

Remade as (Expression)
type: Property
domain: Expression
sub property of: Remade as
sub property of: derivativeExpression
name: remadeAsExpression
status: New-Proposed
definition: An expression of a new motion picture, radio programme, television programme, or video based on an earlier work.

Prequel (Work)
type: Property
domain: Work
sub property of: Prequel
sub property of: Preceded by (Work)
name: prequelWork
status: New-Proposed
definition: A work that extends the narrative of an earlier work backwards in time.

Translated as (Expression)
type: Property
domain: Expression
sub property of: Translated as
sub property of: derivativeExpression
name: translatedAsExpression
status: New-Proposed
definition: An expression of a work that renders the text of the source entity into a language different from that of the original work.

Descriptive relationships (Expression)
type: Property
domain: Expression
sub property of: Descriptive relationships
has subproperty: Description of (Expression)
has subproperty: Described in (Expression)
name: descriptiveRelationshipsExpression
status: New-Proposed

Separated from
type: Property
sub property of: Preceded by
has subproperty: Separated from (Work)
has subproperty: Separated from (Expression)
name: separatedFrom
status: New-Proposed

Absorbed in part (Work)
type: Property
domain: Work
sub property of: Absorbed in part
sub property of: Preceded by (Work)
name: absorbedInPartWork
status: New-Proposed
definition: A work that has been partially incorporated into another work.

Supersedes
type: Property
sub property of: Preceded by
has subproperty: Supersedes (Work)
has subproperty: Supersedes (Expression)
name: supersedes
status: New-Proposed

Choreography for
type: Property
sub property of: Based on
has subproperty: Choreography for (Work)
has subproperty: Choreography for (Expression)
name: choreographyFor
status: New-Proposed

Libretto for
type: Property
sub property of: Complemented by
has subproperty: Libretto for (work)
has subproperty: Libretto for (Expression)
name: librettoFor
status: New-Proposed

Parody of
type: Property
sub property of: Imitation of
has subproperty: Parody of (Work)
has subproperty: Parody of (Expression)
name: parodyOf
status: New-Proposed

Continued in part by (Expression)
type: Property
comment: Apply generally to serials.
domain: Expression
sub property of: Continued in part by
sub property of: Succeeded by (Expression)
name: continuedInPartByExpression
status: New-Proposed
definition: An expression of a work part of whose content separated from an earlier entity to form a new entity.

Television screenplay based on (Expression)
type: Property
domain: Expression
sub property of: Television screenplay based on
sub property of: Screenplay based on (Expression)
name: televisionScreenplayBasedOnExpression
status: New-Proposed
definition: An expression of a work that has been adapted as the screenplay for a television programme.

Imitated as
type: Property
sub property of: derivativeRelationships
has subproperty: Imitated as (Work)
has subproperty: Imitated as (Expression)
has subproperty: Parodied as
name: imitatedAs
status: New-Proposed

Television screenplay based on
type: Property
sub property of: Screenplay based on
has subproperty: Television screenplay based on (Work)
has subproperty: Television screenplay based on (Expression)
name: televisionScreenplayBasedOn
status: New-Proposed

Dramatized as (Work)
type: Property
domain: Work
sub property of: Dramatized as
sub property of: Adapted as (Work)
name: dramatizedAsWork
status: New-Proposed
definition: A dramatic work adapted from the source work.

Supplement (Work)
type: Property
domain: Work
sub property of: Supplement
sub property of: Augmented by (Work)
name: supplementWork
status: New-Proposed
definition: A work that updates or otherwise complements the predominant work.

Prequel
type: Property
sub property of: Preceded by
has subproperty: Prequel (Work)
name: prequel
status: New-Proposed

Illustrations for
type: Property
sub property of: Augmentation of
has subproperty: Illustrations for (Work)
has subproperty: Illustrations for (Expression)
name: illustrationsFor
status: New-Proposed

Sequel to (Work)
type: Property
domain: Work
sub property of: Sequel to
sub property of: Preceded by (Work)
name: sequelToWork
status: New-Proposed
definition: A work whose narrative is continued by a later work.

Screenplay for (Expression)
type: Property
domain: Expression
sub property of: Complemented by (Expression)
sub property of: Screenplay for
has subproperty: Screenplay for the television programme (Expression)
has subproperty: Screenplay for the video (Expression)
has subproperty: Screenplay for the motion picture (Expression)
name: screenplayForExpression
status: New-Proposed
definition: An expression of a work such as a motion picture, television programme, or video, that uses the text of the work as a screenplay.

On disc with (Item)
type: Property
domain: Item
sub property of: On disc with
sub property of: Accompanied by (Item)
name: onDiscWithItem
status: New-Proposed
definition: An item that is contained on the same disc with the item being described.

Subseries of (Work)
type: Property
domain: Work
sub property of: Subseries of
sub property of: Contained in (Work)
name: subseriesOfWork
status: New-Proposed
definition: A work in which the part consistently appears; all issues or parts of the subseries bear the title of the larger work.

Cadenza composed for (Expression)
type: Property
domain: Expression
sub property of: Cadenza composed for
sub property of: Complemented by (Expression)
name: cadenzaComposedForExpression
status: New-Proposed
definition: An expression of a musical work such as a concerto for which an ornamental passage for a soloist has been composed, either by the same or a different composer.

Preservation facsimile (Manifestation)
type: Property
domain: Manifestation
sub property of: Preservation facsimile
sub property of: Facsimile (Manifestation)
name: preservationFacsimileManifestation
status: New-Proposed
definition: A manifestation consisting of an exact reproduction on preservation-quality media, such as acid-free permanent or archival paper.

Concordance (Work)
type: Property
domain: Work
sub property of: Concordance
sub property of: Augmented by (Work)
name: concordanceWork
status: New-Proposed
definition: A work that comprises an index of all the words in the predominant work.

Parody of (Work)
type: Property
domain: Work
sub property of: Parody of
sub property of: Imitation of (Work)
name: parodyOfWork
status: New-Proposed
definition: A work whose style is imitated for comic effect.

Expanded version of
type: Property
sub property of: Based on
has subproperty: Expanded version of (Work)
has subproperty: Expanded version of (Expression)
name: expandedVersionOf
status: New-Proposed

Musical setting of (Work)
type: Property
domain: Work
sub property of: Musical setting of
sub property of: Based on (Work)
name: musicalSettingOfWork
status: New-Proposed
definition: A work that provides the text for a non-dramatic musical work, except for an oratorio.

Analysed in (Work)
type: Property
domain: Work
sub property of: Analysed in
sub property of: Described in (Work)
name: analysedInWork
status: New-Proposed
definition: A work that examines the source work to identify its components and their relations.

Verse adaptation of (Expression)
type: Property
domain: Expression
sub property of: Verse adaptation of
name: verseAdaptationOfExpression
status: New-Proposed
definition: An expression of a work that has been adapted as a literary composition in verse form.

Review of (Item)
type: Property
domain: Item
sub property of: Review of
sub property of: Description of (Item)
name: reviewOfItem
status: New-Proposed
definition: An item used as the basis for a summative evaluation.

Digital transfer (Manifestation)
type: Property
domain: Manifestation
sub property of: Digital transfer
sub property of: Reproduced as (Manifestation)
name: digitalTransferManifestation
status: New-Proposed
definition: A manifestation transferred from one digital format to another.

Appendix (Work)
type: Property
domain: Work
sub property of: Appendix
sub property of: Augmented by (Work)
name: appendixWork
status: New-Proposed
definition: A work that forms an augmenting part of another work which is not essential to the completeness of the content, such as a list of references, statistical tables, and explanatory matter; may be material which comes at the end of the content of the predominant work, or may be issued separately.

Reviewed in (Work)
type: Property
domain: Work
sub property of: Reviewed in
sub property of: Described in (Work)
name: reviewedInWork
status: New-Proposed
definition: A work that contains a summative evaluation of the described work.

Description of
type: Property
sub property of: Descriptive relationships
has subproperty: Critique of
has subproperty: Description of (Item)
has subproperty: Description of (Work)
has subproperty: Evaluation of
has subproperty: Description of (Manifestation)
has subproperty: Analysis of
has subproperty: Description of (Expression)
has subproperty: Review of
has subproperty: Commentary on
name: descriptionOf
status: New-Proposed

Errata to (Expression)
type: Property
domain: Expression
sub property of: Errata to
sub property of: Augmentation of (Expression)
name: errataToExpression
status: New-Proposed
definition: An expression of a work that is augmented by a list of errors in the augmented work, discovered after publication, with their corrections.

Adapted as a video screenplay (Work)
type: Property
domain: Work
sub property of: Adapted as a video screenplay
sub property of: Adapted as a screenplay (Work)
name: adaptedAsAVideoScreenplayWork
status: New-Proposed
definition: A work comprising the screenplay for a video, based on the source work.

Choreography for (Expression)
type: Property
domain: Expression
sub property of: Choreography for
sub property of: Based on (Expression)
name: choreographyForExpression
status: New-Proposed
definition: An expression of a work used as the basis for a derivative work comprising dance.

Choreography
type: Property
has subproperty: Choreography (Work)
has subproperty: Choreography (Expression)
name: choreography
status: New-Proposed

Accompanied by
type: Property
has subproperty: Accompanied by (Manifestation)
has subproperty: Bound with
has subproperty: On disc with
has subproperty: Issued with
has subproperty: Accompanied by (Item)
has subproperty: Filmed with
name: accompaniedBy
status: New-Proposed

Bound with
type: Property
sub property of: Accompanied by
has subproperty: Bound with (Item)
name: boundWith
status: New-Proposed

Libretto (Work)
type: Property
sub property of: Libretto
sub property of: Contains (Work)
name: librettoWork
status: New-Proposed
definition: A work comprising the text of an opera or other work for the musical stage.

Sequential relationship (Item)
type: Property
domain: Item
sub property of: Sequential relationship
name: sequentialRelationshipItem
status: New-Proposed

Choreography for (Work)
type: Property
domain: Work
sub property of: Choreography for
sub property of: Based on (Work)
name: choreographyForWork
status: New-Proposed
definition: A work used as the basis for a derivative work comprising dance.

Adapted as a motion picture screenplay (Expression)
type: Property
domain: Expression
sub property of: Adapted as a motion picture screenplay
sub property of: Adapted as a screenplay (Expression)
name: adaptedAsAMotionPictureScreenplayExpression
status: New-Proposed
definition: An expression of a work comprising the screenplay for a motion picture, based on the source work.

Equivalence relationships
type: Property
has subproperty: Equivalence relationships (Manifestation)
has subproperty: Mirror site
has subproperty: Reproduced as
has subproperty: Reproduction of
has subproperty: Equivalence relationships (Item)
name: equivalenceRelationships
status: New-Proposed

Critique of (Item)
type: Property
domain: Item
sub property of: Critique of
sub property of: Description of (Item)
name: critiqueOfItem
status: New-Proposed
definition: An item used as the basis for a critical evaluation.

Summary (Expression)
type: Property
domain: Expression
sub property of: Summary
sub property of: derivativeExpression
name: summaryExpression
status: New-Proposed
definition: An expression of a work that comprises a brief recapitulation of the content of the source entity.

Preceded by (Expression)
type: Property
domain: Expression
sub property of: Sequential relationship (Expression)
sub property of: Preceded by
has subproperty: Absorbed (Expression)
has subproperty: Supersedes in part (Expression)
has subproperty: Continues in part (Expression)
has subproperty: Continues (Expression)
has subproperty: Merger of (Expression)
has subproperty: Absorbed in part (Expression)
has subproperty: Supersedes (Expression)
has subproperty: Separated from (Expression)
name: precededByExpression
status: New-Proposed
definition: An expression of a work that precedes (e.g., is earlier in time or before in narrative) the succeeding entity.

Adapted as a radio programme (Work)
type: Property
domain: Work
sub property of: Adapted as a radio programme
sub property of: Adapted as (Work)
name: adaptedAsARadioProgrammeWork
status: New-Proposed
definition: A radio programme based on the source work.

Script for the radio programme (Work)
type: Property
domain: Work
sub property of: Script for the radio programme
sub property of: Complemented by (Work)
name: scriptForTheRadioProgrammeWork
status: New-Proposed
definition: A work that adapts the source work as the script for a radio program.

Catalogue
type: Property
sub property of: Augmented by
has subproperty: Catalogue (Work)
has subproperty: Catalogue (Expression)
name: catalogue
status: New-Proposed

Split into (Work)
type: Property
domain: Work
sub property of: Split into
sub property of: Succeeded by (Work)
name: splitIntoWork
status: New-Proposed
definition: One of two or more works resulting from the division of an earlier work into separate works.

Absorbed by (Work)
type: Property
domain: Work
sub property of: Absorbed by
sub property of: Succeeded by (Work)
name: absorbedByWork
status: New-Proposed
definition: A work that incorporates another work.

Descriptive relationships
type: Property
has subproperty: Description of
has subproperty: Described in
name: descriptiveRelationships
status: New-Proposed

Critiqued in (Work)
type: Property
domain: Work
sub property of: Critiqued in
sub property of: Described in (Work)
name: critiquedInWork
status: New-Proposed
definition: A work that contains a critical evaluation of the described entity.

Screenplay for the video (Expression)
type: Property
domain: Expression
sub property of: Screenplay for the video
sub property of: Screenplay for (Expression)
name: screenplayForTheVideoExpression
status: New-Proposed
definition: An expression of a work that uses the text as a screenplay for a video.

Appendix to
type: Property
sub property of: Augmentation of
has subproperty: Appendix to (Work)
has subproperty: Appendix to (Expression)
name: appendixTo
status: New-Proposed

Critique of
type: Property
sub property of: Description of
has subproperty: Critique of (Item)
has subproperty: Critique of (Expression)
has subproperty: Critique of (Work)
has subproperty: Critique of (Manifestation)
name: critiqueOf
status: New-Proposed

Screenplay for the television programme
type: Property
sub property of: Screenplay for
has subproperty: Screenplay for the television programme (Work)
has subproperty: Screenplay for the television programme (Expression)
name: screenplayForTheTelevisionProgramme
status: New-Proposed

Finding aid (Work)
type: Property
domain: Work
sub property of: Finding aid
sub property of: Augmented by (Work)
name: findingAidWork
status: New-Proposed
definition: A work that provides a guide to the organization, arrangement, and contents of an archival collection.

Paraphrased as (Expression)
type: Property
domain: Expression
sub property of: Paraphrased as
sub property of: derivativeExpression
name: paraphrasedAsExpression
status: New-Proposed
definition: An expression of a work that restates the content of the source work in a different form.

Based on (Work)
type: Property
domain: Work
sub property of: Based on
sub property of: Derivative relationship (Work)
has subproperty: Imitation of (Work)
has subproperty: Video adaptation of (Work)
has subproperty: Musical variations based on (Work)
has subproperty: Paraphrase of (Work)
has subproperty: Screenplay based on (Work)
has subproperty: Novelization of (Work)
has subproperty: Abstract of (Work)
has subproperty: Television screenplay based on (Work)
has subproperty: Remake of (Work)
has subproperty: Expanded version of (Work)
has subproperty: Adaptation of (Work)
has subproperty: Radio adaptation of (Work)
has subproperty: Free translation of (Work)
has subproperty: Digest of (Work)
has subproperty: Radio script based on (Work)
has subproperty: Libretto based on (Work)
has subproperty: Indexing for (Work)
has subproperty: Musical setting of (Work)
has subproperty: Summary of (Work)
has subproperty: Choreography for (Work)
has subproperty: Abridgement of (Work)
has subproperty: Verse adaptation of (Work)
has subproperty: Motion picture adaptation of (Work)
name: basedOnWork
status: New-Proposed
definition: A work used as the source for a derivative work.

Novelization
type: Property
sub property of: Adapted as
has subproperty: Novelization (Work)
has subproperty: Novelization (Expression)
name: novelization
status: New-Proposed

Motion picture screenplay based on (Expression)
type: Property
domain: Expression
sub property of: Motion picture screenplay based on
sub property of: Screenplay based on (Expression)
name: motionPictureScreenplayBasedOnExpression
status: New-Proposed
definition: An expression of a work that has been adapted as the screenplay for a motion picture.

Abridgement of (Work)
type: Property
domain: Work
sub property of: Abridgement of
sub property of: Based on (Work)
name: abridgementOfWork
status: New-Proposed
definition: A work that has been abridged, i.e., shortened without changing the general meaning or manner of presentation of the source work.

Musical arrangement of
type: Property
sub property of: Based on
has subproperty: Musical arrangement of (Expression)
name: musicalArrangementOf
status: New-Proposed

Expanded as
type: Property
sub property of: derivativeRelationships
has subproperty: Expanded as (Work)
has subproperty: Expanded as (Expression)
name: expandedAs
status: New-Proposed

Dramatized as (Expression)
type: Property
domain: Expression
sub property of: Dramatized as
sub property of: Adapted as (Expression)
name: dramatizedAsExpression
status: New-Proposed
definition: An expression of a dramatic work adapted from the source entity.

Analysis of (Item)
type: Property
domain: Item
sub property of: Analysis of
sub property of: Description of (Item)
name: analysisOfItem
status: New-Proposed
definition: An item that has been examined to identify its components and their relations.

Television adaptation of (Work)
type: Property
domain: Work
sub property of: Television adaptation of
sub property of: Adaptation of (Work)
name: televisionAdaptationOfWork
status: New-Proposed
definition: A work that has been adapted as a television programme.

Television screenplay (Expression)
type: Property
domain: Expression
sub property of: Television screenplay
sub property of: Screenplay (Expression)
name: televisionScreenplayExpression
status: New-Proposed
definition: An expression of a work that provides the text for a television programme.

Review of (Work)
type: Property
domain: Work
sub property of: Review of
sub property of: Description of (Work)
name: reviewOfWork
status: New-Proposed
definition: A work used as the basis for a summative evaluation.

Facsimile of (Item)
type: Property
domain: Item
sub property of: Reproduction of (Item)
sub property of: Facsimile of
has subproperty: Preservation facsimile of (Item)
name: facsimileOfItem
status: New-Proposed
definition: A particular item used as the basis for an exact reproduction.

Digest of
type: Property
sub property of: Based on
has subproperty: Digest of (Work)
has subproperty: Digest of (Expression)
name: digestOf
status: New-Proposed

Reprinted as
type: Property
sub property of: Reproduced as
has subproperty: Reprinted as (Manifestation)
name: reprintedAs
status: New-Proposed

Abstracts for
type: Property
sub property of: Based on
has subproperty: Abstracts for (Work)
has subproperty: Abstracts for (Expression)
name: abstractsFor
status: New-Proposed

Errata to
type: Property
sub property of: Augmentation of
has subproperty: Errata to (Work)
has subproperty: Errata to (Expression)
name: errataTo
status: New-Proposed

Work manifested
type: Property
domain: Manifestation
name: workManifested
status: New-Proposed
definition: A work embodied in a manifestation.

Dramatization of (Work)
type: Property
domain: Work
sub property of: Adaptation of (Work)
name: dramatizationOfWork
status: New-Proposed
definition: A work that has been adapted as a drama.

Succeeded by (Expression)
type: Property
domain: Expression
sub property of: Succeeded by
sub property of: Sequential relationship
has subproperty: Absorbed in part by (Expression)
has subproperty: Merged with to form (Expression)
has subproperty: Continued in part by (Expression)
has subproperty: Superseded in part by (Expression)
has subproperty: Split into (Expression)
has subproperty: Continued by (Expression)
has subproperty: Absorbed by (Expression)
has subproperty: Superseded by (Expression)
name: succeededByExpression
status: New-Proposed
definition: An expression of a work that succeeds (e.g., later in time or after in a narrative) the preceding entity.

Guide to
type: Property
sub property of: Augmentation of
has subproperty: Guide to (Work)
has subproperty: Guide to (Expression)
name: guideTo
status: New-Proposed

Subseries (Work)
type: Property
domain: Work
sub property of: Subseries
sub property of: Contains (Work)
name: subseriesWork
status: New-Proposed
definition: A serial or multipart work that consistently appears in a larger work; all issues or parts of the subseries bear the title of the larger work.

Adapted as a radio script
type: Property
sub property of: Adapted as
has subproperty: Adapted as a radio script (Work)
has subproperty: Adapted as a radio script (Expression)
name: adaptedAsARadioScript
status: New-Proposed

Supplement to
type: Property
sub property of: Augmentation of
has subproperty: Supplement to (Work)
has subproperty: Supplement to (Expression)
name: supplementTo
status: New-Proposed

Subseries
type: Property
sub property of: Contains
has subproperty: Subseries (Work)
name: subseries
status: New-Proposed

Absorbed by (Expression)
type: Property
domain: Expression
sub property of: Absorbed by
sub property of: Succeeded by (Expression)
name: absorbedByExpression
status: New-Proposed
definition: An expression of a work that incorporates another entity.

Critique of (Work)
type: Property
domain: Work
sub property of: Critique of
sub property of: Description of (Work)
name: critiqueOfWork
status: New-Proposed
definition: A work used as the basis for a critical evaluation.

Libretto based on (Work)
type: Property
domain: Work
sub property of: Libretto based on
sub property of: Based on (Work)
name: librettoBasedOnWork
status: New-Proposed
definition: A work used as the basis for the text of an opera or other work for the musical stage, or an oratorio.

Accompanying work
type: Property
domain: Work
has subproperty: Complemented by (Work)
has subproperty: Augmented by (Work)
name: accompanyingWork
status: New-Proposed

Analysis of (Manifestation)
type: Property
domain: Manifestation
sub property of: Analysis of
sub property of: Description of (Manifestation)
name: analysisOfManifestation
status: New-Proposed
definition: A manifestation that has been examined to identify its components and their relations.

Musical setting of (Expression)
type: Property
domain: Expression
sub property of: Musical setting of
sub property of: Based on (Expression)
name: musicalSettingOfExpression
status: New-Proposed
definition: An expression of a work that provides the text for a non-dramatic musical work, except for an oratorio.

Accompanying expression
type: Property
domain: Expression
has subproperty: Complemented by (Expression)
has subproperty: Augmented by (Expression)
has subproperty: Augmentation of (Expression)
name: accompanyingExpression
status: New-Proposed

Manifestation of work
type: Property
domain: Work
name: manifestationOfWork
status: New-Proposed
definition: A physical embodiment of an expression of a work.

Continues (Expression)
type: Property
comment: Apply generally to serials.
domain: Expression
sub property of: Continues
sub property of: Preceded by (Expression)
name: continuesExpression
status: New-Proposed
definition: An expression of a work that is continued by the content of a later entity under a new title.

Basis for libretto (Expression)
type: Property
domain: Expression
sub property of: Basis for libretto
sub property of: derivativeExpression
name: basisForLibrettoExpression
status: New-Proposed
definition: An expression of a work that comprises the text of an opera or other work for the musical stage, or an oratorio, based on the source work.

Superseded by (Work)
type: Property
comment: Apply generally to single-part units, multipart monographs, and integrating resources.
domain: Work
sub property of: Superseded by
sub property of: Succeeded by (Work)
name: supersededByWork
status: New-Proposed
definition: A later work used in place of an earlier work, usually because the later work contains updated or new information that makes the earlier work obsolete.

Numbering of part
type: Property
has subproperty: Numbering of part (Work)
name: numberingOfPart
status: New-Proposed

Script for the radio programme (Expression)
type: Property
domain: Expression
sub property of: Script for the radio programme
sub property of: Complemented by (Expression)
name: scriptForTheRadioProgrammeExpression
status: New-Proposed
definition: An expression of a work that uses the text of the source work as the script for a radio programme.

Radio script
type: Property
sub property of: Complemented by
has subproperty: Radio script (Expression)
name: radioScript
status: New-Proposed

Contains (Manifestation)
type: Property
domain: Manifestation
sub property of: Contains
sub property of: Whole-part relationship (Manifestation)
has subproperty: Special issue (Manifestation)
has subproperty: Insert (Manifestation)
name: containsManifestation
status: New-Proposed
definition: A manifestation that is a discrete component of a larger entity.

Errata (Expression)
type: Property
domain: Expression
sub property of: Errata
sub property of: Augmented by (Expression)
name: errataExpression
status: New-Proposed
definition: An expression of a work consisting of errors discovered after the publication of the predominant work, with their corrections.

Screenplay for the motion picture
type: Property
sub property of: Screenplay for
has subproperty: Screenplay for the motion picture (Work)
has subproperty: Screenplay for the motion picture (Expression)
name: screenplayForTheMotionPicture
status: New-Proposed

Remake of (Expression)
type: Property
domain: Expression
sub property of: Remake of
sub property of: Based on (Expression)
name: remakeOfExpression
status: New-Proposed
definition: An expression of a work used as the basis for a new motion picture, radio programme, television programme, or video.

Superseded in part by (Work)
type: Property
comment: Apply generally to single-part units, multipart monographs, and integrating resources.
domain: Work
sub property of: Succeeded by (Work)
sub property of: Superseded in part by
name: supersededInPartByWork
status: New-Proposed
definition: A later work used in part in place of an earlier work, usually because the later work contains updated or new information that makes part of the earlier work obsolete.

Prequel to (Work)
type: Property
domain: Work
sub property of: Prequel to
sub property of: Succeeded by (Work)
name: prequelToWork
status: New-Proposed
definition: A work whose narrative is extended backwards in time by the later work.

Commentary in (Work)
type: Property
domain: Work
sub property of: Commentary in
sub property of: Described in (Work)
name: commentaryInWork
status: New-Proposed
definition: A work that contains a set of explanatory or critical notes on the described entity.

Concordance
type: Property
sub property of: Augmented by
has subproperty: Concordance (Work)
has subproperty: Concordance (Expression)
name: concordance
status: New-Proposed

Addenda (Expression)
type: Property
domain: Expression
sub property of: Augmented by (Expression)
sub property of: Addenda
name: addendaExpression
status: New-Proposed
definition: An expression of a work that consists of brief additional material, less extensive than a supplement, which is essential to the completeness of the text of the predominant work and is usually added to the end of the content, but may also be issued separately.

Addenda to (Expression)
type: Property
domain: Expression
sub property of: Addenda to
sub property of: Augmentation of (Expression)
name: addendaToExpression
status: New-Proposed
definition: An expression of a work to which is added, usually at the end of the content, but sometimes separately from it, brief additional material, less extensive than a supplement, which is essential to the completeness of the content of the work.

Augmentation of (Work)
type: Property
domain: Work
has subproperty: Finding aid for (Work)
has subproperty: Concordance to (Work)
has subproperty: Addenda to (Work)
has subproperty: Illustrations for (Work)
has subproperty: Appendix to (Work)
has subproperty: Index to (Work)
has subproperty: Errata to (Work)
has subproperty: Catalogue of (Work)
has subproperty: Supplement to (Work)
has subproperty: Guide to (Work)
name: augmentationOfWork
status: New-Proposed
definition: A work whose content is added to by another work.

Free translation of
type: Property
sub property of: Based on
has subproperty: Free translation of (Work)
has subproperty: Free translation of (Expression)
name: freeTranslationOf
status: New-Proposed

Illustrations
type: Property
sub property of: Augmented by
has subproperty: Illustrations (Work)
has subproperty: Illustrations (Expression)
name: illustrations
status: New-Proposed

Absorbed by
type: Property
sub property of: Succeeded by
has subproperty: Absorbed by (Work)
has subproperty: Absorbed by (Expression)
name: absorbedBy
status: New-Proposed

Abstracts for (Expression)
type: Property
domain: Expression
sub property of: Abstracts for
sub property of: Based on (Expression)
name: abstractsForExpression
status: New-Proposed
definition: An expression of a work whose contents have been abstracted by an abstracting and indexing service.

Video screenplay based on
type: Property
sub property of: Screenplay based on
has subproperty: Video screenplay based on (Work)
has subproperty: Video screenplay based on (Expression)
name: videoScreenplayBasedOn
status: New-Proposed

Preservation facsimile of (Manifestation)
type: Property
domain: Manifestation
sub property of: Preservation facsimile of
sub property of: Facsimile of (Manifestation)
name: preservationFacsimileOfManifestation
status: New-Proposed
definition: A manifestation used as the basis for an exact reproduction on preservation-quality media, such as acid-free permanent or archival paper.

Analysis of (Work)
type: Property
domain: Work
sub property of: Analysis of
sub property of: Description of (Work)
name: analysisOfWork
status: New-Proposed
definition: A work that has been examined to identify its components and their relations.

Reprinted as (Manifestation)
type: Property
domain: Manifestation
sub property of: Reprinted as
sub property of: Reproduced as (Manifestation)
name: reprintedAsManifestation
status: New-Proposed
definition: A manifestation that reissues the same expression of a work as the printed resource being described.

Contained in (Manifestation)
type: Property
domain: Manifestation
sub property of: Whole-part relationship (Manifestation)
sub property of: Contained in
has subproperty: Inserted in (Manifestation)
has subproperty: Special issue of (Manifestation)
name: containedInManifestation
status: New-Proposed
definition: A larger manifestation of which a part is a discrete component.

Screenplay for the video (Work)
type: Property
domain: Work
sub property of: Screenplay for the video
sub property of: Screenplay for (Work)
name: screenplayForTheVideoWork
status: New-Proposed
definition: A work that adapts the source work as the screenplay for a video work.

Continues in part
type: Property
sub property of: Preceded by
has subproperty: Continues in part (Work)
has subproperty: Continues in part (Expression)
name: continuesInPart
status: New-Proposed

Based on
type: Property
has subproperty: Libretto based on
has subproperty: Summary of
has subproperty: Abstracts for (Work)
has subproperty: Adaptation of
has subproperty: Free translation of
has subproperty: Expanded version of
has subproperty: Remake of
has subproperty: Imitation of
has subproperty: Based on (Expression)
has subproperty: Indexing for
has subproperty: Paraphrase of
has subproperty: Abridgement of
has subproperty: Digest of
has subproperty: Choreography for
has subproperty: Musical variations based on
has subproperty: Musical setting of
has subproperty: Translation of
has subproperty: Based on (Work)
has subproperty: Revision of
has subproperty: Abstract of
has subproperty: Abstracts for
has subproperty: Musical arrangement of
name: basedOn
status: New-Proposed

Reviewed in (Expression)
type: Property
domain: Expression
sub property of: Reviewed in
sub property of: Described in (Expression)
name: reviewedInExpression
status: New-Proposed
definition: An expression of a work that contains a summative evaluation of the described entity.

Facsimile
type: Property
sub property of: Reproduced as
has subproperty: Facsimile (Manifestation)
has subproperty: Preservation facsimile
name: facsimile
status: New-Proposed

Superseded in part by
type: Property
sub property of: Succeeded by
has subproperty: Superseded in part by (Work)
has subproperty: Superseded in part by (Expression)
name: supersededInPartBy
status: New-Proposed

Contained in (item)
type: Property
domain: Item
sub property of: Whole-part relationship (Item)
sub property of: Contained in
name: containedInItem
status: New-Proposed
definition: A larger item of which a part is a discrete component.

Merged with to form (Work)
type: Property
domain: Work
sub property of: Merged with to form
sub property of: Succeeded by (Work)
name: mergedWithToFormWork
status: New-Proposed
definition: One of two or more works that come together to form a new work.

Cadenza composed for (work)
type: Property
sub property of: Cadenza composed for
sub property of: Complemented by (Work)
name: cadenzaComposedForWork
status: New-Proposed
definition: A musical work such as a concerto that contains an ornamental passage for a soloist, either by the composer of the larger work or by another composer.

Video adaptation of (Work)
type: Property
domain: Work
sub property of: Video adaptation of
sub property of: Adaptation of (Work)
name: videoAdaptationOfWork
status: New-Proposed
definition: A work that has been adapted for video.

Commentary on (Item)
type: Property
domain: Item
sub property of: Commentary on
sub property of: Description of (Item)
name: commentaryOnItem
status: New-Proposed
definition: An item used as the basis for a set of explanatory or critical notes.

Cadenza (Work)
type: Property
domain: Work
sub property of: Cadenza
sub property of: Complemented by (Work)
name: cadenzaWork
status: New-Proposed
definition: A musical work comprising an ornamental passage for a soloist, added to the musical work such as a concerto, either by the composer of the larger work or by another composer.

Catalogue of
type: Property
sub property of: Augmentation of
has subproperty: Catalogue of (Work)
has subproperty: Catalogue of (Expression)
name: catalogueOf
status: New-Proposed

Facsimile of
type: Property
sub property of: Reproduction of
has subproperty: Facsimile of (Manifestation)
has subproperty: Facsimile of (Item)
has subproperty: Preservation facsimile of
name: facsimileOf
status: New-Proposed

Electronic reproduction
type: Property
sub property of: Reproduced as
has subproperty: Electronic reproduction (Manifestation)
name: electronicReproduction
status: New-Proposed

Abstract of (Expression)
type: Property
domain: Expression
sub property of: Abstract of
sub property of: Based on (Expression)
name: abstractOfExpression
status: New-Proposed
definition: An expression of a work that has been abstracted, i.e., abbreviated in a brief, objective manner.

Contains (Item)
type: Property
domain: Item
sub property of: Whole-part relationship (Item)
sub property of: Contains
name: containsItem
status: New-Proposed
definition: An item that is a discrete component of a larger item.

Supplement (Expression)
type: Property
domain: Expression
sub property of: Supplement
sub property of: Augmented by (Expression)
name: supplementExpression
status: New-Proposed
definition: An expression of a work that updates or otherwise complements the predominant entity.

Special issue of (Manifestation)
type: Property
domain: Manifestation
sub property of: Special issue of
sub property of: Contained in (Manifestation)
name: specialIssueOfManifestation
status: New-Proposed
definition: A serial or newspaper containing a single issue or a supplementary section devoted to a special subject, with or without serial numbering, such as an anniversary number of a periodical or newspaper.

Indexing for (Expression)
type: Property
domain: Expression
sub property of: Indexing for
sub property of: Based on (Expression)
name: indexingForExpression
status: New-Proposed
definition: An expression of a work whose contents have been indexed by an abstracting and indexing service.

Verse adaptation of (Work)
type: Property
domain: Work
sub property of: Verse adaptation of
sub property of: Adaptation of (Work)
name: verseAdaptationOfWork
status: New-Proposed
definition: A work that has been adapted as a literary composition in verse form.

Guide (Work)
type: Property
domain: Work
sub property of: Guide
sub property of: Augmented by (Work)
name: guideWork
status: New-Proposed
definition: A work that guides a user through the use of the predominant work, using notes, learning and study aids, exercises, problems, questions and answers, instructor or student materials, etc.

Summary
type: Property
sub property of: derivativeRelationships
has subproperty: Summary (Expression)
name: summary
status: New-Proposed

Absorbed in part by (Expression)
type: Property
domain: Expression
sub property of: Absorbed in part by
sub property of: Succeeded by (Expression)
name: absorbedInPartByExpression
status: New-Proposed
definition: An expression of a work that incorporates part of the content of another entity.

Abstract (Work)
type: Property
domain: Work
sub property of: Abstract
sub property of: derivativeWork
name: abstractWork
status: New-Proposed
definition: A work that abbreviated the source work in a brief, objective manner.

Guide to (Work)
type: Property
domain: Work
sub property of: Guide to
sub property of: Augmentation of (Work)
name: guideToWork
status: New-Proposed
definition: A work that is augmented by another work comprising material to help the user of the augmented work, such as notes, learning and study aids, exercises, problems, questions and answers, instructor or student materials, etc.

Manifestation exemplified
type: Property
domain: Item
name: manifestationExemplified
status: New-Proposed
definition: The manifestation exemplified by an item.

Cadenza
type: Property
sub property of: Complemented by
has subproperty: Cadenza (Work)
has subproperty: Cadenza (Expression)
name: cadenza
status: New-Proposed

Radio adaptation of
type: Property
sub property of: Adaptation of
has subproperty: Radio adaptation of (Work)
has subproperty: Radio adaptation of (Expression)
name: radioAdaptationOf
status: New-Proposed

Illustrations (Work)
type: Property
domain: Work
sub property of: Illustrations
sub property of: Augmented by (Work)
name: illustrationsWork
status: New-Proposed
definition: A work comprising pictorial content designed to elucidate or decorate the augmented work.

Adapted as a radio programme (Expression)
type: Property
domain: Expression
sub property of: Adapted as a radio programme
sub property of: Adapted as (Expression)
name: adaptedAsARadioProgrammeExpression
status: New-Proposed
definition: A radio programme based on the source entity.

Motion picture adaptation of
type: Property
sub property of: Adaptation of
has subproperty: Motion picture adaptation of (Work)
has subproperty: Motion picture adaptation of (Expression)
name: motionPictureAdaptationOf
status: New-Proposed

Musical arrangement (Expression)
type: Property
domain: Expression
sub property of: Musical arrangement
sub property of: derivativeExpression
name: musicalArrangementExpression
status: New-Proposed
definition: An expression of a work that rewrites the source entity for a medium of performance different from that for which the work was originally intended.

Indexing for (Work)
type: Property
domain: Work
sub property of: Indexing for
sub property of: Based on (Work)
name: indexingForWork
status: New-Proposed
definition: A work whose contents have been indexed by an abstracting and indexing service.

Merger of
type: Property
sub property of: Preceded by
has subproperty: Merger of (Work)
has subproperty: Merger of (Expression)
name: mergerOf
status: New-Proposed

Equivalence relationships (Item)
type: Property
domain: Item
sub property of: Equivalence relationships
has subproperty: Reproduction of (Item)
name: equivalenceRelationshipsItem
status: New-Proposed
definition: An item embodying the same expression of a work.

Supersedes (Expression)
type: Property
comment: Apply generally to single-part units, multipart monographs, and integrating resources.
domain: Expression
sub property of: Preceded by (Expression)
sub property of: Supersedes
name: supersedesExpression
status: New-Proposed
definition: An expression of an earlier work whose content has been replaced by a later entity, usually because the later entity contains updated or new information that makes the earlier entity obsolete.

Radio script based on (Work)
type: Property
domain: Work
sub property of: Radio script based on
sub property of: Adaptation of (Work)
name: radioScriptBasedOnWork
status: New-Proposed
definition: A work that has been adapted as the script for a radio programme.

Parodied as (Work)
type: Property
domain: Work
sub property of: Parodied as
sub property of: Imitated as (Work)
name: parodiedAsWork
status: New-Proposed
definition: A work that imitates the style or content of the source work for comic effect.

Libretto for (Expression)
type: Property
domain: Expression
sub property of: Libretto for
name: librettoForExpression
status: New-Proposed
definition: An expression of a musical work such as an opera or other work for the musical stage, or an oratorio, that uses the text of the related work.

Electronic reproduction (Manifestation)
type: Property
domain: Manifestation
sub property of: Electronic reproduction
sub property of: Reproduced as (Manifestation)
name: electronicReproductionManifestation
status: New-Proposed
definition: A digital manifestation resulting from the reproduction of an analog manifestation.

Reprint of
type: Property
sub property of: Reproduction of
has subproperty: Reprint of (Manifestation)
has subproperty: Reprint of (Item)
name: reprintOf
status: New-Proposed

Series contains (Work)
type: Property
domain: Work
sub property of: Series contains
sub property of: Contains (Work)
name: seriesContainsWork
status: New-Proposed
definition: A work that has been issued as part of a series.

Choreography (Work)
type: Property
domain: Work
sub property of: Choreography
sub property of: derivativeWork
name: choreographyWork
status: New-Proposed
definition: A work comprising dance based on the source work.

Contained in (Work)
type: Property
domain: Work
sub property of: Whole-part relationship (Work)
sub property of: Contained in
has subproperty: In series (Work)
has subproperty: Subseries of (Work)
has subproperty: Libretto for (work)
name: containedInWork
status: New-Proposed
definition: A larger work of which a part is a discrete component.

Motion picture adaptation of (Work)
type: Property
domain: Work
sub property of: Motion picture adaptation of
sub property of: Adaptation of (Work)
name: motionPictureAdaptationOfWork
status: New-Proposed
definition: A work that has been adapted as a motion picture.

Special issue (Manifestation)
type: Property
domain: Manifestation
sub property of: Special issue
sub property of: Contains (Manifestation)
name: specialIssueManifestation
status: New-Proposed
definition: A manifestation that comprises a single issue or a supplementary section of a serial or newspaper devoted to a special subject.

Abstract
type: Property
has subproperty: Abstract (Work)
has subproperty: Abstract (Expression)
name: abstract
status: New-Proposed

Video screenplay based on (Expression)
type: Property
domain: Expression
sub property of: Video screenplay based on
sub property of: Screenplay based on (Expression)
name: videoScreenplayBasedOnExpression
status: New-Proposed
definition: An expression of a work that has been adapted as the screenplay for a video.

Commentary on (Work)
type: Property
domain: Work
sub property of: Commentary on
sub property of: Description of (Work)
name: commentaryOnWork
status: New-Proposed
definition: A work used as the basis for a set of explanatory or critical notes.

Novelization (Expression)
type: Property
domain: Expression
sub property of: Novelization
sub property of: Adapted as (Expression)
name: novelizationExpression
status: New-Proposed
definition: An expression of a novel adapted from the source entity.

Translation of (Expression)
type: Property
domain: Expression
sub property of: Translation of
sub property of: Based on (Expression)
name: translationOfExpression
status: New-Proposed
definition: An expression of a work that has been translated, i.e., the text rendered into a language different from that of the original work.

Summary (Work)
type: Property
domain: Work
sub property of: derivativeWork
name: summaryWork
status: New-Proposed
definition: A work that comprises a brief recapitulation of the content of the source work.

Split into
type: Property
sub property of: Succeeded by
has subproperty: Split into (Work)
has subproperty: Split into (Expression)
name: splitInto
status: New-Proposed

Reprint of (Item)
type: Property
domain: Item
sub property of: Reprint of
sub property of: Reproduction of (Item)
name: reprintOfItem
status: New-Proposed
definition: An item that is used as the basis for a reprint with the same content as the resource being described.

Expanded as (Expression)
type: Property
domain: Expression
sub property of: Expanded as
sub property of: derivativeExpression
name: expandedAsExpression
status: New-Proposed
definition: An expression of a work that expands the content of the source work.

Complemented by (Work)
type: Property
domain: Work
sub property of: Accompanying work
sub property of: Complemented by
has subproperty: Cadenza composed for (work)
has subproperty: Cadenza (Work)
has subproperty: Script for the radio programme (Work)
has subproperty: Screenplay for (Work)
name: complementedByWork
status: New-Proposed
definition: A work paired with another entity without either entity being considered to predominate.

Adapted as a motion picture
type: Property
sub property of: Adapted as
has subproperty: Adapted as a motion picture (Work)
has subproperty: Adapted as a motion picture (Expression)
name: adaptedAsAMotionPicture
status: New-Proposed

Also issued as
type: Property
has subproperty: Also issued as (Manifestation)
name: alsoIssuedAs
status: New-Proposed

Filmed with
type: Property
sub property of: Accompanied by
has subproperty: Filmed with (Item)
name: filmedWith
status: New-Proposed

Paraphrase of (Work)
type: Property
domain: Work
sub property of: Paraphrase of
sub property of: Based on (Work)
name: paraphraseOfWork
status: New-Proposed
definition: A work used as the basis for a paraphrase, i.e., a restating of the content of the source work in a different form.

Also issued as (Manifestation)
type: Property
domain: Manifestation
sub property of: Also issued as
sub property of: equivalentManifestation
name: alsoIssuedAsManifestation
status: New-Proposed
definition: A manifestation issued in a different format embodying the same expression of a work as the resource being described.

Description of (Manifestation)
type: Property
domain: Manifestation
sub property of: Descriptive relationships (Manifestation)
sub property of: Description of
has subproperty: Analysis of (Manifestation)
has subproperty: Evaluation of (Manifestation)
has subproperty: Review of (Manifestation)
has subproperty: Critique of (Manifestation)
has subproperty: Commentary on (Manifestation)
name: descriptionOfManifestation
status: New-Proposed
definition: A manifestation described by a describing entity.

Contains (Work)
type: Property
domain: Work
sub property of: Whole-part relationship (Work)
sub property of: Contains
has subproperty: Subseries (Work)
has subproperty: Series contains (Work)
has subproperty: Libretto (Work)
name: containsWork
status: New-Proposed
definition: A work that is a discrete component of a larger work.

Appendix to (Work)
type: Property
domain: Work
sub property of: Appendix to
sub property of: Augmentation of (Work)
name: appendixToWork
status: New-Proposed
definition: A work that is augmented by another work that consists of material that is not essential to the completeness of the content, such as a list of references, statistical tables, and explanatory matter; the augmenting work may come at the end of the content, or may be issued separately.

Parodied as
type: Property
sub property of: Imitated as
has subproperty: Parodied as (Work)
has subproperty: Parodied as (Expression)
name: parodiedAs
status: New-Proposed

Radio script based on
type: Property
sub property of: Adaptation of
has subproperty: Radio script based on (Work)
has subproperty: Radio script based on (Expression)
has subproperty: Radio script (Expression)
name: radioScriptBasedOn
status: New-Proposed

Analysis of
type: Property
sub property of: Description of
has subproperty: Analysis of (Expression)
has subproperty: Analysis of (Item)
has subproperty: Analysis of (Manifestation)
has subproperty: Analysis of (Work)
name: analysisOf
status: New-Proposed

Adaptation of
type: Property
sub property of: Based on
has subproperty: Motion picture adaptation of
has subproperty: Radio adaptation of
has subproperty: Radio script based on
has subproperty: Television adaptation of
has subproperty: Video adaptation of
has subproperty: Screenplay based on
has subproperty: Adaptation of (Expression)
has subproperty: Novelization of
has subproperty: Dramatization of
has subproperty: Verse adaptation of
has subproperty: Adaptation of (Work)
has subproperty: Screenplay based on (Expression)
name: adaptationOf
status: New-Proposed

Absorbed in part (Expression)
type: Property
domain: Expression
sub property of: Absorbed in part
sub property of: Preceded by (Expression)
name: absorbedInPartExpression
status: New-Proposed
definition: An expression of a work that has been partially incorporated into another entity.

Commentary on
type: Property
sub property of: Description of
has subproperty: Commentary on (Work)
has subproperty: Commentary on (Expression)
has subproperty: Commentary on (Item)
has subproperty: Commentary on (Manifestation)
name: commentaryOn
status: New-Proposed

Descriptive relationships (Work)
type: Property
domain: Work
sub property of: Descriptive relationships
has subproperty: Description of (Work)
has subproperty: Described in (Work)
name: descriptiveRelationshipsWork
status: New-Proposed

Novelization of (Expression)
type: Property
domain: Expression
sub property of: Novelization of
name: novelizationOfExpression
status: New-Proposed
definition: An expression of a work that has been adapted as a novel.

Split into (Expression)
type: Property
domain: Expression
sub property of: Split into
sub property of: Succeeded by (Expression)
name: splitIntoExpression
status: New-Proposed
definition: An expression of one of two or more works resulting from the division of an earlier entity into separate entities.

Indexed in
type: Property
sub property of: derivativeRelationships
has subproperty: Indexed in (Work)
has subproperty: Indexed in (Expression)
name: indexedIn
status: New-Proposed

Critique of (Expression)
type: Property
domain: Expression
sub property of: Critique of
sub property of: Description of (Expression)
name: critiqueOfExpression
status: New-Proposed
definition: An expression of a work used as the basis for a critical evaluation.

Supersedes (Work)
type: Property
comment: Apply generally to single-part units, multipart monographs, and integrating resources.
domain: Work
sub property of: Preceded by (Work)
sub property of: Supersedes
name: supersedesWork
status: New-Proposed
definition: An earlier work whose content has been replaced by a later work, usually because the later work contains updated or new information that makes the earlier work obsolete.

Radio adaptation of (Work)
type: Property
domain: Work
sub property of: Radio adaptation of
sub property of: Adaptation of (Work)
name: radioAdaptationOfWork
status: New-Proposed
definition: A work that has been adapted as a radio programme.

Dramatization of (Expression)
type: Property
domain: Expression
sub property of: Dramatization of
name: dramatizationOfExpression
status: New-Proposed
definition: An expression of a work that has been adapted as a drama.

Commentary on (Expression)
type: Property
domain: Expression
sub property of: Commentary on
sub property of: Description of (Expression)
name: commentaryOnExpression
status: New-Proposed
definition: An expression of a work used as the basis for a set of explanatory or critical notes.

Abridgement of
type: Property
sub property of: Based on
has subproperty: Abridgement of (Work)
has subproperty: Abridgement of (Expression)
name: abridgementOf
status: New-Proposed

Commentary in
type: Property
sub property of: Described in
has subproperty: Commentary in (Work)
has subproperty: Commentary in (Expression)
name: commentaryIn
status: New-Proposed

Catalogue (Expression)
type: Property
domain: Expression
sub property of: Catalogue
sub property of: Augmented by (Expression)
name: catalogueExpression
status: New-Proposed
definition: An expression of a work that comprises a complete enumeration of items arranged systematically.

Appendix (Expression)
type: Property
domain: Expression
sub property of: Appendix
sub property of: Augmented by (Expression)
name: appendixExpression
status: New-Proposed
definition: An expression of a work that forms an augmenting part of another work which is not essential to the completeness of the content, such as a list of references, statistical tables, and explanatory matter; may be material which comes at the end of the content of the predominant work, or may be issued separately.

Series contains
type: Property
sub property of: Contains
has subproperty: Series contains (Work)
name: seriesContains
status: New-Proposed

Index to
type: Property
sub property of: Augmentation of
has subproperty: Index to (Work)
has subproperty: Index to (Expression)
name: indexTo
status: New-Proposed

Screenplay based on
type: Property
sub property of: Adaptation of
has subproperty: Motion picture screenplay based on
has subproperty: Video screenplay based on
has subproperty: Screenplay based on (Work)
has subproperty: Screenplay based on (Expression)
has subproperty: Television screenplay based on
name: screenplayBasedOn
status: New-Proposed

Superseded in part by (Expression)
type: Property
comment: Apply generally to single-part units, multipart monographs, and integrating resources.
domain: Expression
sub property of: Succeeded by (Expression)
sub property of: Superseded in part by
name: supersededInPartByExpression
status: New-Proposed
definition: An expression of a later entity used in part in place of the earlier entity, usually because the later entity contains updated or new information that makes part of the earlier entity obsolete.

Remake of (Work)
type: Property
domain: Work
sub property of: Remake of
sub property of: Based on (Work)
name: remakeOfWork
status: New-Proposed
definition: A work used as the basis for a new motion picture, radio programme, television programme, or video.

Facsimile of (Manifestation)
type: Property
domain: Manifestation
sub property of: Reproduction of (Manifestation)
sub property of: Facsimile of
has subproperty: Preservation facsimile of (Manifestation)
name: facsimileOfManifestation
status: New-Proposed
definition: A manifestation used as the basis for an exact reproduction.

Augmented by (Expression)
type: Property
domain: Expression
sub property of: Augmented by
sub property of: Accompanying expression
has subproperty: Supplement (Expression)
has subproperty: Addenda (Expression)
has subproperty: Addenda to (Expression)
has subproperty: Finding aid (Expression)
has subproperty: Index (Expression)
has subproperty: Errata (Expression)
has subproperty: Guide (Expression)
has subproperty: Appendix (Expression)
has subproperty: Illustrations (Expression)
has subproperty: Concordance (Expression)
has subproperty: Catalogue (Expression)
name: augmentedByExpression
status: New-Proposed
definition: An expression of a work that adds to the content of a predominant entity.

Paraphrase of (Expression)
type: Property
domain: Expression
sub property of: Paraphrase of
sub property of: Based on (Expression)
name: paraphraseOfExpression
status: New-Proposed
definition: An expression of a work used as the basis for a paraphrase, i.e., a restating of the content of the source work in a different form.

Addenda to
type: Property
sub property of: Augmentation of
has subproperty: Addenda to (Work)
has subproperty: Addenda to (Expression)
name: addendaTo
status: New-Proposed

In series
type: Property
sub property of: Contained in
has subproperty: In series (Work)
name: inSeries
status: New-Proposed

Issued with (Manifestation)
type: Property
domain: Manifestation
sub property of: Accompanied by (Manifestation)
sub property of: Issued with
has subproperty: On disc with (Manifestation)
has subproperty: Filmed with (Manifestation)
name: issuedWithManifestation
status: New-Proposed
definition: A manifestation that is issued on the same carrier as the manifestation being described.

Freely translated as
type: Property
sub property of: derivativeRelationships
has subproperty: Freely translated as (Work)
has subproperty: Freely translated as (Expression)
name: freelyTranslatedAs
status: New-Proposed

Adapted as (Work)
type: Property
domain: Work
sub property of: derivativeWork
sub property of: Adapted as
has subproperty: Screenplay for the video (Work)
has subproperty: Dramatized as (Work)
has subproperty: Screenplay for the television programme (Work)
has subproperty: Adapted as a screenplay (Work)
has subproperty: Adapted as a radio programme (Work)
has subproperty: Adapted as a motion picture (Work)
has subproperty: Script for the radio programme (Work)
has subproperty: Screenplay for the motion picture (Work)
has subproperty: Adapted as a radio script (Work)
has subproperty: Adapted as a video (Work)
has subproperty: Verse adaptation (Work)
has subproperty: Adapted as a television programme (Work)
has subproperty: Novelization (Work)
name: adaptedAsWork
status: New-Proposed
definition: A work that modifies the source work for a purpose, use, or medium other than that for which it was originally intended.

Continues in part (Work)
type: Property
comment: Apply generally to serials.
sub property of: Continues in part
sub property of: Preceded by (Work)
name: continuesInPartWork
status: New-Proposed
definition: A work that split into two or more separate works with new titles.

Numbering of part (Work)
type: Property
domain: Work
sub property of: Numbering of part
sub property of: Related work
name: numberingOfPartWork
status: New-Proposed
definition: A designation of the sequencing of a part or parts within a larger work. Numbering of part may include a numeral, a letter, any other character, or the combination of these, with or without an accompanying caption (volume, number, etc.) and/or a chronological designation.

Facsimile (Manifestation)
type: Property
domain: Manifestation
sub property of: Reproduced as (Manifestation)
sub property of: Facsimile
has subproperty: Preservation facsimile (Manifestation)
name: facsimileManifestation
status: New-Proposed
definition: A manifestation that exactly reproduces another manifestation embodying the same expression of a work.

Described in
type: Property
sub property of: Descriptive relationships
has subproperty: Critiqued in
has subproperty: Described in (Expression)
has subproperty: Described in (Work)
has subproperty: Commentary in
has subproperty: Reviewed in
has subproperty: Evaluated in
name: describedIn
status: New-Proposed

Paraphrased as (Work)
type: Property
domain: Work
sub property of: Paraphrased as
sub property of: derivativeWork
name: paraphrasedAsWork
status: New-Proposed
definition: A work that restates the content of the source work in a different form.

Adapted as a television screenplay
type: Property
sub property of: Adapted as a screenplay
has subproperty: Adapted as a television screenplay (Work)
has subproperty: Adapted as a television screenplay (Expression)
name: adaptedAsATelevisionScreenplay
status: New-Proposed

Analysed in (Expression)
type: Property
domain: Expression
sub property of: Analysed in
sub property of: Described in (Expression)
name: analysedInExpression
status: New-Proposed
definition: An expression of a work that examines the described entity to identity its components and their relations.

Derivative relationship
type: Property
has subproperty: Indexed in
has subproperty: Remade as
has subproperty: Digest
has subproperty: Derivative relationship (Expression)
has subproperty: Paraphrased as
has subproperty: Freely translated as
has subproperty: Translated as
has subproperty: Summary
has subproperty: Imitated as
has subproperty: Musical arrangement
has subproperty: Derivative relationship (Work)
has subproperty: Musical setting
has subproperty: Musical variations
name: derivativeRelationship
status: New-Proposed

Sequential relationship
type: Property
has subproperty: Succeeded by
has subproperty: Preceded by
name: sequentialRelationship
status: New-Proposed

Continues (Work)
type: Property
comment: Apply generally to serials.
domain: Work
sub property of: Continues
sub property of: Preceded by (Work)
name: continuesWork
status: New-Proposed
definition: A work that is continued by the content of a later work under a new title.

Dramatization of
type: Property
sub property of: Adaptation of
has subproperty: Dramatization of (Work)
has subproperty: Dramatization of (Expression)
name: dramatizationOf
status: New-Proposed

Mirror site
type: Property
sub property of: Equivalence relationships
has subproperty: Mirror site (Manifestation)
name: mirrorSite
status: New-Proposed

Merged with to form (Expression)
type: Property
domain: Expression
sub property of: Merged with to form
sub property of: Succeeded by (Expression)
name: mergedWithToFormExpression
status: New-Proposed
definition: One of two or more expressions of works that come together to form a new entity.

Cadenza composed for
type: Property
sub property of: Complemented by
has subproperty: Cadenza composed for (work)
has subproperty: Cadenza composed for (Expression)
name: cadenzaComposedFor
status: New-Proposed

Motion picture screenplay (Expression)
type: Property
domain: Expression
sub property of: Motion picture screenplay
sub property of: Complemented by (Expression)
name: motionPictureScreenplayExpression
status: New-Proposed
definition: An expression of a work that provides the text for a motion picture.

Screenplay for (Work)
type: Property
domain: Work
sub property of: Screenplay for
sub property of: Complemented by (Work)
has subproperty: Screenplay for the television programme (Work)
has subproperty: Screenplay for the motion picture (Work)
has subproperty: Screenplay for the video (Work)
name: screenplayForWork
status: New-Proposed

Accompanied by (Item)
type: Property
domain: Item
sub property of: Accompanied by
has subproperty: Bound with (Item)
has subproperty: On disc with (Item)
has subproperty: Filmed with (Item)
name: accompaniedByItem
status: New-Proposed
definition: An item brought together with another item, subsequent to issuance.

Sequel to
type: Property
sub property of: Preceded by
has subproperty: Sequel to (Work)
name: sequelTo
status: New-Proposed

Evaluated in
type: Property
sub property of: Described in
has subproperty: Evaluated in (Work)
has subproperty: Evaluated in (Expression)
name: evaluatedIn
status: New-Proposed