Published
type: Concept

Deprecated
type: Concept

RDA Manifestation properties
note: Properties derived from RDA elements and relationship designators with the domain of RDA Manifestation.

has carrier type
has unconstrained: P60048
lexical alias: carrierType.en
name: carrierType
status: Published
instruction number: 3.3
toolkit definition: A categorization reflecting the format of the storage medium and housing of a carrier in combination with the type of intermediation device required to view, play, run, etc., the content of a resource.
toolkit label: carrier type
type: Property
domain: C10007
definition: Relates a manifestation to a categorization reflecting the format of the storage medium and housing of a carrier in combination with the type of intermediation device required to view, play, run, etc., the content of a resource.

has media type
has unconstrained: P60050
lexical alias: mediaType.en
name: mediaType
status: Published
instruction number: 3.2
toolkit definition: A categorization reflecting the general type of intermediation device required to view, play, run, etc., the content of a resource.
toolkit label: media type
type: Property
domain: C10007
definition: Relates a manifestation to a categorization reflecting the general type of intermediation device required to view, play, run, etc., the content of a resource.

has mode of issuance
has unconstrained: P60051
lexical alias: modeOfIssuance.en
name: modeOfIssuance
status: Published
instruction number: 2.13
toolkit definition: A categorization reflecting whether a resource is issued in one or more parts, the way it is updated, and its intended termination.
toolkit label: mode of issuance
type: Property
domain: C10007
definition: Relates a manifestation to a categorization reflecting whether a resource is issued in one or more parts, the way it is updated, and its intended termination.

has identifier for the manifestation
has subproperty: has publisher’s number for music
has subproperty: has plate number for music
has unconstrained: P60052
lexical alias: identifierForTheManifestation.en
name: identifierForTheManifestation
status: Published
instruction number: 2.15
toolkit definition: A character string associated with a manifestation that serves to differentiate that manifestation from other manifestations.
toolkit label: identifier for the manifestation
type: Property
domain: C10007
definition: Relates a manifestation to a character string associated with a manifestation that serves to differentiate that manifestation from other manifestations.

has preferred citation
has unconstrained: P60057
lexical alias: preferredCitation.en
name: preferredCitation
status: Published
instruction number: 2.16
toolkit definition: A citation for a resource in the form preferred by a creator, publisher, custodian, indexing or abstracting service, etc.
toolkit label: preferred citation
type: Property
domain: C10007
definition: Relates a manifestation to a citation for a resource in the form preferred by a creator, publisher, custodian, indexing or abstracting service, etc.

has regional encoding
has unconstrained: P60059
lexical alias: regionalEncoding.en
name: regionalEncoding
status: Published
instruction number: 3.19.6
toolkit definition: A code identifying the region of the world for which a videodisc has been encoded and preventing the disc from being played on a player sold in a different region.
toolkit label: regional encoding
type: Property
domain: C10007
sub property of: has digital file characteristic
definition: Relates a manifestation to a code identifying the region of the world for which a videodisc has been encoded and preventing the disc from being played on a player sold in a different region.

has copyright date
has unconstrained: P60069
lexical alias: copyrightDate.en
name: copyrightDate
status: Published
instruction number: 2.11
toolkit definition: A date associated with a claim of protection under copyright or a similar regime.
toolkit label: copyright date
type: Property
domain: C10007
definition: Relates a manifestation to a date associated with a claim of protection under copyright or a similar regime.
scope note: Copyright dates include phonogram dates (i.e., dates associated with claims of protection for audio recordings).

has date of distribution
has unconstrained: P60070
lexical alias: dateOfDistribution.en
name: dateOfDistribution
status: Published
instruction number: 2.9.6
toolkit definition: A date associated with the distribution of a resource in a published form.
toolkit label: date of distribution
type: Property
domain: C10007
definition: Relates a manifestation to a date associated with the distribution of a resource in a published form.

has date of production
has unconstrained: P60071
lexical alias: dateOfProduction.en
name: dateOfProduction
status: Published
instruction number: 2.7.6
toolkit definition: A date associated with the inscription, fabrication, construction, etc., of a resource in an unpublished form.
toolkit label: date of production
type: Property
domain: C10007
definition: Relates a manifestation to a date associated with the inscription, fabrication, construction, etc., of a resource in an unpublished form.

has date of manufacture
has unconstrained: P60072
lexical alias: dateOfManufacture.en
name: dateOfManufacture
status: Published
instruction number: 2.10.6
toolkit definition: A date associated with the printing, duplicating, casting, etc., of a resource in a published form.
toolkit label: date of manufacture
type: Property
domain: C10007
definition: Relates a manifestation to a date associated with the printing, duplicating, casting, etc., of a resource in a published form.

has date of publication
has unconstrained: P60073
lexical alias: dateOfPublication.en
name: dateOfPublication
status: Published
instruction number: 2.8.6
toolkit definition: A date associated with the publication, release, or issuing of a resource.
toolkit label: date of publication
type: Property
domain: C10007
definition: Relates a manifestation to a date associated with the publication, release, or issuing of a resource.

has parallel designation of a named revision of an edition
has unconstrained: P60077
lexical alias: parallelDesignationOfANamedRevisionOfAnEdition.en
name: parallelDesignationOfANamedRevisionOfAnEdition
status: Published
instruction number: 2.5.7
toolkit definition: A designation of a named revision of an edition in a language and/or script that differs from that recorded in the designation of a named revision of an edition element.
toolkit label: parallel designation of a named revision of an edition
type: Property
domain: C10007
definition: Relates a manifestation to a designation of a named revision of an edition in a language and/or script that differs from that recorded in the designation of a named revision of an edition element.

has parallel designation of edition
has unconstrained: P60078
lexical alias: parallelDesignationOfEdition.en
name: parallelDesignationOfEdition
status: Published
instruction number: 2.5.3
toolkit definition: A designation of edition in a language and/or script that differs from that recorded in the designation of edition element.
toolkit label: parallel designation of edition
type: Property
domain: C10007
definition: Relates a manifestation to a designation of edition in a language and/or script that differs from that recorded in the designation of edition element.

has numbering within series
has unconstrained: P60081
lexical alias: numberingWithinSeries.en
name: numberingWithinSeries
status: Published
instruction number: 2.12.9
toolkit definition: A designation of the sequencing of a part or parts within a series.
toolkit label: numbering within series
type: Property
domain: C10007
definition: Relates a manifestation to a designation of the sequencing of a part or parts within a series.
scope note: Numbering within series may include a numeral, a letter, any other character, or the combination of these with or without an accompanying caption (volume, number, etc.) and/or a chronological designation.

has numbering within subseries
has unconstrained: P60082
lexical alias: numberingWithinSubseries.en
name: numberingWithinSubseries
status: Published
instruction number: 2.12.17
toolkit definition: A designation of the sequencing of a part or parts within a subseries.
toolkit label: numbering within subseries
type: Property
domain: C10007
definition: Relates a manifestation to a designation of the sequencing of a part or parts within a subseries.
scope note: Numbering within subseries may include a numeral, a letter, any other character, or the combination of these with or without an accompanying caption (volume, number, etc.) and/or a chronological designation.

is electronic reproduction (manifestation)
has unconstrained: P60083
lexical alias: electronicReproductionManifestation.en
name: electronicReproductionManifestation
status: Published
toolkit definition: A manifestation in a digital format that is the result of the transfer of a manifestation in an analog format.
toolkit label: electronic reproduction (manifestation)
type: Property
domain: C10007
range: C10007
sub property of: is reproduced as (manifestation)
inverse of: is electronic reproduction of (manifestation)
definition: Relates a manifestation to a manifestation in a digital format that is the result of the transfer of a manifestation in an analog format.

has parallel distributor’s name
has unconstrained: P60087
lexical alias: parallelDistributorsName.en
name: parallelDistributorsName
status: Published
instruction number: 2.9.5
toolkit definition: A distributor
toolkit label: parallel distributor's name
type: Property
domain: C10007
definition: Relates a manifestation to a distributor's name in a language and/or script that differs from that recorded in the distributor's name element.

has file type
has unconstrained: P60093
lexical alias: fileType.en
name: fileType
status: Published
instruction number: 3.19.2
toolkit definition: A general type of data content encoded in a computer file.
toolkit label: file type
type: Property
domain: C10007
sub property of: has digital file characteristic
definition: Relates a manifestation to a general type of data content encoded in a computer file.

is facsimile contained in
has unconstrained: P60100
lexical alias: facsimileContainedIn.en
name: facsimileContainedIn
status: Published
toolkit definition: A larger manifestation of which a part is a discrete component that exactly reproduces another manifestation embodying the same expression of a work.
toolkit label: facsimile contained in
type: Property
domain: C10007
range: C10007
sub property of: is contained in (manifestation)
inverse of: is facsimile container of
definition: Relates a manifestation to a larger manifestation of which a part is a discrete component that exactly reproduces another manifestation embodying the same expression of a work.

is contained in (manifestation)
has subproperty: is facsimile contained in
has subproperty: is inserted in
has subproperty: is special issue of
has unconstrained: P60101
lexical alias: containedInManifestation.en
name: containedInManifestation
status: Published
toolkit definition: A larger manifestation of which the manifestation is a discrete component.
toolkit label: contained in (manifestation)
type: Property
domain: C10007
range: C10007
sub property of: has whole-part manifestation relationship with
inverse of: is container of (manifestation)
definition: Relates a manifestation to a larger manifestation of which the manifestation is a discrete component.

is preservation facsimile (manifestation)
has unconstrained: P60179
lexical alias: preservationFacsimileManifestation.en
name: preservationFacsimileManifestation
status: Published
toolkit definition: A manifestation that consists of an exact reproduction on preservation-quality media, such as acid-free permanent or archival paper.
toolkit label: preservation facsimile (manifestation)
type: Property
domain: C10007
range: C10007
sub property of: is facsimile (manifestation)
inverse of: is preservation facsimile of (manifestation)
definition: Relates a manifestation to a manifestation that consists of an exact reproduction on preservation-quality media, such as acid-free permanent or archival paper.

is insert
has unconstrained: P60183
lexical alias: insert.en
name: insert
status: Published
toolkit definition: A manifestation consisting of separately issued material that is not an integral part of the larger manifestation into which it has been inserted.
toolkit label: insert
type: Property
domain: C10007
range: C10007
sub property of: is container of (manifestation)
inverse of: is inserted in
definition: Relates a manifestation to a manifestation consisting of separately issued material that is not an integral part of the larger manifestation into which it has been inserted.

is equivalent (manifestation)
has subproperty: is also issued as
has subproperty: is mirror site
has subproperty: is reproduced as (manifestation)
has subproperty: is reproduction of (manifestation)
has unconstrained: P60191
lexical alias: equivalentManifestation.en
name: equivalentManifestation
status: Published
toolkit definition: A manifestation that embodies the same expression of a work.
toolkit label: equivalent (manifestation)
type: Property
domain: C10007
range: C10007
sub property of: has equivalent manifestation relationship with
definition: Relates a manifestation to a manifestation that embodies the same expression of a work.

is inserted in
has unconstrained: P60194
lexical alias: insertedIn.en
name: insertedIn
status: Published
toolkit definition: A manifestation into which material has been inserted that is not an integral part of the publication.
toolkit label: inserted in
type: Property
domain: C10007
range: C10007
sub property of: is contained in (manifestation)
inverse of: is insert
definition: Relates a manifestation to a manifestation into which material has been inserted that is not an integral part of the publication.

is also issued as
has unconstrained: P60195
lexical alias: alsoIssuedAs.en
name: alsoIssuedAs
status: Published
toolkit definition: A manifestation that embodies the same expression of a work in a different format.
toolkit label: also issued as
type: Property
domain: C10007
range: C10007
sub property of: is equivalent (manifestation)
definition: Relates a manifestation to a manifestation that embodies the same expression of a work in a different format.

is accompanied by (manifestation)
has subproperty: is issued with
has unconstrained: P60196
lexical alias: accompaniedByManifestation.en
name: accompaniedByManifestation
status: Published
toolkit definition: A manifestation issued with another manifestation, without any relationship to its content.
toolkit label: accompanied by (manifestation)
type: Property
domain: C10007
range: C10007
sub property of: has accompanying manifestation relationship with
definition: Relates a manifestation to a manifestation issued with another manifestation, without any relationship to its content.

is mirror site
has unconstrained: P60197
lexical alias: mirrorSite.en
name: mirrorSite
status: Published
toolkit definition: A manifestation that is an exact copy of a website , used to reduce network traffic or improve the availability of the content of the original site.
toolkit label: mirror site
type: Property
domain: C10007
range: C10007
sub property of: is equivalent (manifestation)
definition: Relates a manifestation to a manifestation that is an exact copy of a website , used to reduce network traffic or improve the availability of the content of the original site.

is digital transfer (manifestation)
has unconstrained: P60200
lexical alias: digitalTransferManifestation.en
name: digitalTransferManifestation
status: Published
toolkit definition: A manifestation in a digital format that results from the transfer of a manifestation in another digital format.
toolkit label: digital transfer (manifestation)
type: Property
domain: C10007
range: C10007
sub property of: is reproduced as (manifestation)
inverse of: is digital transfer of (manifestation)
definition: Relates a manifestation to a manifestation in a digital format that results from the transfer of a manifestation in another digital format.

is special issue
has unconstrained: P60207
lexical alias: specialIssue.en
name: specialIssue
status: Published
toolkit definition: A manifestation that consists of a single issue or a supplementary section of a serial or newspaper devoted to a special subject.
toolkit label: special issue
type: Property
domain: C10007
range: C10007
sub property of: is container of (manifestation)
inverse of: is special issue of
definition: Relates a manifestation to a manifestation that consists of a single issue or a supplementary section of a serial or newspaper devoted to a special subject.

is facsimile (manifestation)
has subproperty: is preservation facsimile (manifestation)
has unconstrained: P60217
lexical alias: facsimileManifestation.en
name: facsimileManifestation
status: Published
toolkit definition: A manifestation that exactly reproduces another manifestation.
toolkit label: facsimile (manifestation)
type: Property
domain: C10007
range: C10007
sub property of: is reproduced as (manifestation)
inverse of: is facsimile of (manifestation)
definition: Relates a manifestation to a manifestation that exactly reproduces another manifestation.

is container of (manifestation)
has subproperty: is insert
has subproperty: is special issue
has subproperty: is facsimile container of
has unconstrained: P60249
lexical alias: containerOfManifestation.en
name: containerOfManifestation
status: Published
toolkit definition: A manifestation that is a discrete component of a larger manifestation.
toolkit label: container of (manifestation)
type: Property
domain: C10007
range: C10007
sub property of: has whole-part manifestation relationship with
inverse of: is contained in (manifestation)
definition: Relates a manifestation to a manifestation that is a discrete component of a larger manifestation.

is issued with
has subproperty: is on disc with (manifestation)
has subproperty: is filmed with (manifestation)
has unconstrained: P60256
lexical alias: issuedWith.en
name: issuedWith
status: Published
toolkit definition: A manifestation that is issued on the same carrier as the manifestation being described.
toolkit label: issued with
type: Property
domain: C10007
range: C10007
sub property of: is accompanied by (manifestation)
definition: Relates a manifestation to a manifestation that is issued on the same carrier as the manifestation being described.

is on disc with (manifestation)
has unconstrained: P60257
lexical alias: onDiscWithManifestation.en
name: onDiscWithManifestation
status: Published
toolkit definition: A manifestation that is issued on the same disc with the manifestation being described.
toolkit label: on disc with (manifestation)
type: Property
domain: C10007
range: C10007
sub property of: is issued with
definition: Relates a manifestation to a manifestation that is issued on the same disc with the manifestation being described.

is filmed with (manifestation)
has unconstrained: P60258
lexical alias: filmedWithManifestation.en
name: filmedWithManifestation
status: Published
toolkit definition: A manifestation that is issued on the same microform with the manifestation being described.
toolkit label: filmed with (manifestation)
type: Property
domain: C10007
range: C10007
sub property of: is issued with
definition: Relates a manifestation to a manifestation that is issued on the same microform with the manifestation being described.

is reprinted as (manifestation)
has unconstrained: P60271
lexical alias: reprintedAsManifestation.en
name: reprintedAsManifestation
status: Published
toolkit definition: A manifestation that is a reissue of another printed manifestation.
toolkit label: reprinted as (manifestation)
type: Property
domain: C10007
range: C10007
sub property of: is reproduced as (manifestation)
inverse of: is reprint of (manifestation)
definition: Relates a manifestation to a manifestation that is a reissue of another printed manifestation.

is reproduced as (manifestation)
has subproperty: is electronic reproduction (manifestation)
has subproperty: is digital transfer (manifestation)
has subproperty: is facsimile (manifestation)
has subproperty: is reprinted as (manifestation)
has unconstrained: P60272
lexical alias: reproducedAsManifestation.en
name: reproducedAsManifestation
status: Published
toolkit definition: A manifestation that reproduces another manifestation.
toolkit label: reproduced as (manifestation)
type: Property
domain: C10007
range: C10007
sub property of: is equivalent (manifestation)
inverse of: is reproduction of (manifestation)
definition: Relates a manifestation to a manifestation that reproduces another manifestation.

is digital transfer of (manifestation)
has unconstrained: P60287
lexical alias: digitalTransferOfManifestation.en
name: digitalTransferOfManifestation
status: Published
toolkit definition: A manifestation in a digital format that is transferred to another digital format.
toolkit label: digital transfer of (manifestation)
type: Property
domain: C10007
range: C10007
sub property of: is reproduction of (manifestation)
inverse of: is digital transfer (manifestation)
definition: Relates a manifestation to a manifestation in a digital format that is transferred to another digital format.

is reproduction of (manifestation)
has subproperty: is digital transfer of (manifestation)
has subproperty: is facsimile of (manifestation)
has subproperty: is reprint of (manifestation)
has subproperty: is electronic reproduction of (manifestation)
has unconstrained: P60297
lexical alias: reproductionOfManifestation.en
name: reproductionOfManifestation
status: Published
toolkit definition: A manifestation that is used as the basis for a reproduction.
toolkit label: reproduction of (manifestation)
type: Property
domain: C10007
range: C10007
sub property of: is equivalent (manifestation)
inverse of: is reproduced as (manifestation)
definition: Relates a manifestation to a manifestation that is used as the basis for a reproduction.

is preservation facsimile of (manifestation)
has unconstrained: P60299
lexical alias: preservationFacsimileOfManifestation.en
name: preservationFacsimileOfManifestation
status: Published
toolkit definition: A manifestation that is used as the basis for an exact reproduction on preservation-quality media, such as acid-free permanent or archival paper.
toolkit label: preservation facsimile of (manifestation)
type: Property
domain: C10007
range: C10007
sub property of: is facsimile of (manifestation)
inverse of: is preservation facsimile (manifestation)
definition: Relates a manifestation to a manifestation that is used as the basis for an exact reproduction on preservation-quality media, such as acid-free permanent or archival paper.

is facsimile container of
has unconstrained: P60300
lexical alias: facsimileContainerOf.en
name: facsimileContainerOf
status: Published
toolkit definition: A manifestation used as the basis for an exact reproduction that is a discrete component of a larger manifestation.
toolkit label: facsimile container of
type: Property
domain: C10007
range: C10007
sub property of: is container of (manifestation)
inverse of: is facsimile contained in
definition: Relates a manifestation to a manifestation used as the basis for an exact reproduction that is a discrete component of a larger manifestation.

is facsimile of (manifestation)
has subproperty: is preservation facsimile of (manifestation)
has unconstrained: P60301
lexical alias: facsimileOfManifestation.en
name: facsimileOfManifestation
status: Published
toolkit definition: A manifestation that is used as the basis for an exact reproduction.
toolkit label: facsimile of (manifestation)
type: Property
domain: C10007
range: C10007
sub property of: is reproduction of (manifestation)
inverse of: is facsimile (manifestation)
definition: Relates a manifestation to a manifestation that is used as the basis for an exact reproduction.

has related manifestation
has subproperty: has accompanying manifestation relationship with
has subproperty: has equivalent manifestation relationship with
has subproperty: has whole-part manifestation relationship with
has unconstrained: P60313
lexical alias: relatedManifestation.en
name: relatedManifestation
status: Published
instruction number: 27.1
toolkit definition: A manifestation, represented by an identifier or a description, that is related to the manifestation being described (e.g., a manifestation in a different format).
toolkit label: related manifestation
type: Property
domain: C10007
range: C10007
definition: Relates a manifestation to a manifestation, represented by an identifier or a description, that is related to the manifestation being described (e.g., a manifestation in a different format).

has parallel manufacturer’s name
has unconstrained: P60108
lexical alias: parallelManufacturersName.en
name: parallelManufacturersName
status: Published
instruction number: 2.10.5
toolkit definition: A manufacturer
toolkit label: parallel manufacturer's name
type: Property
domain: C10007
definition: Relates a manifestation to a manufacturer's name in a language and/or script that differs from that recorded in the manufacturer's name element.

has note on issue, part, or iteration used as the basis for identification of the resource
has unconstrained: P60122
lexical alias: noteOnIssuePartOrIterationUsedAsTheBasisForIdentificationOfTheResource.en
name: noteOnIssuePartOrIterationUsedAsTheBasisForIdentificationOfTheResource
status: Published
instruction number: 2.17.13
toolkit definition: A note identifying the issue or part of a multipart monograph or serial, or the iteration of an integrating resource that has been used as the basis for the identification of a resource.
toolkit label: note on issue, part, or iteration used as the basis for identification of the resource
type: Property
domain: C10007
sub property of: has note on manifestation
definition: Relates a manifestation to a note identifying the issue or part of a multipart monograph or serial, or the iteration of an integrating resource that has been used as the basis for the identification of a resource.

has note on changes in carrier characteristics
has unconstrained: P60124
lexical alias: noteOnChangesInCarrierCharacteristics.en
name: noteOnChangesInCarrierCharacteristics
status: Published
instruction number: 3.21.4
toolkit definition: A note on changes in the characteristics of the carrier that occur in subsequent issues or parts of a resource issued in successive parts or between iterations of an integrating resource.
toolkit label: note on changes in carrier characteristics
type: Property
domain: C10007
sub property of: has note on carrier
definition: Relates a manifestation to a note on changes in the characteristics of the carrier that occur in subsequent issues or parts of a resource issued in successive parts or between iterations of an integrating resource.

has note on distribution statement
has unconstrained: P60125
lexical alias: noteOnDistributionStatement.en
name: noteOnDistributionStatement
status: Published
instruction number: 2.17.8
toolkit definition: A note providing details on place of distribution, distributor, or date of distribution, or information on changes in the place of distribution, distributor, or distributor
toolkit label: note on distribution statement
type: Property
domain: C10007
sub property of: has note on manifestation
definition: Relates a manifestation to a note providing details on place of distribution, distributor, or date of distribution, or information on changes in the place of distribution, distributor, or distributor’s name.

has note on manufacture statement
has unconstrained: P60126
lexical alias: noteOnManufactureStatement.en
name: noteOnManufactureStatement
status: Published
instruction number: 2.17.9
toolkit definition: A note providing details on place of manufacture, manufacturer, or date of manufacture, or information on changes in the place of manufacture, manufacturer, or manufacturer
toolkit label: note on manufacture statement
type: Property
domain: C10007
sub property of: has note on manifestation
definition: Relates a manifestation to a note providing details on place of manufacture, manufacturer, or date of manufacture, or information on changes in the place of manufacture, manufacturer, or manufacturer’s name.

has note on production statement
has unconstrained: P60127
lexical alias: noteOnProductionStatement.en
name: noteOnProductionStatement
status: Published
instruction number: 2.17.6
toolkit definition: A note providing details on place of production, producer, or date of production, or information on changes in the place of production, producer, or producer
toolkit label: note on production statement
type: Property
domain: C10007
sub property of: has note on manifestation
definition: Relates a manifestation to a note providing details on place of production, producer, or date of production, or information on changes in the place of production, producer, or producer’s name.

has note on publication statement
has unconstrained: P60128
lexical alias: noteOnPublicationStatement.en
name: noteOnPublicationStatement
status: Published
instruction number: 2.17.7
toolkit definition: A note providing details on place of publication, publisher, or date of publication, information on changes in the place of publication, publisher, or publisher
toolkit label: note on publication statement
type: Property
domain: C10007
sub property of: has note on manifestation
definition: Relates a manifestation to a note providing details on place of publication, publisher, or date of publication, information on changes in the place of publication, publisher, or publisher’s name, or on suspension of publication.

has note on frequency
has unconstrained: P60129
lexical alias: noteOnFrequency.en
name: noteOnFrequency
status: Published
instruction number: 2.17.12
toolkit definition: A note providing details on the currency of the contents, on the frequency of release of issues or parts of a serial or the frequency of updates to an integrating resource, or on changes in frequency.
toolkit label: note on frequency
type: Property
domain: C10007
sub property of: has note on manifestation
definition: Relates a manifestation to a note providing details on the currency of the contents, on the frequency of release of issues or parts of a serial or the frequency of updates to an integrating resource, or on changes in frequency.

has note on statement of responsibility
has unconstrained: P60130
lexical alias: noteOnStatementOfResponsibility.en
name: noteOnStatementOfResponsibility
status: Published
instruction number: 2.17.3
toolkit definition: A note providing information on a person, family, or corporate body not named in a statement of responsibility to whom responsibility for the intellectual or artistic content of the resource has been attributed, on variant forms of names appearing in the resource, on changes in statements of responsibility, or on other details relating to a statement of responsibility.
toolkit label: note on statement of responsibility
type: Property
domain: C10007
sub property of: has note on manifestation
definition: Relates a manifestation to a note providing information on a person, family, or corporate body not named in a statement of responsibility to whom responsibility for the intellectual or artistic content of the resource has been attributed, on variant forms of names appearing in the resource, on changes in statements of responsibility, or on other details relating to a statement of responsibility.

has note on series statement
has unconstrained: P60131
lexical alias: noteOnSeriesStatement.en
name: noteOnSeriesStatement
status: Published
instruction number: 2.17.11
toolkit definition: A note providing information on complex series statements, incorrect numbering within series, or changes in series statements.
toolkit label: note on series statement
type: Property
domain: C10007
sub property of: has note on manifestation
definition: Relates a manifestation to a note providing information on complex series statements, incorrect numbering within series, or changes in series statements.

has note on copyright date
has unconstrained: P60132
lexical alias: noteOnCopyrightDate.en
name: noteOnCopyrightDate
status: Published
instruction number: 2.17.10
toolkit definition: A note providing information on copyright dates not recorded as part of the copyright date element.
toolkit label: note on copyright date
type: Property
domain: C10007
sub property of: has note on manifestation
definition: Relates a manifestation to a note providing information on copyright dates not recorded as part of the copyright date element.

has note on dimensions of manifestation
has unconstrained: P60133
lexical alias: noteOnDimensionsOfManifestation.en
name: noteOnDimensionsOfManifestation
status: Published
instruction number: 3.21.3
toolkit definition: A note providing information on the dimensions of a manifestation that is not recorded as part of the dimensions element.
toolkit label: note on dimensions of manifestation
type: Property
domain: C10007
sub property of: has note on carrier
definition: Relates a manifestation to a note providing information on the dimensions of a manifestation that is not recorded as part of the dimensions element.

has note on extent of manifestation
has unconstrained: P60134
lexical alias: noteOnExtentOfManifestation.en
name: noteOnExtentOfManifestation
status: Published
instruction number: 3.21.2
toolkit definition: A note providing information on the extent of a manifestation that is not recorded as part of the extent element.
toolkit label: note on extent of manifestation
type: Property
domain: C10007
sub property of: has note on carrier
definition: Relates a manifestation to a note providing information on the extent of a manifestation that is not recorded as part of the extent element.

has note on numbering of serials
has unconstrained: P60135
lexical alias: noteOnNumberingOfSerials.en
name: noteOnNumberingOfSerials
status: Published
instruction number: 2.17.5
toolkit definition: A note providing information on the numbering of the first and/or last issue or part, on complex or irregular numbering (including numbering errors), or on the period covered by a volume, issue, part, etc.
toolkit label: note on numbering of serials
type: Property
domain: C10007
sub property of: has note on manifestation
definition: Relates a manifestation to a note providing information on the numbering of the first and/or last issue or part, on complex or irregular numbering (including numbering errors), or on the period covered by a volume, issue, part, etc.

has note on title
has unconstrained: P60136
lexical alias: noteOnTitle.en
name: noteOnTitle
status: Published
instruction number: 2.17.2
toolkit definition: A note providing information on the source from which a title was taken, the date the title was viewed, variations in titles, inaccuracies, deletions, etc., or other information relating to a title.
toolkit label: note on title
type: Property
domain: C10007
sub property of: has note on manifestation
definition: Relates a manifestation to a note providing information on the source from which a title was taken, the date the title was viewed, variations in titles, inaccuracies, deletions, etc., or other information relating to a title.

has note on edition statement
has unconstrained: P60137
lexical alias: noteOnEditionStatement.en
name: noteOnEditionStatement
status: Published
instruction number: 2.17.4
toolkit definition: A note providing information on the source of an edition statement, on edition statements relating to issues, parts, etc., on changes in edition statements, or other information relating to an edition statement.
toolkit label: note on edition statement
type: Property
domain: C10007
sub property of: has note on manifestation
definition: Relates a manifestation to a note providing information on the source of an edition statement, on edition statements relating to issues, parts, etc., on changes in edition statements, or other information relating to an edition statement.

has publisher’s number for music
has unconstrained: P60139
lexical alias: publishersNumberForMusic.en
name: publishersNumberForMusic
status: Published
instruction number: 2.15.2
toolkit definition: A numbering designation assigned to a resource by a music publisher, appearing normally only on the title page, the cover, and/or the first page of music.
toolkit label: publisher's number for music
type: Property
domain: C10007
sub property of: has identifier for the manifestation
definition: Relates a manifestation to a numbering designation assigned to a resource by a music publisher, appearing normally only on the title page, the cover, and/or the first page of music.

has plate number for music
has unconstrained: P60140
lexical alias: plateNumberForMusic.en
name: plateNumberForMusic
status: Published
instruction number: 2.15.3
toolkit definition: A numbering designation assigned to a resource by a music publisher.
toolkit label: plate number for music
type: Property
domain: C10007
sub property of: has identifier for the manifestation
definition: Relates a manifestation to a numbering designation assigned to a resource by a music publisher.
scope note: The number is usually printed at the bottom of each page, and sometimes also appears on the title page.

has broadcaster
has unconstrained: P60407
lexical alias: broadcaster.en
name: broadcaster
status: Published
toolkit definition: A person, family, or corporate body involved in broadcasting a manifestation to an audience via radio, television, webcast, etc.
toolkit label: broadcaster
type: Property
domain: C10007
range: C10002
sub property of: has publisher
inverse of: P50168
definition: Relates a manifestation to a person, family, or corporate body involved in broadcasting a manifestation to an audience via radio, television, webcast, etc.

has film distributor
has unconstrained: P60408
lexical alias: filmDistributor.en
name: filmDistributor
status: Published
toolkit definition: A person, family, or corporate body involved in distributing a moving image manifestation to theatres or other distribution channels.
toolkit label: film distributor
type: Property
domain: C10007
range: C10002
sub property of: has distributor
inverse of: P50169
definition: Relates a manifestation to a person, family, or corporate body involved in distributing a moving image manifestation to theatres or other distribution channels.

has book designer
has unconstrained: P60409
lexical alias: bookDesigner.en
name: bookDesigner
status: Published
toolkit definition: A person, family, or corporate body involved in manufacturing a manifestation by being responsible for the entire graphic design of a book, including arrangement of type and illustration, choice of materials, and process used.
toolkit label: book designer
type: Property
domain: C10007
range: C10002
sub property of: has manufacturer
inverse of: P50170
definition: Relates a manifestation to a person, family, or corporate body involved in manufacturing a manifestation by being responsible for the entire graphic design of a book, including arrangement of type and illustration, choice of materials, and process used.

has engraver
has unconstrained: P60410
lexical alias: engraver.en
name: engraver
status: Published
toolkit definition: A person, family, or corporate body involved in manufacturing a manifestation by cutting letters, figures, etc., on a surface such as a wooden or metal plate used for printing.
toolkit label: engraver
type: Property
domain: C10007
range: C10002
sub property of: has manufacturer
inverse of: P50171
definition: Relates a manifestation to a person, family, or corporate body involved in manufacturing a manifestation by cutting letters, figures, etc., on a surface such as a wooden or metal plate used for printing.

has braille embosser
has unconstrained: P60411
lexical alias: brailleEmbosser.en
name: brailleEmbosser
status: Published
toolkit definition: A person, family, or corporate body involved in manufacturing a manifestation by embossing Braille cells using a stylus, special embossing printer, or other device.
toolkit label: braille embosser
type: Property
domain: C10007
range: C10002
sub property of: has manufacturer
inverse of: P50172
definition: Relates a manifestation to a person, family, or corporate body involved in manufacturing a manifestation by embossing braille cells using a stylus, special embossing printer, or other device.

has printmaker
has unconstrained: P60412
lexical alias: printmaker.en
name: printmaker
status: Published
toolkit definition: A person, family, or corporate body involved in manufacturing a manifestation by making a relief, intaglio, or planographic printing surface.
toolkit label: printmaker
type: Property
domain: C10007
range: C10002
sub property of: has manufacturer
inverse of: P50173
definition: Relates a manifestation to a person, family, or corporate body involved in manufacturing a manifestation by making a relief, intaglio, or planographic printing surface.

has caster
has unconstrained: P60413
lexical alias: caster.en
name: caster
status: Published
toolkit definition: A person, family, or corporate body involved in manufacturing a manifestation by pouring a liquid or molten substance into a mold and leaving it to solidify to take the shape of the mold.
toolkit label: caster
type: Property
domain: C10007
range: C10002
sub property of: has manufacturer
inverse of: P50174
definition: Relates a manifestation to a person, family, or corporate body involved in manufacturing a manifestation by pouring a liquid or molten substance into a mold and leaving it to solidify to take the shape of the mold.

has lithographer
has unconstrained: P60414
lexical alias: lithographer.en
name: lithographer
status: Published
toolkit definition: A person, family, or corporate body involved in manufacturing a manifestation by preparing a stone or plate for lithographic printing, including a graphic artist creating a design directly on the surface from which printing will be done.
toolkit label: lithographer
type: Property
domain: C10007
range: C10002
sub property of: has manufacturer
inverse of: P50175
definition: Relates a manifestation to a person, family, or corporate body involved in manufacturing a manifestation by preparing a stone or plate for lithographic printing, including a graphic artist creating a design directly on the surface from which printing will be done.

has platemaker
has unconstrained: P60415
lexical alias: platemaker.en
name: platemaker
status: Published
toolkit definition: A person, family, or corporate body involved in manufacturing a manifestation by preparing plates used in the production of printed images and/or text.
toolkit label: platemaker
type: Property
domain: C10007
range: C10002
sub property of: has manufacturer
inverse of: P50176
definition: Relates a manifestation to a person, family, or corporate body involved in manufacturing a manifestation by preparing plates used in the production of printed images and/or text.

has etcher
has unconstrained: P60416
lexical alias: etcher.en
name: etcher
status: Published
toolkit definition: A person, family, or corporate body involved in manufacturing a manifestation by subjecting metal, glass, or some other surface used for printing, to acid or another corrosive substance.
toolkit label: etcher
type: Property
domain: C10007
range: C10002
sub property of: has manufacturer
inverse of: P50177
definition: Relates a manifestation to a person, family, or corporate body involved in manufacturing a manifestation by subjecting metal, glass, or some other surface used for printing, to acid or another corrosive substance.

has collotyper
has unconstrained: P60417
lexical alias: collotyper.en
name: collotyper
status: Published
toolkit definition: A person, family, or corporate body involved in manufacturing a manifestation using a photomechanical process for making prints directly from a hardened film of gelatin or other colloid that has ink-receptive and ink-repellent surfaces.
toolkit label: collotyper
type: Property
domain: C10007
range: C10002
sub property of: has manufacturer
inverse of: P50178
definition: Relates a manifestation to a person, family, or corporate body involved in manufacturing a manifestation using a photomechanical process for making prints directly from a hardened film of gelatin or other colloid that has ink-receptive and ink-repellent surfaces.

has printer
has unconstrained: P60418
lexical alias: printer.en
name: printer
status: Published
toolkit definition: A person, family, or corporate body involved in manufacturing a manifestation of printed text, notated music, etc., from type or plates, such as a book, newspaper, magazine, broadside, score, etc.
toolkit label: printer
type: Property
domain: C10007
range: C10002
sub property of: has manufacturer
inverse of: P50179
definition: Relates a manifestation to a person, family, or corporate body involved in manufacturing a manifestation of printed text, notated music, etc., from type or plates, such as a book, newspaper, magazine, broadside, score, etc.

has other person, family, or corporate body associated with a manifestation
has unconstrained: P60374
lexical alias: otherPFCManifestation.en
name: otherPFCManifestation
status: Published
instruction number: 21.6
toolkit definition: A person, family, or corporate body other than a producer, publisher, distributor or manufacturer associated with a manifestation.
toolkit label: other person, family, or corporate body associated with a manifestation
type: Property
domain: C10007
range: C10002
inverse of: P50181
definition: Relates a manifestation to a person, family, or corporate body other than a producer, publisher, distributor or manufacturer associated with a manifestation.
scope note: Includes book designers, platemakers, etc.

has distributor
has subproperty: has film distributor
has unconstrained: P60438
lexical alias: distributor.en
name: distributor
status: Published
instruction number: 21.4
toolkit definition: A person, family, or corporate body responsible for distributing a resource.
toolkit label: distributor
type: Property
domain: C10007
range: C10002
inverse of: P50199
definition: Relates a manifestation to a person, family, or corporate body responsible for distributing a resource.

has producer of an unpublished resource
has unconstrained: P60440
lexical alias: producerOfAnUnpublishedResource.en
name: producerOfAnUnpublishedResource
status: Published
instruction number: 21.2
toolkit definition: A person, family, or corporate body responsible for inscribing, fabricating, constructing, etc., a resource in an unpublished form.
toolkit label: producer of an unpublished resource
type: Property
domain: C10007
range: C10002
inverse of: P50200
definition: Relates a manifestation to a person, family, or corporate body responsible for inscribing, fabricating, constructing, etc., a resource in an unpublished form.

has manufacturer
has subproperty: has book designer
has subproperty: has engraver
has subproperty: has braille embosser
has subproperty: has printmaker
has subproperty: has caster
has subproperty: has lithographer
has subproperty: has platemaker
has subproperty: has etcher
has subproperty: has collotyper
has subproperty: has printer
has subproperty: has papermaker
has unconstrained: P60443
lexical alias: manufacturer.en
name: manufacturer
status: Published
instruction number: 21.5
toolkit definition: A person, family, or corporate body responsible for printing, duplicating, casting, etc., a resource in a published form.
toolkit label: manufacturer
type: Property
domain: C10007
range: C10002
inverse of: P50202
definition: Relates a manifestation to a person, family, or corporate body responsible for printing, duplicating, casting, etc., a resource in a published form.

has publisher
has subproperty: has broadcaster
has unconstrained: P60444
lexical alias: publisher.en
name: publisher
status: Published
instruction number: 21.3
toolkit definition: A person, family, or corporate body responsible for publishing, releasing, or issuing a resource.
toolkit label: publisher
type: Property
domain: C10007
range: C10002
inverse of: P50203
definition: Relates a manifestation to a person, family, or corporate body responsible for publishing, releasing, or issuing a resource.

has applied material
has subproperty: has emulsion on microfilm and microfiche
has unconstrained: P60159
lexical alias: appliedMaterial.en
name: appliedMaterial
status: Published
instruction number: 3.7
toolkit definition: A physical or chemical substance applied to a base material of a resource.
toolkit label: applied material
type: Property
domain: C10007
definition: Relates a manifestation to a physical or chemical substance applied to a base material of a resource.

has place of distribution
has unconstrained: P60160
lexical alias: placeOfDistribution.en
name: placeOfDistribution
status: Published
instruction number: 2.9.2
toolkit definition: A place associated with the distribution of a resource in a published form.
toolkit label: place of distribution
type: Property
domain: C10007
definition: Relates a manifestation to a place associated with the distribution of a resource in a published form.

has place of production
has unconstrained: P60161
lexical alias: placeOfProduction.en
name: placeOfProduction
status: Published
instruction number: 2.7.2
toolkit definition: A place associated with the inscription, fabrication, construction, etc., of a resource in an unpublished form.
toolkit label: place of production
type: Property
domain: C10007
definition: Relates a manifestation to a place associated with the inscription, fabrication, construction, etc., of a resource in an unpublished form.

has place of manufacture
has unconstrained: P60162
lexical alias: placeOfManufacture.en
name: placeOfManufacture
status: Published
instruction number: 2.10.2
toolkit definition: A place associated with the printing, duplicating, casting, etc., of a resource in a published form.
toolkit label: place of manufacture
type: Property
domain: C10007
definition: Relates a manifestation to a place associated with the printing, duplicating, casting, etc., of a resource in a published form.

has place of publication
has unconstrained: P60163
lexical alias: placeOfPublication.en
name: placeOfPublication
status: Published
instruction number: 2.8.2
toolkit definition: A place associated with the publication, release, or issuing of a resource.
toolkit label: place of publication
type: Property
domain: C10007
definition: Relates a manifestation to a place associated with the publication, release, or issuing of a resource.

has parallel place of distribution
has unconstrained: P60164
lexical alias: parallelPlaceOfDistribution.en
name: parallelPlaceOfDistribution
status: Published
instruction number: 2.9.3
toolkit definition: A place of distribution in a language and/or script that differs from that recorded in the place of distribution element.
toolkit label: parallel place of distribution
type: Property
domain: C10007
definition: Relates a manifestation to a place of distribution in a language and/or script that differs from that recorded in the place of distribution element.

has parallel place of manufacture
has unconstrained: P60165
lexical alias: parallelPlaceOfManufacture.en
name: parallelPlaceOfManufacture
status: Published
instruction number: 2.10.3
toolkit definition: A place of manufacture in a language and/or script that differs from that recorded in the place of manufacture element.
toolkit label: parallel place of manufacture
type: Property
domain: C10007
definition: Relates a manifestation to a place of manufacture in a language and/or script that differs from that recorded in the place of manufacture element.

has parallel place of production
has unconstrained: P60166
lexical alias: parallelPlaceOfProduction.en
name: parallelPlaceOfProduction
status: Published
instruction number: 2.7.3
toolkit definition: A place of production in a language and/or script that differs from that recorded in the place of production element.
toolkit label: parallel place of production
type: Property
domain: C10007
definition: Relates a manifestation to a place of production in a language and/or script that differs from that recorded in the place of production element.

has parallel place of publication
has unconstrained: P60167
lexical alias: parallelPlaceOfPublication.en
name: parallelPlaceOfPublication
status: Published
instruction number: 2.8.3
toolkit definition: A place of publication in a language and/or script that differs from that recorded in the place of publication element.
toolkit label: parallel place of publication
type: Property
domain: C10007
definition: Relates a manifestation to a place of publication in a language and/or script that differs from that recorded in the place of publication element.

is reprint of (manifestation)
has unconstrained: P60168
lexical alias: reprintOfManifestation.en
name: reprintOfManifestation
status: Published
toolkit definition: A printed manifestation that is used as the basis for a reissue of a manifestation.
toolkit label: reprint of (manifestation)
type: Property
domain: C10007
range: C10007
sub property of: is reproduction of (manifestation)
inverse of: is reprinted as (manifestation)
definition: Relates a manifestation to a printed manifestation that is used as the basis for a reissue of a manifestation.

has parallel producer’s name
has unconstrained: P60172
lexical alias: parallelProducersName.en
name: parallelProducersName
status: Published
instruction number: 2.7.5
toolkit definition: A producer
toolkit label: parallel producer's name
type: Property
domain: C10007
definition: Relates a manifestation to a producer's name in a language and/or script that differs from that recorded in the producer's name element.

has parallel publisher’s name
has unconstrained: P60173
lexical alias: parallelPublishersName.en
name: parallelPublishersName
status: Published
instruction number: 2.8.5
toolkit definition: A publisher
toolkit label: parallel publisher's name
type: Property
domain: C10007
definition: Relates a manifestation to a publisher's name in a language and/or script that differs from that recorded in the publisher's name element.

has encoding format
has unconstrained: P60314
lexical alias: encodingFormat.en
name: encodingFormat
status: Published
instruction number: 3.19.3
toolkit definition: A schema, standard, etc., used to encode the digital content of a resource.
toolkit label: encoding format
type: Property
domain: C10007
sub property of: has digital file characteristic
definition: Relates a manifestation to a schema, standard, etc., used to encode the digital content of a resource.

has alternative numeric and/or alphabetic designation of first issue or part of sequence
has unconstrained: P60820
lexical alias: alternativeNumericAndOrAlphabeticDesignationOfFirstIssueOrPartOfSequence.en
name: alternativeNumericAndOrAlphabeticDesignationOfFirstIssueOrPartOfSequence
status: Published
instruction number: 2.6.6
toolkit definition: A second or subsequent system of numbering presented in numeric and/or alphabetic form on the first issue or part of a sequence of numbering for a serial.
toolkit label: alternative numeric and/or alphabetic designation of first issue or part of sequence
type: Property
domain: C10007
sub property of: has numbering of serials
definition: Relates a manifestation to a second or subsequent system of numbering presented in numeric and/or alphabetic form on the first issue or part of a sequence of numbering for a serial.

has alternative numeric and/or alphabetic designation of last issue or part of sequence
has unconstrained: P60821
lexical alias: alternativeNumericAndOrAlphabeticDesignationOfLastIssueOrPartOfSequence.en
name: alternativeNumericAndOrAlphabeticDesignationOfLastIssueOrPartOfSequence
status: Published
instruction number: 2.6.8
toolkit definition: A second or subsequent system of numbering presented in numeric and/or alphabetic form on the last issue or part of a sequence of numbering for a serial.
toolkit label: alternative numeric and/or alphabetic designation of last issue or part of sequence
type: Property
domain: C10007
sub property of: has numbering of serials
definition: Relates a manifestation to a second or subsequent system of numbering presented in numeric and/or alphabetic form on the last issue or part of a sequence of numbering for a serial.

has alternative chronological designation of first issue or part of sequence
has unconstrained: P60818
lexical alias: alternativeChronologicalDesignationOfFirstIssueOrPartOfSequence.en
name: alternativeChronologicalDesignationOfFirstIssueOrPartOfSequence
status: Published
instruction number: 2.6.7
toolkit definition: A second or subsequent system of numbering presented in the form of a date (e.g., a year; year and month; month, day, and year) on the first issue or part of a sequence of numbering for a serial.
toolkit label: alternative chronological designation of first issue or part of sequence
type: Property
domain: C10007
sub property of: has numbering of serials
definition: Relates a manifestation to a second or subsequent system of numbering presented in the form of a date (e.g., a year; year and month; month, day, and year) on the first issue or part of a sequence of numbering for a serial.

has alternative chronological designation of last issue or part of sequence
has unconstrained: P60819
lexical alias: alternativeChronologicalDesignationOfLastIssueOrPartOfSequence.en
name: alternativeChronologicalDesignationOfLastIssueOrPartOfSequence
status: Published
instruction number: 2.6.9
toolkit definition: A second or subsequent system of numbering presented in the form of a date (e.g., a year; year and month; month, day, and year) on the last issue or part of a sequence of numbering for a serial.
toolkit label: alternative chronological designation of last issue or part of sequence
type: Property
domain: C10007
sub property of: has numbering of serials
definition: Relates a manifestation to a second or subsequent system of numbering presented in the form of a date (e.g., a year; year and month; month, day, and year) on the last issue or part of a sequence of numbering for a serial.

is special issue of
has unconstrained: P60317
lexical alias: specialIssueOf.en
name: specialIssueOf
status: Published
toolkit definition: A serial or newspaper containing a single issue or a supplementary section devoted to a special subject, with or without serial numbering, such as an anniversary number of a periodical or newspaper.
toolkit label: special issue of
type: Property
domain: C10007
range: C10007
sub property of: is contained in (manifestation)
inverse of: is special issue
definition: Relates a manifestation to a serial or newspaper containing a single issue or a supplementary section devoted to a special subject, with or without serial numbering, such as an anniversary number of a periodical or newspaper.

has digital representation of cartographic content
has unconstrained: P60323
lexical alias: digitalRepresentationOfCartographicContent.en
name: digitalRepresentationOfCartographicContent
status: Published
instruction number: 3.19.8
toolkit definition: A set of technical details relating to the encoding of geospatial information in a cartographic resource.
toolkit label: digital representation of cartographic content
type: Property
domain: C10007
sub property of: has digital file characteristic
definition: Relates a manifestation to a set of technical details relating to the encoding of geospatial information in a cartographic resource.

has exemplar of manifestation
lexical alias: exemplarOfManifestation.en
name: exemplarOfManifestation
status: Published
instruction number: 17.11
toolkit definition: A single exemplar or instance of a manifestation.
toolkit label: exemplar of manifestation
type: Property
domain: C10007
range: C10003
inverse of: P40049
definition: Relates a manifestation to a single exemplar or instance of a manifestation.

has video format
has unconstrained: P60326
lexical alias: videoFormat.en
name: videoFormat
status: Published
instruction number: 3.18.2
toolkit definition: A standard, etc., used to encode the analog video content of a resource.
toolkit label: video format
type: Property
domain: C10007
sub property of: has video characteristic
definition: Relates a manifestation to a standard, etc., used to encode the analog video content of a resource.

has statement of responsibility relating to title proper
has unconstrained: P60327
lexical alias: statementOfResponsibilityRelatingToTitleProper.en
name: statementOfResponsibilityRelatingToTitleProper
status: Published
instruction number: 2.4.2
toolkit definition: A statement associated with the title proper of a resource that relates to the identification and/or function of any persons, families, or corporate bodies responsible for the creation of, or contributing to the realization of, the intellectual or artistic content of the resource.
toolkit label: statement of responsibility relating to title proper
type: Property
domain: C10007
sub property of: has statement of responsibility
definition: Relates a manifestation to a statement associated with the title proper of a resource that relates to the identification and/or function of any persons, families, or corporate bodies responsible for the creation of, or contributing to the realization of, the intellectual or artistic content of the resource.

has series statement
has unconstrained: P60328
lexical alias: seriesStatement.en
name: seriesStatement
status: Published
instruction number: 2.12
toolkit definition: A statement identifying a series to which a resource belongs and the numbering of the resource within the series.
toolkit label: series statement
type: Property
domain: C10007
definition: Relates a manifestation to a statement identifying a series to which a resource belongs and the numbering of the resource within the series.
scope note: A series statement may also include information identifying one or more subseries to which the resource being described belongs. Series statements sometimes include statements of responsibility relating to a series or subseries.

has edition statement
has unconstrained: P60329
lexical alias: editionStatement.en
name: editionStatement
status: Published
instruction number: 2.5
toolkit definition: A statement identifying the edition to which a resource belongs.
toolkit label: edition statement
type: Property
domain: C10007
definition: Relates a manifestation to a statement identifying the edition to which a resource belongs.
scope note: An edition statement sometimes includes a designation of a named revision of an edition. An edition statement sometimes includes a statement or statements of responsibility relating to the edition and/or to a named revision of an edition.

has distribution statement
has unconstrained: P60330
lexical alias: distributionStatement.en
name: distributionStatement
status: Published
instruction number: 2.9
toolkit definition: A statement identifying the place or places of distribution, distributor or distributors, and date or dates of distribution of a resource in a published form.
toolkit label: distribution statement
type: Property
domain: C10007
definition: Relates a manifestation to a statement identifying the place or places of distribution, distributor or distributors, and date or dates of distribution of a resource in a published form.

has manufacture statement
has unconstrained: P60331
lexical alias: manufactureStatement.en
name: manufactureStatement
status: Published
instruction number: 2.1
toolkit definition: A statement identifying the place or places of manufacture, manufacturer or manufacturers, and date or dates of manufacture of a resource in a published form.
toolkit label: manufacture statement
type: Property
domain: C10007
definition: Relates a manifestation to a statement identifying the place or places of manufacture, manufacturer or manufacturers, and date or dates of manufacture of a resource in a published form.
scope note: Manufacture statements include statements relating to the printing, duplicating, casting, etc., of a resource in a published form.

has production statement
has unconstrained: P60332
lexical alias: productionStatement.en
name: productionStatement
status: Published
instruction number: 2.7
toolkit definition: A statement identifying the place or places of production, producer or producers, and date or dates of production of a resource in an unpublished form.
toolkit label: production statement
type: Property
domain: C10007
definition: Relates a manifestation to a statement identifying the place or places of production, producer or producers, and date or dates of production of a resource in an unpublished form.
scope note: Production statements include statements relating to the inscription, fabrication, construction, etc., of a resource in an unpublished form.

has publication statement
has unconstrained: P60333
lexical alias: publicationStatement.en
name: publicationStatement
status: Published
instruction number: 2.8
toolkit definition: A statement identifying the place or places of publication, publisher or publishers, and date or dates of publication of a resource.
toolkit label: publication statement
type: Property
domain: C10007
definition: Relates a manifestation to a statement identifying the place or places of publication, publisher or publishers, and date or dates of publication of a resource.
scope note: Publication statements include statements relating to the publication, release, or issuing of a resource.

has parallel statement of responsibility relating to a named revision of an edition
has unconstrained: P60334
lexical alias: parallelStatementOfResponsibilityRelatingToANamedRevisionOfAnEdition.en
name: parallelStatementOfResponsibilityRelatingToANamedRevisionOfAnEdition
status: Published
instruction number: 2.5.9
toolkit definition: A statement of responsibility relating to a named revision of an edition in a language and/or script that differs from that recorded in the statement of responsibility relating to a named revision of an edition element.
toolkit label: parallel statement of responsibility relating to a named revision of an edition
type: Property
domain: C10007
definition: Relates a manifestation to a statement of responsibility relating to a named revision of an edition in a language and/or script that differs from that recorded in the statement of responsibility relating to a named revision of an edition element.

has parallel statement of responsibility relating to series
has unconstrained: P60335
lexical alias: parallelStatementOfResponsibilityRelatingToSeries.en
name: parallelStatementOfResponsibilityRelatingToSeries
status: Published
instruction number: 2.12.7
toolkit definition: A statement of responsibility relating to series in a language and/or script that differs from that recorded in the statement of responsibility relating to series element.
toolkit label: parallel statement of responsibility relating to series
type: Property
domain: C10007
definition: Relates a manifestation to a statement of responsibility relating to series in a language and/or script that differs from that recorded in the statement of responsibility relating to series element.

has parallel statement of responsibility relating to subseries
has unconstrained: P60336
lexical alias: parallelStatementOfResponsibilityRelatingToSubseries.en
name: parallelStatementOfResponsibilityRelatingToSubseries
status: Published
instruction number: 2.12.15
toolkit definition: A statement of responsibility relating to subseries in a language and/or script that differs from that recorded in the statement of responsibility relating to subseries element.
toolkit label: parallel statement of responsibility relating to subseries
type: Property
domain: C10007
definition: Relates a manifestation to a statement of responsibility relating to subseries in a language and/or script that differs from that recorded in the statement of responsibility relating to subseries element.

has parallel statement of responsibility relating to the edition
has unconstrained: P60337
lexical alias: parallelStatementOfResponsibilityRelatingToTheEdition.en
name: parallelStatementOfResponsibilityRelatingToTheEdition
status: Published
instruction number: 2.5.5
toolkit definition: A statement of responsibility relating to the edition in a language and/or script that differs from that recorded in the statement of responsibility relating to the edition element.
toolkit label: parallel statement of responsibility relating to the edition
type: Property
domain: C10007
definition: Relates a manifestation to a statement of responsibility relating to the edition in a language and/or script that differs from that recorded in the statement of responsibility relating to the edition element.

has parallel statement of responsibility relating to title proper
has unconstrained: P60338
lexical alias: parallelStatementOfResponsibilityRelatingToTitleProper.en
name: parallelStatementOfResponsibilityRelatingToTitleProper
status: Published
instruction number: 2.4.3
toolkit definition: A statement of responsibility relating to title proper in a language and/or script that differs from that recorded in the statement of responsibility relating to title proper element.
toolkit label: parallel statement of responsibility relating to title proper
type: Property
domain: C10007
sub property of: has statement of responsibility
definition: Relates a manifestation to a statement of responsibility relating to title proper in a language and/or script that differs from that recorded in the statement of responsibility relating to title proper element.

has statement of responsibility
has subproperty: has statement of responsibility relating to title proper
has subproperty: has parallel statement of responsibility relating to title proper
has unconstrained: P60339
lexical alias: statementOfResponsibility.en
name: statementOfResponsibility
status: Published
instruction number: 2.4
toolkit definition: A statement relating to the identification and/or function of any persons, families, or corporate bodies responsible for the creation of, or contributing to the realization of, the intellectual or artistic content of a resource.
toolkit label: statement of responsibility
type: Property
domain: C10007
definition: Relates a manifestation to a statement relating to the identification and/or function of any persons, families, or corporate bodies responsible for the creation of, or contributing to the realization of, the intellectual or artistic content of a resource.
scope note: A statement of responsibility sometimes includes words or phrases that are neither names nor linking words.

has statement of responsibility relating to a named revision of an edition
has unconstrained: P60340
lexical alias: statementOfResponsibilityRelatingToANamedRevisionOfAnEdition.en
name: statementOfResponsibilityRelatingToANamedRevisionOfAnEdition
status: Published
instruction number: 2.5.8
toolkit definition: A statement relating to the identification of any persons, families, or corporate bodies responsible for a named revision of an edition.
toolkit label: statement of responsibility relating to a named revision of an edition
type: Property
domain: C10007
definition: Relates a manifestation to a statement relating to the identification of any persons, families, or corporate bodies responsible for a named revision of an edition.

has statement of responsibility relating to series
has unconstrained: P60341
lexical alias: statementOfResponsibilityRelatingToSeries.en
name: statementOfResponsibilityRelatingToSeries
status: Published
instruction number: 2.12.6
toolkit definition: A statement relating to the identification of any persons, families, or corporate bodies responsible for a series.
toolkit label: statement of responsibility relating to series
type: Property
domain: C10007
definition: Relates a manifestation to a statement relating to the identification of any persons, families, or corporate bodies responsible for a series.

has statement of responsibility relating to subseries
has unconstrained: P60342
lexical alias: statementOfResponsibilityRelatingToSubseries.en
name: statementOfResponsibilityRelatingToSubseries
status: Published
instruction number: 2.12.14
toolkit definition: A statement relating to the identification of any persons, families, or corporate bodies responsible for a subseries.
toolkit label: statement of responsibility relating to subseries
type: Property
domain: C10007
definition: Relates a manifestation to a statement relating to the identification of any persons, families, or corporate bodies responsible for a subseries.

has statement of responsibility relating to the edition
has unconstrained: P60343
lexical alias: statementOfResponsibilityRelatingToTheEdition.en
name: statementOfResponsibilityRelatingToTheEdition
status: Published
instruction number: 2.5.4
toolkit definition: A statement relating to the identification of any persons, families, or corporate bodies responsible for the edition being described but not to all editions.
toolkit label: statement of responsibility relating to the edition
type: Property
domain: C10007
definition: Relates a manifestation to a statement relating to the identification of any persons, families, or corporate bodies responsible for the edition being described but not to all editions.

has emulsion on microfilm and microfiche
has unconstrained: P60344
lexical alias: emulsionOnMicrofilmAndMicrofiche.en
name: emulsionOnMicrofilmAndMicrofiche
status: Published
instruction number: 3.7.2
toolkit definition: A suspension of light-sensitive chemicals used as a coating on a microfilm or microfiche (e.g., silver halide).
toolkit label: emulsion on microfilm and microfiche
type: Property
domain: C10007
sub property of: has applied material
definition: Relates a manifestation to a suspension of light-sensitive chemicals used as a coating on a microfilm or microfiche (e.g., silver halide).

has broadcast standard
has unconstrained: P60349
lexical alias: broadcastStandard.en
name: broadcastStandard
status: Published
instruction number: 3.18.3
toolkit definition: A system used to format a video resource for television broadcast.
toolkit label: broadcast standard
type: Property
domain: C10007
sub property of: has video characteristic
definition: Relates a manifestation to a system used to format a video resource for television broadcast.

has digital file characteristic
has subproperty: has regional encoding
has subproperty: has file type
has subproperty: has encoding format
has subproperty: has digital representation of cartographic content
has subproperty: has resolution
has subproperty: has file size
has subproperty: has encoded bitrate
has unconstrained: P60350
lexical alias: digitalFileCharacteristic.en
name: digitalFileCharacteristic
status: Published
instruction number: 3.19
toolkit definition: A technical specification relating to the digital encoding of text, image, audio, video, and other types of data in a resource.
toolkit label: digital file characteristic
type: Property
domain: C10007
definition: Relates a manifestation to a technical specification relating to the digital encoding of text, image, audio, video, and other types of data in a resource.

has sound characteristic
has subproperty: has special playback characteristic
has subproperty: has track configuration
has subproperty: has groove characteristic
has subproperty: has type of recording
has subproperty: has configuration of playback channels
has subproperty: has tape configuration
has subproperty: has playing speed
has subproperty: has recording medium
has unconstrained: P60351
lexical alias: soundCharacteristic.en
name: soundCharacteristic
status: Published
instruction number: 3.16
toolkit definition: A technical specification relating to the encoding of sound in a resource.
toolkit label: sound characteristic
type: Property
domain: C10007
definition: Relates a manifestation to a technical specification relating to the encoding of sound in a resource.

has video characteristic
has subproperty: has video format
has subproperty: has broadcast standard
has unconstrained: P60352
lexical alias: videoCharacteristic.en
name: videoCharacteristic
status: Published
instruction number: 3.18
toolkit definition: A technical specification relating to the encoding of video images in a resource.
toolkit label: video characteristic
type: Property
domain: C10007
definition: Relates a manifestation to a technical specification relating to the encoding of video images in a resource.

has projection characteristic of motion picture film
has subproperty: has presentation format
has subproperty: has projection speed
has unconstrained: P60353
lexical alias: projectionCharacteristicOfMotionPictureFilm.en
name: projectionCharacteristicOfMotionPictureFilm
status: Published
instruction number: 3.17
toolkit definition: A technical specification relating to the projection of a motion picture film.
toolkit label: projection characteristic of motion picture film
type: Property
domain: C10007
definition: Relates a manifestation to a technical specification relating to the projection of a motion picture film.

has variant title
has unconstrained: P60355
lexical alias: variantTitle.en
name: variantTitle
status: Published
instruction number: 2.3.6
toolkit definition: A title associated with a resource that differs from a title recorded as the title proper, a parallel title proper, other title information, parallel other title information, earlier title proper, later title proper, key title, or abbreviated title.
toolkit label: variant title
type: Property
domain: C10007
sub property of: has title
definition: Relates a manifestation to a title associated with a resource that differs from a title recorded as the title proper, a parallel title proper, other title information, parallel other title information, earlier title proper, later title proper, key title, or abbreviated title.

has later title proper
has unconstrained: P60357
lexical alias: laterTitleProper.en
name: laterTitleProper
status: Published
instruction number: 2.3.8
toolkit definition: A title proper appearing on a later issue or part of a multipart monograph or serial that differs from that on the first or earliest issue or part.
toolkit label: later title proper
type: Property
domain: C10007
sub property of: has title
definition: Relates a manifestation to a title proper appearing on a later issue or part of a multipart monograph or serial that differs from that on the first or earliest issue or part.

has earlier title proper
has unconstrained: P60358
lexical alias: earlierTitleProper.en
name: earlierTitleProper
status: Published
instruction number: 2.3.7
toolkit definition: A title proper appearing on an earlier iteration of an integrating resource that differs from that on the current iteration.
toolkit label: earlier title proper
type: Property
domain: C10007
sub property of: has title
definition: Relates a manifestation to a title proper appearing on an earlier iteration of an integrating resource that differs from that on the current iteration.

has abbreviated title
has unconstrained: P60359
lexical alias: abbreviatedTitle.en
name: abbreviatedTitle
status: Published
instruction number: 2.3.10
toolkit definition: A title that has been abbreviated for purposes of indexing or identification.
toolkit label: abbreviated title
type: Property
domain: C10007
sub property of: has title
definition: Relates a manifestation to a title that has been abbreviated for purposes of indexing or identification.

has designation of a named revision of an edition
has unconstrained: P60364
lexical alias: designationOfANamedRevisionOfAnEdition.en
name: designationOfANamedRevisionOfAnEdition
status: Published
instruction number: 2.5.6
toolkit definition: A word, character, or group of words and/or characters, identifying a particular revision of a named edition.
toolkit label: designation of a named revision of an edition
type: Property
domain: C10007
definition: Relates a manifestation to a word, character, or group of words and/or characters, identifying a particular revision of a named edition.

has designation of edition
has unconstrained: P60365
lexical alias: designationOfEdition.en
name: designationOfEdition
status: Published
instruction number: 2.5.2
toolkit definition: A word, character or group of words and/or characters, identifying the edition to which a resource belongs.
toolkit label: designation of edition
type: Property
domain: C10007
definition: Relates a manifestation to a word, character or group of words and/or characters, identifying the edition to which a resource belongs.

has title
has subproperty: has variant title
has subproperty: has later title proper
has subproperty: has earlier title proper
has subproperty: has abbreviated title
has subproperty: has other title information
has subproperty: has parallel other title information
has subproperty: has title proper
has subproperty: has parallel title proper
has subproperty: has key title
has unconstrained: P60369
lexical alias: title.en
name: title
status: Published
instruction number: 2.3
toolkit definition: A word, character, or group of words and/or characters that names a resource or a work contained in it.
toolkit label: title
type: Property
domain: C10007
definition: Relates a manifestation to a word, character, or group of words and/or characters that names a resource or a work contained in it.

has work manifested
lexical alias: workManifested.en
name: workManifested
status: Published
instruction number: 17.8
toolkit definition: A work embodied in a manifestation.
toolkit label: work manifested
type: Property
domain: C10007
range: C10001
inverse of: P10072
definition: Relates a manifestation to a work embodied in a manifestation.

is electronic reproduction of (manifestation)
has unconstrained: P60469
lexical alias: electronicReproductionOfManifestation.en
name: electronicReproductionOfManifestation
status: Published
toolkit definition: A manifestation in an analog format that is transferred to a digital format.
toolkit label: electronic reproduction of (manifestation)
type: Property
domain: C10007
range: C10007
sub property of: is reproduction of (manifestation)
inverse of: is electronic reproduction (manifestation)
definition: Relates a manifestation to a manifestation in an analog format that is transferred to a digital format.

has note on manifestation
has subproperty: has note on issue, part, or iteration used as the basis for identification of the resource
has subproperty: has note on changes in carrier characteristics
has subproperty: has note on distribution statement
has subproperty: has note on manufacture statement
has subproperty: has note on production statement
has subproperty: has note on publication statement
has subproperty: has note on frequency
has subproperty: has note on statement of responsibility
has subproperty: has note on series statement
has subproperty: has note on copyright date
has subproperty: has note on numbering of serials
has subproperty: has note on title
has subproperty: has note on edition statement
has unconstrained: P60470
lexical alias: noteOnManifestation.en
name: noteOnManifestation
status: Published
instruction number: 2.17
toolkit definition: An annotation providing additional information about manifestation attributes.
toolkit label: note on manifestation
type: Property
domain: C10007
definition: Relates a manifestation to an annotation providing additional information about manifestation attributes.

has special playback characteristic
has unconstrained: P60481
lexical alias: specialPlaybackCharacteristic.en
name: specialPlaybackCharacteristic
status: Published
instruction number: 3.16.9
toolkit definition: An equalization system, noise reduction system, etc., used in making an audio recording.
toolkit label: special playback characteristic
type: Property
domain: C10007
sub property of: has sound characteristic
definition: Relates a manifestation to an equalization system, noise reduction system, etc., used in making an audio recording.

has expression manifested
lexical alias: expressionManifested.en
name: expressionManifested
status: Published
instruction number: 17.1
toolkit definition: An expression embodied in a manifestation.
toolkit label: expression manifested
type: Property
domain: C10007
range: C10006
inverse of: P20059
definition: Relates a manifestation to an expression embodied in a manifestation.

has related item
has unconstrained: P60313
lexical alias: relatedItem.en
name: relatedItem
status: Published
instruction number: 28.1
toolkit definition: An item, represented by an identifier or a description, that is related to the manifestation being described (e.g., an item used as the basis for a microform reproduction).
toolkit label: related item
type: Property
domain: C10007
range: C10003
definition: Relates a manifestation to an item, represented by an identifier or a description, that is related to the manifestation being described (e.g., an item used as the basis for a microform reproduction).

has contact information
has unconstrained: P60490
lexical alias: contactInformation.en
name: contactInformation
status: Published
instruction number: 4.3
toolkit definition: Information about an organization, etc., from which a resource may be obtained.
toolkit label: contact information
type: Property
domain: C10007
definition: Relates a manifestation to information about an organization, etc., from which a resource may be obtained.

has other title information
has unconstrained: P60493
lexical alias: otherTitleInformation.en
name: otherTitleInformation
status: Published
instruction number: 2.3.4
toolkit definition: Information that appears in conjunction with, and is subordinate to, the title proper of a resource.
toolkit label: other title information
type: Property
domain: C10007
sub property of: has title
definition: Relates a manifestation to information that appears in conjunction with, and is subordinate to, the title proper of a resource.

has other title information of series
has unconstrained: P60494
lexical alias: otherTitleInformationOfSeries.en
name: otherTitleInformationOfSeries
status: Published
instruction number: 2.12.4
toolkit definition: Information that appears in conjunction with, and is subordinate to, the title proper of a series.
toolkit label: other title information of series
type: Property
domain: C10007
definition: Relates a manifestation to information that appears in conjunction with, and is subordinate to, the title proper of a series.

has other title information of subseries
has unconstrained: P60495
lexical alias: otherTitleInformationOfSubseries.en
name: otherTitleInformationOfSubseries
status: Published
instruction number: 2.12.12
toolkit definition: Information that appears in conjunction with, and is subordinate to, the title proper of a subseries.
toolkit label: other title information of subseries
type: Property
domain: C10007
definition: Relates a manifestation to information that appears in conjunction with, and is subordinate to, the title proper of a subseries.

has restrictions on access to manifestation
has unconstrained: P60496
lexical alias: restrictionsOnAccessToManifestation.en
name: restrictionsOnAccessToManifestation
status: Published
instruction number: 4.4
toolkit definition: Limitations placed on access to a resource.
toolkit label: restrictions on access
type: Property
domain: C10007
definition: Relates a manifestation to limitations placed on access to a manifestation.

has restrictions on use of manifestation
has unconstrained: P60497
lexical alias: restrictionsOnUseOfManifestation.en
name: restrictionsOnUseOfManifestation
status: Published
instruction number: 4.5
toolkit definition: Limitations placed on uses such as reproduction, publication, exhibition, etc.
toolkit label: restrictions on use
type: Property
domain: C10007
definition: Relates a manifestation to limitations placed on uses such as reproduction, publication, exhibition, etc.

has numeric and/or alphabetic designation of first issue or part of sequence
has unconstrained: P60499
lexical alias: numericAndOrAlphabeticDesignationOfFirstIssueOrPartOfSequence.en
name: numericAndOrAlphabeticDesignationOfFirstIssueOrPartOfSequence
status: Published
instruction number: 2.6.2
toolkit definition: Numbering presented in numeric and/or alphabetic form on the first issue or part of a sequence of numbering for a serial.
toolkit label: numeric and/or alphabetic designation of first issue or part of sequence
type: Property
domain: C10007
sub property of: has numbering of serials
definition: Relates a manifestation to numbering presented in numeric and/or alphabetic form on the first issue or part of a sequence of numbering for a serial.

has numeric and/or alphabetic designation of last issue or part of sequence
has unconstrained: P60500
lexical alias: numericAndOrAlphabeticDesignationOfLastIssueOrPartOfSequence.en
name: numericAndOrAlphabeticDesignationOfLastIssueOrPartOfSequence
status: Published
instruction number: 2.6.4
toolkit definition: Numbering presented in numeric and/or alphabetic form on the last issue or part of a sequence of numbering for a serial.
toolkit label: numeric and/or alphabetic designation of last issue or part of sequence
type: Property
domain: C10007
sub property of: has numbering of serials
definition: Relates a manifestation to numbering presented in numeric and/or alphabetic form on the last issue or part of a sequence of numbering for a serial.

has chronological designation of first issue or part of sequence
has unconstrained: P60501
lexical alias: chronologicalDesignationOfFirstIssueOrPartOfSequence.en
name: chronologicalDesignationOfFirstIssueOrPartOfSequence
status: Published
instruction number: 2.6.3
toolkit definition: Numbering presented in the form of a date (e.g., a year; year and month; month, day, and year) on the first issue or part of a sequence of numbering for a serial.
toolkit label: chronological designation of first issue or part of sequence
type: Property
domain: C10007
sub property of: has numbering of serials
definition: Relates a manifestation to numbering presented in the form of a date (e.g., a year; year and month; month, day, and year) on the first issue or part of a sequence of numbering for a serial.

has chronological designation of last issue or part of sequence
has unconstrained: P60502
lexical alias: chronologicalDesignationOfLastIssueOrPartOfSequence.en
name: chronologicalDesignationOfLastIssueOrPartOfSequence
status: Published
instruction number: 2.6.5
toolkit definition: Numbering presented in the form of a date (e.g., a year; year and month; month, day, and year) on the last issue or part of a sequence of numbering for a serial.
toolkit label: chronological designation of last issue or part of sequence
type: Property
domain: C10007
sub property of: has numbering of serials
definition: Relates a manifestation to numbering presented in the form of a date (e.g., a year; year and month; month, day, and year) on the last issue or part of a sequence of numbering for a serial.

has parallel other title information
has unconstrained: P60507
lexical alias: parallelOtherTitleInformation.en
name: parallelOtherTitleInformation
status: Published
instruction number: 2.3.5
toolkit definition: Other title information in a language and/or script that differs from that recorded in the other title information element.
toolkit label: parallel other title information
type: Property
domain: C10007
sub property of: has title
definition: Relates a manifestation to other title information in a language and/or script that differs from that recorded in the other title information element.

has parallel other title information of series
has unconstrained: P60508
lexical alias: parallelOtherTitleInformationOfSeries.en
name: parallelOtherTitleInformationOfSeries
status: Published
instruction number: 2.12.5
toolkit definition: Other title information of a series in a language and/or script that differs from that recorded in the other title information of series element.
toolkit label: parallel other title information of series
type: Property
domain: C10007
definition: Relates a manifestation to other title information of a series in a language and/or script that differs from that recorded in the other title information of series element.

has parallel other title information of subseries
has unconstrained: P60509
lexical alias: parallelOtherTitleInformationOfSubseries.en
name: parallelOtherTitleInformationOfSubseries
status: Published
instruction number: 2.12.13
toolkit definition: Other title information of a subseries in a language and/or script that differs from that recorded in the other title information of subseries element.
toolkit label: parallel other title information of subseries
type: Property
domain: C10007
definition: Relates a manifestation to other title information of a subseries in a language and/or script that differs from that recorded in the other title information of subseries element.

has uniform resource locator
has unconstrained: P60511
lexical alias: uniformResourceLocator.en
name: uniformResourceLocator
status: Published
instruction number: 4.6
toolkit definition: The address of a remote access resource.
toolkit label: Uniform Resource Locator
type: Property
domain: C10007
definition: Relates a manifestation to the address of a remote access resource.

has layout
has unconstrained: P60513
lexical alias: layout.en
name: layout
status: Published
instruction number: 3.11
toolkit definition: The arrangement of text, images, tactile notation, etc., in a resource.
toolkit label: layout
type: Property
domain: C10007
definition: Relates a manifestation to the arrangement of text, images, tactile notation, etc., in a resource.

has title proper
has unconstrained: P60515
lexical alias: titleProper.en
name: titleProper
status: Published
instruction number: 2.3.2
toolkit definition: The chief name of a resource (i.e., the title normally used when citing the resource).
toolkit label: title proper
type: Property
domain: C10007
sub property of: has title
definition: Relates a manifestation to the chief name of a resource (i.e., the title normally used when citing the resource).

has title proper of series
has unconstrained: P60516
lexical alias: titleProperOfSeries.en
name: titleProperOfSeries
status: Published
instruction number: 2.12.2
toolkit definition: The chief name of a series (i.e., the title normally used when citing the series).
toolkit label: title proper of series
type: Property
domain: C10007
definition: Relates a manifestation to the chief name of a series (i.e., the title normally used when citing the series).

has title proper of subseries
has unconstrained: P60517
lexical alias: titleProperOfSubseries.en
name: titleProperOfSubseries
status: Published
instruction number: 2.12.10
toolkit definition: The chief name of a subseries (i.e., the title normally used when citing the subseries).
toolkit label: title proper of subseries
type: Property
domain: C10007
definition: Relates a manifestation to the chief name of a subseries (i.e., the title normally used when citing the subseries).

has resolution
has unconstrained: P60519
lexical alias: resolution.en
name: resolution
status: Published
instruction number: 3.19.5
toolkit definition: The clarity or fineness of detail in a digital image, expressed by the measurement of the image in pixels, etc.
toolkit label: resolution
type: Property
domain: C10007
sub property of: has digital file characteristic
definition: Relates a manifestation to the clarity or fineness of detail in a digital image, expressed by the measurement of the image in pixels, etc.

has terms of availability
has unconstrained: P60521
lexical alias: termsOfAvailability.en
name: termsOfAvailability
status: Published
instruction number: 4.2
toolkit definition: The conditions under which the publisher, distributor, etc., will normally supply a resource or the price of a resource.
toolkit label: terms of availability
type: Property
domain: C10007
definition: Relates a manifestation to the conditions under which the publisher, distributor, etc., will normally supply a resource or the price of a resource.

has track configuration
has unconstrained: P60522
lexical alias: trackConfiguration.en
name: trackConfiguration
status: Published
instruction number: 3.16.6
toolkit definition: The configuration of the audio track on a sound-track film (e.g., centre track).
toolkit label: track configuration
type: Property
domain: C10007
sub property of: has sound characteristic
definition: Relates a manifestation to the configuration of the audio track on a sound-track film (e.g., centre track).

has equipment or system requirement
has unconstrained: P60528
lexical alias: equipmentOrSystemRequirement.en
name: equipmentOrSystemRequirement
status: Published
instruction number: 3.2
toolkit definition: The equipment or system required for use, playback, etc., of an analog, digital, etc., resource.
toolkit label: equipment or system requirement
type: Property
domain: C10007
definition: Relates a manifestation to the equipment or system required for use, playback, etc., of an analog, digital, etc., resource.

has presentation format
has unconstrained: P60529
lexical alias: presentationFormat.en
name: presentationFormat
status: Published
instruction number: 3.17.2
toolkit definition: The format used in the production of a projected image (e.g., Cinerama, IMAX).
toolkit label: presentation format
type: Property
domain: C10007
sub property of: has projection characteristic of motion picture film
definition: Relates a manifestation to the format used in the production of a projected image (e.g., Cinerama, IMAX).

has groove characteristic
has unconstrained: P60532
lexical alias: grooveCharacteristic.en
name: grooveCharacteristic
status: Published
instruction number: 3.16.5
toolkit definition: The groove width of an analog disc or the groove pitch of an analog cylinder.
toolkit label: groove characteristic
type: Property
domain: C10007
sub property of: has sound characteristic
definition: Relates a manifestation to the groove width of an analog disc or the groove pitch of an analog cylinder.

has numbering of serials
has subproperty: has alternative numeric and/or alphabetic designation of first issue or part of sequence
has subproperty: has alternative numeric and/or alphabetic designation of last issue or part of sequence
has subproperty: has alternative chronological designation of first issue or part of sequence
has subproperty: has alternative chronological designation of last issue or part of sequence
has subproperty: has numeric and/or alphabetic designation of first issue or part of sequence
has subproperty: has numeric and/or alphabetic designation of last issue or part of sequence
has subproperty: has chronological designation of first issue or part of sequence
has subproperty: has chronological designation of last issue or part of sequence
has unconstrained: P60533
lexical alias: numberingOfSerials.en
name: numberingOfSerials
status: Published
instruction number: 2.6
toolkit definition: The identification of each of the issues or parts of a serial.
toolkit label: numbering of serials
type: Property
domain: C10007
definition: Relates a manifestation to the identification of each of the issues or parts of a serial.
scope note: Numbering of serials may include a numeral, a letter, any other character, or the combination of these with or without an accompanying caption (volume, number, etc.) and/or a chronological designation.

has ISSN of series
has unconstrained: P60534
lexical alias: issnOfSeries.en
name: issnOfSeries
status: Published
instruction number: 2.12.8
toolkit definition: The identifier assigned to a series by an ISSN registration agency.
toolkit label: ISSN of series
type: Property
domain: C10007
definition: Relates a manifestation to the identifier assigned to a series by an ISSN registration agency.

has ISSN of subseries
has unconstrained: P60535
lexical alias: issnOfSubseries.en
name: issnOfSubseries
status: Published
instruction number: 2.12.16
toolkit definition: The identifier assigned to a subseries by an ISSN registration agency.
toolkit label: ISSN of subseries
type: Property
domain: C10007
definition: Relates a manifestation to the identifier assigned to a subseries by an ISSN registration agency.

has frequency
has unconstrained: P60538
lexical alias: frequency.en
name: frequency
status: Published
instruction number: 2.14
toolkit definition: The intervals at which the issues or parts of a serial or the updates to an integrating resource are issued.
toolkit label: frequency
type: Property
domain: C10007
definition: Relates a manifestation to the intervals at which the issues or parts of a serial or the updates to an integrating resource are issued.

has dimensions
has subproperty: has dimensions of map, etc.
has subproperty: has dimensions of still image
has unconstrained: P60539
lexical alias: dimensions.en
name: dimensions
status: Published
instruction number: 3.5
toolkit definition: The measurements of the carrier or carriers and/or the container of a resource.
toolkit label: dimensions
type: Property
domain: C10007
definition: Relates a manifestation to the measurements of the carrier or carriers and/or the container of a resource.
scope note: Dimensions include measurements of height, width, depth, length, gauge, and diameter.

has dimensions of map, etc.
has unconstrained: P60540
lexical alias: dimensionsOfMapEtc.en
name: dimensionsOfMapEtc
status: Published
instruction number: 3.5.2
toolkit definition: The measurements of the face of a map, etc.
toolkit label: dimensions of map, etc.
type: Property
domain: C10007
sub property of: has dimensions
definition: Relates a manifestation to the measurements of the face of a map, etc.

has dimensions of still image
has unconstrained: P60541
lexical alias: dimensionsOfStillImage.en
name: dimensionsOfStillImage
status: Published
instruction number: 3.5.3
toolkit definition: The measurements of the pictorial area of a still image.
toolkit label: dimensions of still image
type: Property
domain: C10007
sub property of: has dimensions
definition: Relates a manifestation to the measurements of the pictorial area of a still image.

has type of recording
has unconstrained: P60543
lexical alias: typeOfRecording.en
name: typeOfRecording
status: Published
instruction number: 3.16.2
toolkit definition: The method used to encode audio content for playback (e.g., analog or digital).
toolkit label: type of recording
type: Property
domain: C10007
sub property of: has sound characteristic
definition: Relates a manifestation to the method used to encode audio content for playback (e.g., analog or digital).

has distributor’s name
has unconstrained: P60544
lexical alias: distributorsName.en
name: distributorsName
status: Published
instruction number: 2.9.4
toolkit definition: The name of a person, family, or corporate body responsible for distributing a resource in a published form.
toolkit label: distributor's name
type: Property
domain: C10007
definition: Relates a manifestation to the name of a person, family, or corporate body responsible for distributing a resource in a published form.

has producer’s name
has unconstrained: P60545
lexical alias: producersName.en
name: producersName
status: Published
instruction number: 2.7.4
toolkit definition: The name of a person, family, or corporate body responsible for inscribing, fabricating, constructing, etc., a resource in an unpublished form.
toolkit label: producer's name
type: Property
domain: C10007
definition: Relates a manifestation to the name of a person, family, or corporate body responsible for inscribing, fabricating, constructing, etc., a resource in an unpublished form.

has manufacturer’s name
has unconstrained: P60546
lexical alias: manufacturersName.en
name: manufacturersName
status: Published
instruction number: 2.10.4
toolkit definition: The name of a person, family, or corporate body responsible for printing, duplicating, casting, etc., a resource in a published form.
toolkit label: manufacturer's name
type: Property
domain: C10007
definition: Relates a manifestation to the name of a person, family, or corporate body responsible for printing, duplicating, casting, etc., a resource in a published form.

has publisher’s name
has unconstrained: P60547
lexical alias: publishersName.en
name: publishersName
status: Published
instruction number: 2.8.4
toolkit definition: The name of a person, family, or corporate body responsible for publishing, releasing, or issuing a resource.
toolkit label: publisher's name
type: Property
domain: C10007
definition: Relates a manifestation to the name of a person, family, or corporate body responsible for publishing, releasing, or issuing a resource.

has extent of cartographic resource
has unconstrained: P60550
lexical alias: extentOfCartographicResource.en
name: extentOfCartographicResource
status: Published
instruction number: 3.4.2
toolkit definition: The number and type of units and/or subunits making up a cartographic resource.
toolkit label: extent of cartographic resource
type: Property
domain: C10007
sub property of: has extent
definition: Relates a manifestation to the number and type of units and/or subunits making up a cartographic resource.

has extent of notated music
has unconstrained: P60550
lexical alias: extentOfNotatedMusic.en
name: extentOfNotatedMusic
status: Published
instruction number: 3.4.3
toolkit definition: The number and type of units and/or subunits making up a resource consisting of notated music, with or without accompanying text and/or illustrations.
toolkit label: extent of notated music
type: Property
domain: C10007
sub property of: has extent
definition: Relates a manifestation to the number and type of units and/or subunits making up a resource consisting of notated music, with or without accompanying text and/or illustrations.

has extent of still image
has unconstrained: P60550
lexical alias: extentOfStillImage.en
name: extentOfStillImage
status: Published
instruction number: 3.4.4
toolkit definition: The number and type of units and/or subunits making up a resource consisting of one or more still images.
toolkit label: extent of still image
type: Property
domain: C10007
sub property of: has extent
definition: Relates a manifestation to the number and type of units and/or subunits making up a resource consisting of one or more still images.

has extent of three-dimensional form
has unconstrained: P60550
lexical alias: extentOfThreeDimensionalForm.en
name: extentOfThreeDimensionalForm
status: Published
instruction number: 3.4.6
toolkit definition: The number and type of units and/or subunits making up a resource consisting of one or more three-dimensional forms.
toolkit label: extent of three-dimensional form
type: Property
domain: C10007
sub property of: has extent
definition: Relates a manifestation to the number and type of units and/or subunits making up a resource consisting of one or more three-dimensional forms.

has extent of text
has unconstrained: P60550
lexical alias: extentOfText.en
name: extentOfText
status: Published
instruction number: 3.4.5
toolkit definition: The number and type of units and/or subunits making up a resource consisting of text, with or without accompanying illustrations.
toolkit label: extent of text
type: Property
domain: C10007
sub property of: has extent
definition: Relates a manifestation to the number and type of units and/or subunits making up a resource consisting of text, with or without accompanying illustrations.

has extent
has subproperty: has extent of cartographic resource
has subproperty: has extent of notated music
has subproperty: has extent of still image
has subproperty: has extent of three-dimensional form
has subproperty: has extent of text
has unconstrained: P60550
lexical alias: extent.en
name: extent
status: Published
instruction number: 3.4
toolkit definition: The number and type of units and/or subunits making up a resource.
toolkit label: extent
type: Property
domain: C10007
definition: Relates a manifestation to the number and type of units and/or subunits making up a resource.

has file size
has unconstrained: P60551
lexical alias: fileSize.en
name: fileSize
status: Published
instruction number: 3.19.4
toolkit definition: The number of bytes in a digital file.
toolkit label: file size
type: Property
domain: C10007
sub property of: has digital file characteristic
definition: Relates a manifestation to the number of bytes in a digital file.

has configuration of playback channels
has unconstrained: P60552
lexical alias: configurationOfPlaybackChannels.en
name: configurationOfPlaybackChannels
status: Published
instruction number: 3.16.8
toolkit definition: The number of sound channels used to make a recording (e.g., one channel for a monophonic recording, two channels for a stereophonic recording).
toolkit label: configuration of playback channels
type: Property
domain: C10007
sub property of: has sound characteristic
definition: Relates a manifestation to the number of sound channels used to make a recording (e.g., one channel for a monophonic recording, two channels for a stereophonic recording).

has tape configuration
has unconstrained: P60553
lexical alias: tapeConfiguration.en
name: tapeConfiguration
status: Published
instruction number: 3.16.7
toolkit definition: The number of tracks on an audiotape.
toolkit label: tape configuration
type: Property
domain: C10007
sub property of: has sound characteristic
definition: Relates a manifestation to the number of tracks on an audiotape.

has mount
has unconstrained: P60554
lexical alias: mount.en
name: mount
status: Published
instruction number: 3.8
toolkit definition: The physical material used for the support or backing to which the base material of a resource has been attached.
toolkit label: mount
type: Property
domain: C10007
definition: Relates a manifestation to the physical material used for the support or backing to which the base material of a resource has been attached.

has production method
has subproperty: has production method for tactile resource
has subproperty: has production method for manuscript
has unconstrained: P60560
lexical alias: productionMethod.en
name: productionMethod
status: Published
instruction number: 3.9
toolkit definition: The process used to produce a resource.
toolkit label: production method
type: Property
domain: C10007
definition: Relates a manifestation to the process used to produce a resource.

has production method for tactile resource
has unconstrained: P60561
lexical alias: productionMethodForTactileResource.en
name: productionMethodForTactileResource
status: Published
instruction number: 3.9.3
toolkit definition: The process used to produce a tactile resource (e.g., embossing, thermoform).
toolkit label: production method for tactile resource
type: Property
domain: C10007
sub property of: has production method
definition: Relates a manifestation to the process used to produce a tactile resource (e.g., embossing, thermoform).

has production method for manuscript
has unconstrained: P60562
lexical alias: productionMethodForManuscript.en
name: productionMethodForManuscript
status: Published
instruction number: 3.9.2
toolkit definition: The process used to produce an original manuscript or a copy.
toolkit label: production method for manuscript
type: Property
domain: C10007
sub property of: has production method
definition: Relates a manifestation to the process used to produce an original manuscript or a copy.

has generation of audio recording
has unconstrained: P60567
lexical alias: generationOfAudioRecording.en
name: generationOfAudioRecording
status: Published
instruction number: 3.10.2
toolkit definition: The relationship between an original audio carrier and the carrier of a reproduction made from the original (e.g., a tape duplication master, a test pressing).
toolkit label: generation of audio recording
type: Property
domain: C10007
sub property of: has generation
definition: Relates a manifestation to the relationship between an original audio carrier and the carrier of a reproduction made from the original (e.g., a tape duplication master, a test pressing).

has generation
has subproperty: has generation of audio recording
has subproperty: has generation of digital resource
has subproperty: has generation of motion picture film
has subproperty: has generation of videotape
has subproperty: has generation of microform
has unconstrained: P60568
lexical alias: generation.en
name: generation
status: Published
instruction number: 3.1
toolkit definition: The relationship between an original carrier and the carrier of a reproduction made from the original (e.g., a first generation camera master, a second generation printing master).
toolkit label: generation
type: Property
domain: C10007
definition: Relates a manifestation to the relationship between an original carrier and the carrier of a reproduction made from the original (e.g., a first generation camera master, a second generation printing master).

has generation of digital resource
has unconstrained: P60569
lexical alias: generationOfDigitalResource.en
name: generationOfDigitalResource
status: Published
instruction number: 3.10.3
toolkit definition: The relationship between an original carrier of a digital resource and the carrier of a reproduction made from the original (e.g., a derivative master).
toolkit label: generation of digital resource
type: Property
domain: C10007
sub property of: has generation
definition: Relates a manifestation to the relationship between an original carrier of a digital resource and the carrier of a reproduction made from the original (e.g., a derivative master).

has generation of motion picture film
has unconstrained: P60570
lexical alias: generationOfMotionPictureFilm.en
name: generationOfMotionPictureFilm
status: Published
instruction number: 3.10.5
toolkit definition: The relationship between an original carrier of a motion picture film resource and the carrier of a reproduction made from the original (e.g., a reference print).
toolkit label: generation of motion picture film
type: Property
domain: C10007
sub property of: has generation
definition: Relates a manifestation to the relationship between an original carrier of a motion picture film resource and the carrier of a reproduction made from the original (e.g., a reference print).

has generation of videotape
has unconstrained: P60571
lexical alias: generationOfVideotape.en
name: generationOfVideotape
status: Published
instruction number: 3.10.6
toolkit definition: The relationship between an original carrier of a videotape resource and the carrier of a reproduction made from the original (e.g., a show copy).
toolkit label: generation of videotape
type: Property
domain: C10007
sub property of: has generation
definition: Relates a manifestation to the relationship between an original carrier of a videotape resource and the carrier of a reproduction made from the original (e.g., a show copy).

has generation of microform
has unconstrained: P60572
lexical alias: generationOfMicroform.en
name: generationOfMicroform
status: Published
instruction number: 3.10.4
toolkit definition: The relationship between an original microform carrier and the carrier of a reproduction made from the original (e.g., a printing master).
toolkit label: generation of microform
type: Property
domain: C10007
sub property of: has generation
definition: Relates a manifestation to the relationship between an original microform carrier and the carrier of a reproduction made from the original (e.g., a printing master).

has polarity
has unconstrained: P60573
lexical alias: polarity.en
name: polarity
status: Published
instruction number: 3.14
toolkit definition: The relationship of the colours and tones in an image to the colours and tones of the object reproduced (e.g., positive, negative).
toolkit label: polarity
type: Property
domain: C10007
definition: Relates a manifestation to the relationship of the colours and tones in an image to the colours and tones of the object reproduced (e.g., positive, negative).

has book format
has unconstrained: P60578
lexical alias: bookFormat.en
name: bookFormat
status: Published
instruction number: 3.12
toolkit definition: The result of folding a printed sheet to form a gathering of leaves (e.g., a sheet folded once to form a folio, twice to form a quarto, three times to form an octavo, etc.).
toolkit label: book format
type: Property
domain: C10007
definition: Relates a manifestation to the result of folding a printed sheet to form a gathering of leaves (e.g., a sheet folded once to form a folio, twice to form a quarto, three times to form an octavo, etc.).

has reduction ratio
has unconstrained: P60581
lexical alias: reductionRatio.en
name: reductionRatio
status: Published
instruction number: 3.15
toolkit definition: The size of a micro-image in relation to the original from which it was produced.
toolkit label: reduction ratio
type: Property
domain: C10007
definition: Relates a manifestation to the size of a micro-image in relation to the original from which it was produced.

has font size
has unconstrained: P60582
lexical alias: fontSize.en
name: fontSize
status: Published
instruction number: 3.13
toolkit definition: The size of the type used to represent the characters and symbols in a resource.
toolkit label: font size
type: Property
domain: C10007
definition: Relates a manifestation to the size of the type used to represent the characters and symbols in a resource.

has projection speed
has unconstrained: P60585
lexical alias: projectionSpeed.en
name: projectionSpeed
status: Published
instruction number: 3.17.3
toolkit definition: The speed at which a projected carrier must be operated to produce the moving image intended.
toolkit label: projection speed
type: Property
domain: C10007
sub property of: has projection characteristic of motion picture film
definition: Relates a manifestation to the speed at which a projected carrier must be operated to produce the moving image intended.

has playing speed
has unconstrained: P60586
lexical alias: playingSpeed.en
name: playingSpeed
status: Published
instruction number: 3.16.4
toolkit definition: The speed at which an audio carrier must be operated to produce the sound intended.
toolkit label: playing speed
type: Property
domain: C10007
sub property of: has sound characteristic
definition: Relates a manifestation to the speed at which an audio carrier must be operated to produce the sound intended.

has encoded bitrate
has unconstrained: P60587
lexical alias: encodedBitrate.en
name: encodedBitrate
status: Published
instruction number: 3.19.7
toolkit definition: The speed at which streaming audio, video, etc., is designed to play.
toolkit label: encoded bitrate
type: Property
domain: C10007
sub property of: has digital file characteristic
definition: Relates a manifestation to the speed at which streaming audio, video, etc., is designed to play.

has parallel title proper
has unconstrained: P60589
lexical alias: parallelTitleProper.en
name: parallelTitleProper
status: Published
instruction number: 2.3.3
toolkit definition: The title proper in another language and/or script.
toolkit label: parallel title proper
type: Property
domain: C10007
sub property of: has title
definition: Relates a manifestation to the title proper in another language and/or script.

has parallel title proper of series
has unconstrained: P60590
lexical alias: parallelTitleProperOfSeries.en
name: parallelTitleProperOfSeries
status: Published
instruction number: 2.12.3
toolkit definition: The title proper of a series in another language and/or script.
toolkit label: parallel title proper of series
type: Property
domain: C10007
definition: Relates a manifestation to the title proper of a series in another language and/or script.

has parallel title proper of subseries
has unconstrained: P60591
lexical alias: parallelTitleProperOfSubseries.en
name: parallelTitleProperOfSubseries
status: Published
instruction number: 2.12.11
toolkit definition: The title proper of a subseries in another language and/or script.
toolkit label: parallel title proper of subseries
type: Property
domain: C10007
definition: Relates a manifestation to the title proper of a subseries in another language and/or script.

has recording medium
has unconstrained: P60594
lexical alias: recordingMedium.en
name: recordingMedium
status: Published
instruction number: 3.16.3
toolkit definition: The type of medium used to record sound on an audio carrier (e.g., magnetic, optical).
toolkit label: recording medium
type: Property
domain: C10007
sub property of: has sound characteristic
definition: Relates a manifestation to the type of medium used to record sound on an audio carrier (e.g., magnetic, optical).

has base material
has unconstrained: P60596
lexical alias: baseMaterial.en
name: baseMaterial
status: Published
instruction number: 3.6
toolkit definition: The underlying physical material of a resource.
toolkit label: base material
type: Property
domain: C10007
definition: Relates a manifestation to the underlying physical material of a resource.

has key title
has unconstrained: P60597
lexical alias: keyTitle.en
name: keyTitle
status: Published
instruction number: 2.3.9
toolkit definition: The unique name assigned to a resource by an ISSN registration agency.
toolkit label: key title
type: Property
domain: C10007
sub property of: has title
definition: Relates a manifestation to the unique name assigned to a resource by an issn registration agency.

has accompanying manifestation relationship with
has subproperty: is accompanied by (manifestation)
has unconstrained: P60709
lexical alias: accompanyingManifestationRelationship.en
name: accompanyingManifestationRelationship
status: Published
toolkit definition: A manifestation that accompanies or is accompanied by the manifestation.
toolkit label: accompanying manifestation relationship
type: Property
domain: C10007
range: C10007
sub property of: has related manifestation
definition: Relates a manifestation to a manifestation that accompanies or is accompanied by the manifestation.

has equivalent manifestation relationship with
has subproperty: is equivalent (manifestation)
has unconstrained: P60712
lexical alias: equivalentManifestationRelationship.en
name: equivalentManifestationRelationship
status: Published
toolkit definition: A manifestation that is equivalent to the manifestation.
toolkit label: equivalent manifestation relationship
type: Property
domain: C10007
range: C10007
sub property of: has related manifestation
definition: Relates a manifestation to a manifestation that is equivalent to the manifestation.

has whole-part manifestation relationship with
has subproperty: is contained in (manifestation)
has subproperty: is container of (manifestation)
has unconstrained: P60714
lexical alias: wholePartManifestationRelationship.en
name: wholePartManifestationRelationship
status: Published
toolkit definition: A manifestation that is contained in or contains the manifestation.
toolkit label: whole-part manifestation relationship
type: Property
domain: C10007
range: C10007
sub property of: has related manifestation
definition: Relates a manifestation to a manifestation that is contained in or contains the manifestation.

has note on carrier
has subproperty: has note on dimensions of manifestation
has subproperty: has note on extent of manifestation
has unconstrained: P60470
lexical alias: noteOnCarrier.en
name: noteOnCarrier
status: Published
instruction number: 3.21
toolkit definition: A note providing information on attributes of the carrier or carriers of the manifestation.
toolkit label: note on carrier
type: Property
domain: C10007
definition: Relates a manifestation to a note providing information on attributes of the carrier or carriers of the manifestation.

has papermaker
has unconstrained: P60746
lexical alias: papermaker.en
name: papermaker
status: Published
toolkit definition: A person, family, or corporate body responsible for the production of paper used to manufacture a manifestation.
toolkit label: papermaker
type: Property
domain: C10007
range: C10002
sub property of: has manufacturer
inverse of: P50242
definition: Relates a manifestation to a person, family, or corporate body responsible for the production of paper used to manufacture a manifestation.

has details of applied material
has subproperty: has details of emulsion on microfilm and microfiche
has unconstrained: P60767
lexical alias: detailsOfAppliedMaterial.en
name: detailsOfAppliedMaterial
status: Published
instruction number: 3.7.1.4
toolkit definition: Details of a physical or chemical substance applied to a base material of a resource.
toolkit label: details of applied material
type: Property
domain: C10007
definition: Relates a manifestation to details of a physical or chemical substance applied to a base material of a resource.

has details of base material
has unconstrained: P60768
lexical alias: detailsOfBaseMaterial.en
name: detailsOfBaseMaterial
status: Published
instruction number: 3.6.1.4
toolkit definition: Details of the underlying physical material of a resource.
toolkit label: details of base material
type: Property
domain: C10007
definition: Relates a manifestation to details of the underlying physical material of a resource.

has details of book format
has unconstrained: P60769
lexical alias: detailsOfBookFormat.en
name: detailsOfBookFormat
status: Published
instruction number: 3.12.1.4
toolkit definition: Details of the result of folding a printed sheet to form a gathering of leaves (e.g., a sheet folded once to form a folio, twice to form a quarto, three times to form an octavo, etc.).
toolkit label: details of book format
type: Property
domain: C10007
definition: Relates a manifestation to details of the result of folding a printed sheet to form a gathering of leaves (e.g., a sheet folded once to form a folio, twice to form a quarto, three times to form an octavo, etc.).

has details of broadcast standard
has unconstrained: P60770
lexical alias: detailsOfBroadcastStandard.en
name: detailsOfBroadcastStandard
status: Published
instruction number: 3.18.3.4
toolkit definition: Details of a system used to format a video resource for television broadcast.
toolkit label: details of broadcast standard
type: Property
domain: C10007
sub property of: has details of video characteristic
definition: Relates a manifestation to details of a system used to format a video resource for television broadcast.

has details of configuration of playback channels
has unconstrained: P60771
lexical alias: detailsOfConfigurationOfPlaybackChannels.en
name: detailsOfConfigurationOfPlaybackChannels
status: Published
instruction number: 3.16.8.4
toolkit definition: Details of the number of sound channels used to make a recording (e.g., one channel for a monophonic recording, two channels for a stereophonic recording).
toolkit label: details of configuration of playback channels
type: Property
domain: C10007
sub property of: has details of sound characteristic
definition: Relates a manifestation to details of the number of sound channels used to make a recording (e.g., one channel for a monophonic recording, two channels for a stereophonic recording).

has details of digital file characteristic
has subproperty: has details of digital representation of cartographic content
has subproperty: has details of encoding format
has subproperty: has details of file type
has unconstrained: P60772
lexical alias: detailsOfDigitalFileCharacteristic.en
name: detailsOfDigitalFileCharacteristic
status: Published
instruction number: 3.19.1.4
toolkit definition: Details of a technical specification relating to the digital encoding of text, image, audio, video, and other types of data in a resource.
toolkit label: details of digital file characteristic
type: Property
domain: C10007
definition: Relates a manifestation to details of a technical specification relating to the digital encoding of text, image, audio, video, and other types of data in a resource.

has details of digital representation of cartographic content
has unconstrained: P60773
lexical alias: detailsOfDigitalRepresentationOfCartographicContent.en
name: detailsOfDigitalRepresentationOfCartographicContent
status: Published
instruction number: 3.19.8.4
toolkit definition: Details of the encoding of geospatial information in a cartographic resource (e.g., topology level, compression).
toolkit label: details of digital representation of cartographic content
type: Property
domain: C10007
sub property of: has details of digital file characteristic
definition: Relates a manifestation to details of the encoding of geospatial information in a cartographic resource (e.g., topology level, compression).

has details of emulsion on microfilm and microfiche
has unconstrained: P60774
lexical alias: detailsOfEmulsionOnMicrofilmAndMicrofiche.en
name: detailsOfEmulsionOnMicrofilmAndMicrofiche
status: Published
instruction number: 3.7.2.4
toolkit definition: Details of a suspension of light-sensitive chemicals used as a coating on a microfilm or microfiche (e.g., silver halide).
toolkit label: details of emulsion on microfilm and microfiche
type: Property
domain: C10007
sub property of: has details of applied material
definition: Relates a manifestation to details of a suspension of light-sensitive chemicals used as a coating on a microfilm or microfiche (e.g., silver halide).

has details of encoding format
has unconstrained: P60775
lexical alias: detailsOfEncodingFormat.en
name: detailsOfEncodingFormat
status: Published
instruction number: 3.19.3.4
toolkit definition: Details of a schema, standard, etc., used to encode the digital content of a resource.
toolkit label: details of encoding format
type: Property
domain: C10007
sub property of: has details of digital file characteristic
definition: Relates a manifestation to details of a schema, standard, etc., used to encode the digital content of a resource.

has details of file type
has unconstrained: P60776
lexical alias: detailsOfFileType.en
name: detailsOfFileType
status: Published
instruction number: 3.19.2.4
toolkit definition: Details of a general type of data content encoded in a computer file.
toolkit label: details of file type
type: Property
domain: C10007
sub property of: has details of digital file characteristic
definition: Relates a manifestation to details of a general type of data content encoded in a computer file.

has details of font size
has unconstrained: P60777
lexical alias: detailsOfFontSize.en
name: detailsOfFontSize
status: Published
instruction number: 3.13.1.4
toolkit definition: Details of the size of the type used to represent the characters and symbols in a resource.
toolkit label: details of font size
type: Property
domain: C10007
definition: Relates a manifestation to details of the size of the type used to represent the characters and symbols in a resource.

has details of generation of audio recording
has unconstrained: P60778
lexical alias: detailsOfGenerationOfAudioRecording.en
name: detailsOfGenerationOfAudioRecording
status: Published
instruction number: 3.10.2.4
toolkit definition: Details of the relationship between an original audio carrier and the carrier of a reproduction made from the original (e.g., a tape duplication master, a test pressing).
toolkit label: details of generation of audio recording
type: Property
domain: C10007
sub property of: has details of generation
definition: Relates a manifestation to details of the relationship between an original audio carrier and the carrier of a reproduction made from the original (e.g., a tape duplication master, a test pressing).

has details of generation of digital resource
has unconstrained: P60779
lexical alias: detailsOfGenerationOfDigitalResource.en
name: detailsOfGenerationOfDigitalResource
status: Published
instruction number: 3.10.3.4
toolkit definition: Details of the relationship between an original carrier of a digital resource and the carrier of a reproduction made from the original (e.g., a derivative master).
toolkit label: details of generation of digital resource
type: Property
domain: C10007
sub property of: has details of generation
definition: Relates a manifestation to details of the relationship between an original carrier of a digital resource and the carrier of a reproduction made from the original (e.g., a derivative master).

has details of generation of microform
has unconstrained: P60780
lexical alias: detailsOfGenerationOfMicroform.en
name: detailsOfGenerationOfMicroform
status: Published
instruction number: 3.10.4.4
toolkit definition: Details of the relationship between an original microform carrier and the carrier of a reproduction made from the original (e.g., a printing master).
toolkit label: details of generation of microform
type: Property
domain: C10007
sub property of: has details of generation
definition: Relates a manifestation to details of the relationship between an original microform carrier and the carrier of a reproduction made from the original (e.g., a printing master).

has details of generation of motion picture film
has unconstrained: P60781
lexical alias: detailsOfGenerationOfMotionPictureFilm.en
name: detailsOfGenerationOfMotionPictureFilm
status: Published
instruction number: 3.10.5.4
toolkit definition: Details of the relationship between an original carrier of a motion picture film resource and the carrier of a reproduction made from the original (e.g., a reference print).
toolkit label: details of generation of motion picture film
type: Property
domain: C10007
sub property of: has details of generation
definition: Relates a manifestation to details of the relationship between an original carrier of a motion picture film resource and the carrier of a reproduction made from the original (e.g., a reference print).

has details of generation of videotape
has unconstrained: P60782
lexical alias: detailsOfGenerationOfVideotape.en
name: detailsOfGenerationOfVideotape
status: Published
instruction number: 3.10.6.4
toolkit definition: Details of the relationship between an original carrier of a videotape resource and the carrier of a reproduction made from the original (e.g., a show copy).
toolkit label: details of generation of videotape
type: Property
domain: C10007
sub property of: has details of generation
definition: Relates a manifestation to details of the relationship between an original carrier of a videotape resource and the carrier of a reproduction made from the original (e.g., a show copy).

has details of groove characteristic
has unconstrained: P60783
lexical alias: detailsOfGrooveCharacteristic.en
name: detailsOfGrooveCharacteristic
status: Published
instruction number: 3.16.5.4
toolkit definition: Details of the groove width of an analog disc or the groove pitch of an analog cylinder.
toolkit label: details of groove characteristic
type: Property
domain: C10007
sub property of: has details of sound characteristic
definition: Relates a manifestation to details of the groove width of an analog disc or the groove pitch of an analog cylinder.

has details of layout
has unconstrained: P60784
lexical alias: detailsOfLayout.en
name: detailsOfLayout
status: Published
instruction number: 3.11.1.4
toolkit definition: Details of the arrangement of text, images, tactile notation, etc., in a resource.
toolkit label: details of layout
type: Property
domain: C10007
definition: Relates a manifestation to details of the arrangement of text, images, tactile notation, etc., in a resource.

has details of mount
has unconstrained: P60785
lexical alias: detailsOfMount.en
name: detailsOfMount
status: Published
instruction number: 3.8.1.4
toolkit definition: Details of the physical material used for the support or backing to which the base material of a resource has been attached.
toolkit label: details of mount
type: Property
domain: C10007
definition: Relates a manifestation to details of the physical material used for the support or backing to which the base material of a resource has been attached.

has details of playing speed
has unconstrained: P60786
lexical alias: detailsOfPlayingSpeed.en
name: detailsOfPlayingSpeed
status: Published
instruction number: 3.16.4.4
toolkit definition: Details of the speed at which an audio carrier must be operated to produce the sound intended.
toolkit label: details of playing speed
type: Property
domain: C10007
definition: Relates a manifestation to details of the speed at which an audio carrier must be operated to produce the sound intended.

has details of polarity
has unconstrained: P60787
lexical alias: detailsOfPolarity.en
name: detailsOfPolarity
status: Published
instruction number: 3.14.1.4
toolkit definition: Details of the relationship of the colours and tones in an image to the colours and tones of the object reproduced (e.g., positive, negative).
toolkit label: details of polarity
type: Property
domain: C10007
definition: Relates a manifestation to details of the relationship of the colours and tones in an image to the colours and tones of the object reproduced (e.g., positive, negative).

has details of presentation format
has unconstrained: P60788
lexical alias: detailsOfPresentationFormat.en
name: detailsOfPresentationFormat
status: Published
instruction number: 3.17.2.4
toolkit definition: Details of the format used in the production of a projected image (e.g., Cinerama, Imax).
toolkit label: details of presentation format
type: Property
domain: C10007
definition: Relates a manifestation to details of the format used in the production of a projected image (e.g., Cinerama, Imax).

has details of production method
has subproperty: has details of production method for manuscript
has subproperty: has details of production method for tactile resource
has unconstrained: P60789
lexical alias: detailsOfProductionMethod.en
name: detailsOfProductionMethod
status: Published
instruction number: 3.9.1.4
toolkit definition: Details of the process used to produce a resource.
toolkit label: details of production method
type: Property
domain: C10007
definition: Relates a manifestation to details of the process used to produce a resource.

has details of production method for manuscript
has unconstrained: P60790
lexical alias: detailsOfProductionMethodForManuscript.en
name: detailsOfProductionMethodForManuscript
status: Published
instruction number: 3.9.2.4
toolkit definition: Details of the process used to produce an original manuscript or a copy.
toolkit label: details of production method for manuscript
type: Property
domain: C10007
sub property of: has details of production method
definition: Relates a manifestation to details of the process used to produce an original manuscript or a copy.

has details of production method for tactile resource
has unconstrained: P60791
lexical alias: detailsOfProductionMethodForTactileResource.en
name: detailsOfProductionMethodForTactileResource
status: Published
instruction number: 3.9.3.4
toolkit definition: Details of the process used to produce a tactile resource (e.g., embossing, thermoform).
toolkit label: details of production method for tactile resource
type: Property
domain: C10007
sub property of: has details of production method
definition: Relates a manifestation to details of the process used to produce a tactile resource (e.g., embossing, thermoform).

has details of projection characteristic of motion picture film
has subproperty: has details of projection speed
has unconstrained: P60792
lexical alias: detailsOfProjectionCharacteristicOfMotionPictureFilm.en
name: detailsOfProjectionCharacteristicOfMotionPictureFilm
status: Published
instruction number: 3.17.1.4
toolkit definition: Details of a technical specification relating to the projection of a motion picture film.
toolkit label: details of projection characteristic of motion picture film
type: Property
domain: C10007
definition: Relates a manifestation to details of a technical specification relating to the projection of a motion picture film.

has details of projection speed
has unconstrained: P60793
lexical alias: detailsOfProjectionSpeed.en
name: detailsOfProjectionSpeed
status: Published
instruction number: 3.17.3.4
toolkit definition: Details of the speed at which a projected carrier must be operated to produce the moving image intended.
toolkit label: details of projection speed
type: Property
domain: C10007
sub property of: has details of projection characteristic of motion picture film
definition: Relates a manifestation to details of the speed at which a projected carrier must be operated to produce the moving image intended.

has details of recording medium
has unconstrained: P60794
lexical alias: detailsOfRecordingMedium.en
name: detailsOfRecordingMedium
status: Published
instruction number: 3.16.3.4
toolkit definition: Details of the type of medium used to record sound on an audio carrier (e.g., magnetic, optical).
toolkit label: details of recording medium
type: Property
domain: C10007
sub property of: has details of sound characteristic
definition: Relates a manifestation to details of the type of medium used to record sound on an audio carrier (e.g., magnetic, optical).

has details of reduction ratio
has unconstrained: P60795
lexical alias: detailsOfReductionRatio.en
name: detailsOfReductionRatio
status: Published
instruction number: 3.15.1.4
toolkit definition: Details of the size of a micro-image in relation to the original from which it was produced.
toolkit label: details of reduction ratio
type: Property
domain: C10007
definition: Relates a manifestation to details of the size of a micro-image in relation to the original from which it was produced.

has details of sound characteristic
has subproperty: has details of configuration of playback channels
has subproperty: has details of groove characteristic
has subproperty: has details of recording medium
has subproperty: has details of special playback characteristic
has subproperty: has details of tape configuration
has subproperty: has details of track configuration
has subproperty: has details of type of recording
has unconstrained: P60796
lexical alias: detailsOfSoundCharacteristic.en
name: detailsOfSoundCharacteristic
status: Published
instruction number: 3.16.1.4
toolkit definition: Details of a technical specification relating to the encoding of sound in a resource.
toolkit label: details of sound characteristic
type: Property
domain: C10007
definition: Relates a manifestation to details of a technical specification relating to the encoding of sound in a resource.

has details of special playback characteristic
has unconstrained: P60797
lexical alias: detailsOfSpecialPlaybackCharacteristic.en
name: detailsOfSpecialPlaybackCharacteristic
status: Published
instruction number: 3.16.9.4
toolkit definition: Details of an equalization system, noise reduction system, etc., used in making an audio recording.
toolkit label: details of special playback characteristic
type: Property
domain: C10007
sub property of: has details of sound characteristic
definition: Relates a manifestation to details of an equalization system, noise reduction system, etc., used in making an audio recording.

has details of tape configuration
has unconstrained: P60798
lexical alias: detailsOfTapeConfiguration.en
name: detailsOfTapeConfiguration
status: Published
instruction number: 3.16.7.4
toolkit definition: Details of the number of tracks on an audiotape.
toolkit label: details of tape configuration
type: Property
domain: C10007
sub property of: has details of sound characteristic
definition: Relates a manifestation to details of the number of tracks on an audiotape.

has details of track configuration
has unconstrained: P60799
lexical alias: detailsOfTrackConfiguration.en
name: detailsOfTrackConfiguration
status: Published
instruction number: 3.16.6.4
toolkit definition: Details of the configuration of the audio track on a sound-track film (e.g., centre track).
toolkit label: details of track configuration
type: Property
domain: C10007
sub property of: has details of sound characteristic
definition: Relates a manifestation to details of the configuration of the audio track on a sound-track film (e.g., centre track).

has details of type of recording
has unconstrained: P60800
lexical alias: detailsOfTypeOfRecording.en
name: detailsOfTypeOfRecording
status: Published
instruction number: 3.16.2.4
toolkit definition: Details of the method used to encode audio content for playback (e.g., analog or digital).
toolkit label: details of type of recording
type: Property
domain: C10007
sub property of: has details of sound characteristic
definition: Relates a manifestation to details of the method used to encode audio content for playback (e.g., analog or digital).

has details of video characteristic
has subproperty: has details of broadcast standard
has subproperty: has details of video format
has unconstrained: P60801
lexical alias: detailsOfVideoCharacteristic.en
name: detailsOfVideoCharacteristic
status: Published
instruction number: 3.18.1.4
toolkit definition: Details of a technical specification relating to the encoding of video images in a resource.
toolkit label: details of video characteristic
type: Property
domain: C10007
definition: Relates a manifestation to details of a technical specification relating to the encoding of video images in a resource.

has details of video format
has unconstrained: P60802
lexical alias: detailsOfVideoFormat.en
name: detailsOfVideoFormat
status: Published
instruction number: 3.18.2.4
toolkit definition: Details of a standard, etc., used to encode the analog video content of a resource.
toolkit label: details of video format
type: Property
domain: C10007
sub property of: has details of video characteristic
definition: Relates a manifestation to details of a standard, etc., used to encode the analog video content of a resource.

has details of generation
has subproperty: has details of generation of audio recording
has subproperty: has details of generation of digital resource
has subproperty: has details of generation of microform
has subproperty: has details of generation of motion picture film
has subproperty: has details of generation of videotape
has unconstrained: P60803
lexical alias: detailsOfGeneration.en
name: detailsOfGeneration
status: Published
instruction number: 3.10.1.3
toolkit definition: Details of the relationship between an original carrier and the carrier of a reproduction made from the original (e.g., a first generation camera master, a second generation printing master).
toolkit label: details of generation
type: Property
domain: C10007
definition: Relates a manifestation to details of the relationship between an original carrier and the carrier of a reproduction made from the original (e.g., a first generation camera master, a second generation printing master).

is subject of (manifestation)
has subproperty: is described in (manifestation)
has unconstrained: P60806
lexical alias: subjectOfManifestation.en
name: subjectOfManifestation
status: Published
toolkit definition: A work that is about the manifestation.
toolkit label: subject of (manifestation)
type: Property
domain: C10007
range: C10001
sub property of: P10283
inverse of: P10259
definition: Relates a manifestation to a work that is about the manifestation.

is described in (manifestation)
has subproperty: is analysed in (manifestation)
has subproperty: is commentary in (manifestation)
has subproperty: is critiqued in (manifestation)
has subproperty: is evaluated in (manifestation)
has subproperty: is reviewed in (manifestation)
has unconstrained: P60215
lexical alias: describedInManifestation.en
name: describedInManifestation
status: Published
toolkit definition: A work that describes a described manifestation.
toolkit label: described in (manifestation)
type: Property
domain: C10007
range: C10001
sub property of: is subject of (manifestation)
inverse of: P10271
definition: Relates a manifestation to a work that describes a described manifestation.

is analysed in (manifestation)
has unconstrained: P60219
lexical alias: analysedInManifestation.en
name: analysedInManifestation
status: Published
toolkit definition: A work that examines the source manifestation to identify its components and their relations.
toolkit label: analysed in (manifestation)
type: Property
domain: C10007
range: C10001
sub property of: is described in (manifestation)
inverse of: P10272
definition: Relates a manifestation to a work that examines the source manifestation to identify its components and their relations.

is commentary in (manifestation)
has unconstrained: P60213
lexical alias: commentaryInManifestation.en
name: commentaryInManifestation
status: Published
toolkit definition: A work that contains a set of explanatory or critical notes on the described manifestation.
toolkit label: commentary in (manifestation)
type: Property
domain: C10007
range: C10001
sub property of: is described in (manifestation)
inverse of: P10276
definition: Relates a manifestation to a work that contains a set of explanatory or critical notes on the described manifestation.

is critiqued in (manifestation)
has unconstrained: P60212
lexical alias: critiquedInManifestation.en
name: critiquedInManifestation
status: Published
toolkit definition: A work that contains a critical evaluation of the described manifestation.
toolkit label: critiqued in (manifestation)
type: Property
domain: C10007
range: C10001
sub property of: is described in (manifestation)
inverse of: P10275
definition: Relates a manifestation to a work that contains a critical evaluation of the described manifestation.

is evaluated in (manifestation)
has unconstrained: P60218
lexical alias: evaluatedInManifestation.en
name: evaluatedInManifestation
status: Published
toolkit definition: A work that examines or judges the described manifestation.
toolkit label: evaluated in (manifestation)
type: Property
domain: C10007
range: C10001
sub property of: is described in (manifestation)
inverse of: P10273
definition: Relates a manifestation to a work that examines or judges the described manifestation.

is reviewed in (manifestation)
has unconstrained: P60211
lexical alias: reviewedInManifestation.en
name: reviewedInManifestation
status: Published
toolkit definition: A work that contains a brief evaluation of the described manifestation.
toolkit label: reviewed in (manifestation)
type: Property
domain: C10007
range: C10001
sub property of: is described in (manifestation)
inverse of: P10274
definition: Relates a manifestation to a work that contains a brief evaluation of the described manifestation.