Published
type: Concept

Deprecated
type: Concept

RDA Item properties
note: Properties derived from RDA elements and relationship designators with the domain of RDA Item.

has identifier for the item
has unconstrained: P60052
lexical alias: identifierForTheItem.en
name: identifierForTheItem
status: Published
instruction number: 2.2
toolkit definition: A character string associated with an item that serves to differentiate that item from other items.
toolkit label: identifier for the item
type: Property
domain: C10003
definition: Relates an item to a character string associated with an item that serves to differentiate that item from other items.

has note on item-specific carrier characteristic
has subproperty: has note on dimensions of item
has subproperty: has note on extent of item
has unconstrained: P60056
lexical alias: noteOnItemSpecificCarrierCharacteristic.en
name: noteOnItemSpecificCarrierCharacteristic
status: Published
instruction number: 3.22
toolkit definition: A note providing additional information about carrier characteristics that are specific to the item being described and are assumed not to apply to other items exemplifying the same manifestation.
toolkit label: note on item-specific carrier characteristic
type: Property
domain: C10003
definition: Relates an item to a note providing additional information about carrier characteristics that are specific to the item being described and are assumed not to apply to other items exemplifying the same manifestation.

has collector
has unconstrained: P60066
lexical alias: collector.en
name: collector
status: Published
toolkit definition: A curator who brings together items from various sources that are then arranged, described, and cataloged as a collection.
toolkit label: collector
type: Property
domain: C10003
range: C10002
sub property of: has curator
inverse of: P50045
definition: Relates an item to a curator who brings together items from various sources that are then arranged, described, and cataloged as a collection.

has collection registrar
has unconstrained: P60067
lexical alias: collectionRegistrar.en
name: collectionRegistrar
status: Published
toolkit definition: A curator who lists or inventories the items in an aggregate work such as a collection of items or works.
toolkit label: collection registrar
type: Property
domain: C10003
range: C10002
sub property of: has curator
inverse of: P50046
definition: Relates an item to a curator who lists or inventories the items in an aggregate work such as a collection of items or works.

has depositor
has unconstrained: P60068
lexical alias: depositor.en
name: depositor
status: Published
toolkit definition: A current owner of an item who deposited the item into the custody of another person, family, or corporate body, while still retaining ownership.
toolkit label: depositor
type: Property
domain: C10003
range: C10002
sub property of: has current owner
inverse of: P50047
definition: Relates an item to a current owner of an item who deposited the item into the custody of another person, family, or corporate body, while still retaining ownership.

has donor
has unconstrained: P60091
lexical alias: donor.en
name: donor
status: Published
toolkit definition: A former owner of an item who donated that item to another owner.
toolkit label: donor
type: Property
domain: C10003
range: C10002
sub property of: has former owner
inverse of: P50066
definition: Relates an item to a former owner of an item who donated that item to another owner.

has seller
has unconstrained: P60092
lexical alias: seller.en
name: seller
status: Published
toolkit definition: A former owner of an item who sold that item to another owner.
toolkit label: seller
type: Property
domain: C10003
range: C10002
sub property of: has former owner
inverse of: P50067
definition: Relates an item to a former owner of an item who sold that item to another owner.

is contained in (item)
has unconstrained: P60101
lexical alias: containedInItem.en
name: containedInItem
status: Published
toolkit definition: A larger item of which the item is a discrete component.
toolkit label: contained in (item)
type: Property
domain: C10003
range: C10003
sub property of: has whole-part item relationship with
inverse of: is container of (item)
definition: Relates an item to a larger item of which the item is a discrete component.

has note on dimensions of item
has unconstrained: P60133
lexical alias: noteOnDimensionsOfItem.en
name: noteOnDimensionsOfItem
status: Published
instruction number: 3.22.3
toolkit definition: A note providing information on the dimensions of the specific item being described that is not recorded as part of the dimensions element.
toolkit label: note on dimensions of item
type: Property
domain: C10003
sub property of: has note on item-specific carrier characteristic
definition: Relates an item to a note providing information on the dimensions of the specific item being described that is not recorded as part of the dimensions element.

has note on extent of item
has unconstrained: P60134
lexical alias: noteOnExtentOfItem.en
name: noteOnExtentOfItem
status: Published
instruction number: 3.22.2
toolkit definition: A note providing information on the extent of the specific item being described that is not recorded as part of the extent element.
toolkit label: note on extent of item
type: Property
domain: C10003
sub property of: has note on item-specific carrier characteristic
definition: Relates an item to a note providing information on the extent of the specific item being described that is not recorded as part of the extent element.

has illuminator
has unconstrained: P60421
lexical alias: illuminator.en
name: illuminator
status: Published
toolkit definition: A person providing decoration to a specific item using precious metals or color, often with elaborate designs and motifs.
toolkit label: illuminator
type: Property
domain: C10003
range: C10004
sub property of: has other person, family, or corporate body associated with an item
inverse of: P50092
definition: Relates an item to a person providing decoration to a specific item using precious metals or color, often with elaborate designs and motifs.

has binder
has unconstrained: P60458
lexical alias: binder.en
name: binder
status: Published
toolkit definition: A person who binds an item.
toolkit label: binder
type: Property
domain: C10003
range: C10004
sub property of: has other person, family, or corporate body associated with an item
inverse of: P50123
definition: Relates an item to a person who binds an item.

has inscriber
has unconstrained: P60460
lexical alias: inscriber.en
name: inscriber
status: Published
toolkit definition: A person who has written a statement of dedication or gift on an item.
toolkit label: inscriber
type: Property
domain: C10003
range: C10004
sub property of: has other person, family, or corporate body associated with an item
inverse of: P50125
definition: Relates an item to a person who has written a statement of dedication or gift on an item.

has annotator
has unconstrained: P60464
lexical alias: annotator.en
name: annotator
status: Published
toolkit definition: A person who makes manuscript annotations on an item.
toolkit label: annotator
type: Property
domain: C10003
range: C10004
sub property of: has other person, family, or corporate body associated with an item
inverse of: P50128
definition: Relates an item to a person who makes manuscript annotations on an item.

has autographer
has unconstrained: P60466
lexical alias: autographer.en
name: autographer
status: Published
toolkit definition: A person whose manuscript signature appears on an item.
toolkit label: autographer
type: Property
domain: C10003
range: C10004
sub property of: has other person, family, or corporate body associated with an item
inverse of: P50129
definition: Relates an item to a person whose manuscript signature appears on an item.

has curator
has subproperty: has collector
has subproperty: has collection registrar
has unconstrained: P60376
lexical alias: curator.en
name: curator
status: Published
toolkit definition: A person, family, or corporate body conceiving, aggregating, and/or organizing an exhibition, collection, or other item.
toolkit label: curator
type: Property
domain: C10003
range: C10002
sub property of: has other person, family, or corporate body associated with an item
inverse of: P50133
definition: Relates an item to a person, family, or corporate body conceiving, aggregating, and/or organizing an exhibition, collection, or other item.

has current owner
has subproperty: has depositor
has unconstrained: P60400
lexical alias: currentOwner.en
name: currentOwner
status: Published
toolkit definition: A person, family, or corporate body currently having legal possession of an item.
toolkit label: current owner
type: Property
domain: C10003
range: C10002
sub property of: has owner
inverse of: P50162
definition: Relates an item to a person, family, or corporate body currently having legal possession of an item.

has former owner
has subproperty: has donor
has subproperty: has seller
has unconstrained: P60401
lexical alias: formerOwner.en
name: formerOwner
status: Published
toolkit definition: A person, family, or corporate body formerly having legal possession of an item.
toolkit label: former owner
type: Property
domain: C10003
range: C10002
sub property of: has owner
inverse of: P50163
definition: Relates an item to a person, family, or corporate body formerly having legal possession of an item.

has custodian
has unconstrained: P60402
lexical alias: custodian.en
name: custodian
status: Published
instruction number: 22.3
toolkit definition: A person, family, or corporate body having legal custody of an item.
toolkit label: custodian
type: Property
domain: C10003
range: C10002
inverse of: P50164
definition: Relates an item to a person, family, or corporate body having legal custody of an item.

has owner
has subproperty: has current owner
has subproperty: has former owner
has unconstrained: P60404
lexical alias: owner.en
name: owner
status: Published
instruction number: 22.2
toolkit definition: A person, family, or corporate body having legal possession of an item.
toolkit label: owner
type: Property
domain: C10003
range: C10002
inverse of: P50165
definition: Relates an item to a person, family, or corporate body having legal possession of an item.

has honouree (item)
has unconstrained: P60406
lexical alias: honoureeOfItem.en
name: honoureeOfItem
status: Published
toolkit definition: A person, family, or corporate body honoured by an item, e.g., a person to whom a copy is presented.
toolkit label: honouree (item)
type: Property
domain: C10003
range: C10002
sub property of: has other person, family, or corporate body associated with an item
inverse of: P50167
alternative label: has honoree (item)
definition: Relates an item to a person, family, or corporate body honoured by an item, e.g., a person to whom a copy is presented.

has other person, family, or corporate body associated with an item
has subproperty: has illuminator
has subproperty: has binder
has subproperty: has inscriber
has subproperty: has annotator
has subproperty: has autographer
has subproperty: has curator
has subproperty: has honouree (item)
has subproperty: has restorationist
has subproperty: has dedicatee (item)
has unconstrained: P60374
lexical alias: otherPFCItem.en
name: otherPFCItem
status: Published
instruction number: 22.4
toolkit definition: A person, family, or corporate body other than an owner or custodian associated with an item. Includes curators, binders, restorationists, etc.
toolkit label: other person, family, or corporate body associated with an item
type: Property
domain: C10003
range: C10002
inverse of: P50182
definition: Relates an item to a person, family, or corporate body other than an owner or custodian associated with an item.
scope note: Includes curators, binders, restorationists, etc.

has restorationist
has unconstrained: P60450
lexical alias: restorationist.en
name: restorationist
status: Published
toolkit definition: A person, family, or corporate body responsible for the set of technical, editorial, and intellectual procedures aimed at compensating for the degradation of an item by bringing it back to a state as close as possible to its original condition.
toolkit label: restorationist
type: Property
domain: C10003
range: C10002
sub property of: has other person, family, or corporate body associated with an item
inverse of: P50206
definition: Relates an item to a person, family, or corporate body responsible for the set of technical, editorial, and intellectual procedures aimed at compensating for the degradation of an item by bringing it back to a state as close as possible to its original condition.

has dedicatee (item)
has unconstrained: P60455
lexical alias: dedicateeOfItem.en
name: dedicateeOfItem
status: Published
toolkit definition: A person, family, or corporate body to whom an item is dedicated.
toolkit label: dedicatee (item)
type: Property
domain: C10003
range: C10002
sub property of: has other person, family, or corporate body associated with an item
inverse of: P50210
definition: Relates an item to a person, family, or corporate body to whom an item is dedicated.

has custodial history of item
has unconstrained: P60176
lexical alias: custodialHistoryOfItem.en
name: custodialHistoryOfItem
status: Published
instruction number: 2.18
toolkit definition: A record of previous ownership or custodianship of an item.
toolkit label: custodial history of item
type: Property
domain: C10003
definition: Relates an item to a record of previous ownership or custodianship of an item.

is electronic reproduction of (item)
has unconstrained: P60469
lexical alias: electronicReproductionOfItem.en
name: electronicReproductionOfItem
status: Published
toolkit definition: An item in an analog format that is transferred to a digital format.
toolkit label: electronic reproduction of (item)
type: Property
domain: C10003
range: C10003
sub property of: is reproduction of (item)
inverse of: is electronic reproduction (item)
definition: Relates an item to an item in an analog format that is transferred to a digital format.

has note on item
has unconstrained: P60470
lexical alias: noteOnItem.en
name: noteOnItem
status: Published
instruction number: 2.21
toolkit definition: A note providing information on attributes of the item.
toolkit label: note on item
type: Property
domain: C10003
definition: Relates an item to a note providing information on attributes of the item.

is accompanied by (item)
has subproperty: is bound with
has subproperty: is on disc with (item)
has subproperty: is filmed with (item)
has unconstrained: P60196
lexical alias: accompaniedByItem.en
name: accompaniedByItem
status: Published
toolkit definition: An item brought together with another item after being issued.
toolkit label: accompanied by (item)
type: Property
domain: C10003
range: C10003
sub property of: has accompanying item relationship with
definition: Relates an item to an item brought together with another item after being issued.

is equivalent (item)
has subproperty: is reproduction of (item)
has subproperty: is reproduced as (item)
has unconstrained: P60191
lexical alias: equivalentItem.en
name: equivalentItem
status: Published
toolkit definition: An item that exemplifies a manifestation that embodies the same expression of a work.
toolkit label: equivalent (item)
type: Property
domain: C10003
range: C10003
sub property of: has equivalent item relationship with
definition: Relates an item to an item that exemplifies a manifestation that embodies the same expression of a work.

is bound with
has unconstrained: P60237
lexical alias: boundWith.en
name: boundWith
status: Published
toolkit definition: An item that has been bound within the same binding as the item being described.
toolkit label: bound with
type: Property
domain: C10003
range: C10003
sub property of: is accompanied by (item)
definition: Relates an item to an item that has been bound within the same binding as the item being described.

is container of (item)
has unconstrained: P60249
lexical alias: containerOfItem.en
name: containerOfItem
status: Published
toolkit definition: An item that is a discrete component of a larger item.
toolkit label: container of (item)
type: Property
domain: C10003
range: C10003
sub property of: has whole-part item relationship with
inverse of: is contained in (item)
definition: Relates an item to an item that is a discrete component of a larger item.

is on disc with (item)
has unconstrained: P60257
lexical alias: onDiscWithItem.en
name: onDiscWithItem
status: Published
toolkit definition: An item that is contained on the same disc with the item being described.
toolkit label: on disc with (item)
type: Property
domain: C10003
range: C10003
sub property of: is accompanied by (item)
definition: Relates an item to an item that is contained on the same disc with the item being described.

is filmed with (item)
has unconstrained: P60258
lexical alias: filmedWithItem.en
name: filmedWithItem
status: Published
toolkit definition: An item that is contained on the same microform with the item being described.
toolkit label: filmed with (item)
type: Property
domain: C10003
range: C10003
sub property of: is accompanied by (item)
definition: Relates an item to an item that is contained on the same microform with the item being described.

is reprint of (item)
has unconstrained: P60168
lexical alias: reprintOfItem.en
name: reprintOfItem
status: Published
toolkit definition: An item that exemplifies a printed manifestation that is used as the basis for a reissue of a manifestation.
toolkit label: reprint of (item)
type: Property
domain: C10003
range: C10003
sub property of: is reproduction of (item)
inverse of: is reprinted as (item)
definition: Relates an item to an item that exemplifies a printed manifestation that is used as the basis for a reissue of a manifestation.

is digital transfer of (item)
has unconstrained: P60287
lexical alias: digitalTransferOfItem.en
name: digitalTransferOfItem
status: Published
toolkit definition: An item in a digital format that is transferred to another digital format.
toolkit label: digital transfer of (item)
type: Property
domain: C10003
range: C10003
sub property of: is reproduction of (item)
inverse of: is digital transfer (item)
definition: Relates an item to an item in a digital format that is transferred to another digital format.

is reproduction of (item)
has subproperty: is electronic reproduction of (item)
has subproperty: is reprint of (item)
has subproperty: is digital transfer of (item)
has subproperty: is facsimile of (item)
has unconstrained: P60297
lexical alias: reproductionOfItem.en
name: reproductionOfItem
status: Published
toolkit definition: An item that is used as the basis for a reproduction.
toolkit label: reproduction of (item)
type: Property
domain: C10003
range: C10003
sub property of: is equivalent (item)
inverse of: is reproduced as (item)
definition: Relates an item to an item that is used as the basis for a reproduction.

is preservation facsimile of (item)
has unconstrained: P60299
lexical alias: preservationFacsimileOfItem.en
name: preservationFacsimileOfItem
status: Published
toolkit definition: An item that is used as the basis for an exact reproduction on preservation-quality media, such as acid-free permanent or archival paper.
toolkit label: preservation facsimile of (item)
type: Property
domain: C10003
range: C10003
sub property of: is facsimile of (item)
inverse of: is preservation facsimile (item)
definition: Relates an item to an item that is used as the basis for an exact reproduction on preservation-quality media, such as acid-free permanent or archival paper.

is facsimile of (item)
has subproperty: is preservation facsimile of (item)
has unconstrained: P60301
lexical alias: facsimileOfItem.en
name: facsimileOfItem
status: Published
toolkit definition: An item that is used as the basis for an exact reproduction.
toolkit label: facsimile of (item)
type: Property
domain: C10003
range: C10003
sub property of: is reproduction of (item)
inverse of: is facsimile (item)
definition: Relates an item to an item that is used as the basis for an exact reproduction.

has related item of item
has subproperty: has accompanying item relationship with
has subproperty: has equivalent item relationship with
has subproperty: has whole-part item relationship with
lexical alias: relatedItemOfItem.en
name: relatedItemOfItem
status: Published
instruction number: 28.1
toolkit definition: An item, represented by an identifier or a description, that is related to the item being described (e.g., an item used as the basis for a microform reproduction).
toolkit label: related item
type: Property
domain: C10003
range: C10003
definition: Relates an item to an item, represented by an identifier or a description, that is related to the item being described (e.g., an item used as the basis for a microform reproduction).

has restrictions on access to item
has unconstrained: P60496
lexical alias: restrictionsOnAccessToItem.en
name: restrictionsOnAccessToItem
status: Published
instruction number: 4.4
toolkit definition: Limitations placed on access to a resource.
toolkit label: restrictions on access
type: Property
domain: C10003
definition: Relates an item to limitations placed on access to an item.

has restrictions on use of item
has unconstrained: P60497
lexical alias: restrictionsOnUseOfItem.en
name: restrictionsOnUseOfItem
status: Published
instruction number: 4.5
toolkit definition: Limitations placed on uses such as reproduction, publication, exhibition, etc.
toolkit label: restrictions on use
type: Property
domain: C10003
definition: Relates an item to limitations placed on uses such as reproduction, publication, exhibition, etc.

has manifestation exemplified
lexical alias: manifestationExemplified.en
name: manifestationExemplified
status: Published
instruction number: 17.12
toolkit definition: The manifestation exemplified by an item.
toolkit label: manifestation exemplified
type: Property
domain: C10003
range: C10007
inverse of: P30103
definition: Relates an item to the manifestation exemplified by an item.

has immediate source of acquisition of item
has unconstrained: P60583
lexical alias: immediateSourceOfAcquisitionOfItem.en
name: immediateSourceOfAcquisitionOfItem
status: Published
instruction number: 2.19
toolkit definition: The source from which the agency directly acquired an item and the circumstances under which it was received.
toolkit label: immediate source of acquisition of item
type: Property
domain: C10003
definition: Relates an item to the source from which the agency directly acquired an item and the circumstances under which it was received.

has accompanying item relationship with
has subproperty: is accompanied by (item)
has unconstrained: P60709
lexical alias: accompanyingItemRelationship.en
name: accompanyingItemRelationship
status: Published
toolkit definition: An item that accompanies or is accompanied by the item.
toolkit label: accompanying item relationship
type: Property
domain: C10003
range: C10003
sub property of: has related item of item
definition: Relates an item to an item that accompanies or is accompanied by the item.

has equivalent item relationship with
has subproperty: is equivalent (item)
has unconstrained: P60712
lexical alias: equivalentItemRelationship.en
name: equivalentItemRelationship
status: Published
toolkit definition: An item that is equivalent to the item.
toolkit label: equivalent item relationship
type: Property
domain: C10003
range: C10003
sub property of: has related item of item
definition: Relates an item to an item that is equivalent to the item.

has whole-part item relationship with
has subproperty: is contained in (item)
has subproperty: is container of (item)
has unconstrained: P60714
lexical alias: wholePartItemRelationship.en
name: wholePartItemRelationship
status: Published
toolkit definition: An item that is contained in or contains the item.
toolkit label: whole-part item relationship
type: Property
domain: C10003
range: C10003
sub property of: has related item of item
definition: Relates an item to an item that is contained in or contains the item.

is reproduced as (item)
has subproperty: is digital transfer (item)
has subproperty: is electronic reproduction (item)
has subproperty: is facsimile (item)
has subproperty: is reprinted as (item)
has unconstrained: P60272
lexical alias: reproducedAsItem.en
name: reproducedAsItem
status: Published
toolkit definition: An item that reproduces another item.
toolkit label: reproduced as (item)
type: Property
domain: C10003
range: C10003
sub property of: is equivalent (item)
inverse of: is reproduction of (item)
definition: Relates an item to an item that reproduces another item.

is digital transfer (item)
has unconstrained: P60200
lexical alias: digitalTransferItem.en
name: digitalTransferItem
status: Published
toolkit definition: An item in a digital format that results from the transfer of an item in another digital format.
toolkit label: digital transfer (item)
type: Property
domain: C10003
range: C10003
sub property of: is reproduced as (item)
inverse of: is digital transfer of (item)
definition: Relates an item to an item in a digital format that results from the transfer of an item in another digital format.

is electronic reproduction (item)
has unconstrained: P60083
lexical alias: electronicReproductionItem.en
name: electronicReproductionItem
status: Published
toolkit definition: An item in a digital format that is the result of the transfer of an item in analog format.
toolkit label: electronic reproduction (item)
type: Property
domain: C10003
range: C10003
sub property of: is reproduced as (item)
inverse of: is electronic reproduction of (item)
definition: Relates an item to an item in a digital format that is the result of the transfer of an item in analog format.

is facsimile (item)
has subproperty: is preservation facsimile (item)
has unconstrained: P60217
lexical alias: facsimileItem.en
name: facsimileItem
status: Published
toolkit definition: An item that exactly reproduces an item.
toolkit label: facsimile (item)
type: Property
domain: C10003
range: C10003
sub property of: is reproduced as (item)
inverse of: is facsimile of (item)
definition: Relates an item to an item that exactly reproduces an item.

is preservation facsimile (item)
has unconstrained: P60179
lexical alias: preservationFacsimileItem.en
name: preservationFacsimileItem
status: Published
toolkit definition: An item that consists of an exact reproduction on preservation-quality media, such as acid-free permanent or archival paper.
toolkit label: preservation facsimile (item)
type: Property
domain: C10003
range: C10003
sub property of: is facsimile (item)
inverse of: is preservation facsimile of (item)
definition: Relates an item to an item that consists of an exact reproduction on preservation-quality media, such as acid-free permanent or archival paper.

is reprinted as (item)
has unconstrained: P60271
lexical alias: reprintedAsItem.en
name: reprintedAsItem
status: Published
toolkit definition: An item that is a reissue of an item that exemplifies another printed manifestation.
toolkit label: reprinted as (item)
type: Property
domain: C10003
range: C10003
sub property of: is reproduced as (item)
inverse of: is reprint of (item)
definition: Relates an item to an item that is a reissue of an item that exemplifies another printed manifestation.

is subject of (item)
has subproperty: is described in (item)
has unconstrained: P60806
lexical alias: subjectOfItem.en
name: subjectOfItem
status: Published
toolkit definition: A work that is about the item.
toolkit label: subject of (item)
type: Property
domain: C10003
range: C10001
sub property of: P10283
inverse of: P10260
definition: Relates an item to a work that is about the item.

is described in (item)
has subproperty: is analysed in (item)
has subproperty: is commentary in (item)
has subproperty: is critiqued in (item)
has subproperty: is evaluated in (item)
has subproperty: is reviewed in (item)
has unconstrained: P60215
lexical alias: describedInItem.en
name: describedInItem
status: Published
toolkit definition: A work that describes a described item.
toolkit label: described in (item)
type: Property
domain: C10003
range: C10001
sub property of: is subject of (item)
inverse of: P10265
definition: Relates an item to a work that describes a described item.

is analysed in (item)
has unconstrained: P60219
lexical alias: analysedInItem.en
name: analysedInItem
status: Published
toolkit definition: A work that examines the source item to identify its components and their relations.
toolkit label: analysed in (item)
type: Property
domain: C10003
range: C10001
sub property of: is described in (item)
inverse of: P10266
definition: Relates an item to a work that examines the source item to identify its components and their relations.

is commentary in (item)
has unconstrained: P60213
lexical alias: commentaryInItem.en
name: commentaryInItem
status: Published
toolkit definition: A work that contains a set of explanatory or critical notes on the described item.
toolkit label: commentary in (item)
type: Property
domain: C10003
range: C10001
sub property of: is described in (item)
inverse of: P10270
definition: Relates an item to a work that contains a set of explanatory or critical notes on the described item.

is critiqued in (item)
has unconstrained: P60212
lexical alias: critiquedInItem.en
name: critiquedInItem
status: Published
toolkit definition: A work that contains a critical evaluation of the described item.
toolkit label: critiqued in (item)
type: Property
domain: C10003
range: C10001
sub property of: is described in (item)
inverse of: P10269
definition: Relates an item to a work that contains a critical evaluation of the described item.

is evaluated in (item)
has unconstrained: P60218
lexical alias: evaluatedInItem.en
name: evaluatedInItem
status: Published
toolkit definition: A work that examines or judges the described item.
toolkit label: evaluated in (item)
type: Property
domain: C10003
range: C10001
sub property of: is described in (item)
inverse of: P10267
definition: Relates an item to a work that examines or judges the described item.

is reviewed in (item)
has unconstrained: P60211
lexical alias: reviewedInItem.en
name: reviewedInItem
status: Published
toolkit definition: A work that contains a brief evaluation of the described item.
toolkit label: reviewed in (item)
type: Property
domain: C10003
range: C10001
sub property of: is described in (item)
inverse of: P10268
definition: Relates an item to a work that contains a brief evaluation of the described item.