Earlier title proper (Manifestation)
type: Property
domain: Manifestation
sub property of: Title (Manifestation)
sub property of: Earlier title proper
name: earlierTitleProperManifestation
status: New-Proposed
definition: A title proper appearing on an earlier iteration of an integrating resource that differs from that on the current iteration.

Parallel place of distribution (Manifestation)
type: Property
domain: Manifestation
sub property of: Parallel place of distribution
name: parallelPlaceOfDistributionManifestation
status: New-Proposed
definition: A place of distribution in a language and/or script that differs from that recorded in the place of distribution element.

Academic degree
type: Property
sub property of: dissertationOrThesesInformationWork
has subproperty: Academic degree (Work)
name: academicDegree
status: New-Proposed
definition: A rank conferred as a guarantee of academic proficiency.

Dimensions of map, etc. (Manifestation)
type: Property
domain: Manifestation
sub property of: Dimensions (Manifestation)
sub property of: Dimensions of map, etc.
name: dimensionsOfMapEtcManifestation
status: New-Proposed
definition: The measurements of the face of a map, etc.

Dimensions of map, etc.
type: Property
sub property of: Dimensions
has subproperty: Dimensions of map, etc. (Item)
has subproperty: Dimensions of map, etc. (Manifestation)
name: dimensionsOfMapEtc
status: New-Proposed
definition: The measurements of the face of a map, etc.

Alternative Numeric and/or Alphabetic Designation of Last Issue or Part of Sequence (Manifestation)
type: Property
domain: Manifestation
sub property of: Numbering of serials (Manifestation)
sub property of: Alternative Numeric and/or Alphabetic Designation of Last Issue or Part of Sequence
name: alternativeNumericAndOrAlphabeticDesignationOfLastIssueOrPartOfSequenceManifestation
status: New-Proposed
definition: A second or subsequent system of numbering presented in numeric and/or alphabetic form on the last issue or part of a sequence of numbering for a serial.

Digital representation of cartographic content
type: Property
sub property of: Digital file characteristic
has subproperty: Digital representation of cartographic content (Manifestation)
name: digitalRepresentationOfCartographicContent
status: New-Proposed
definition: A set of technical details relating to the encoding of geospatial information in a cartographic resource.

Digital file characteristic
type: Property
has subproperty: Digital representation of cartographic content
has subproperty: Encoding format
has subproperty: Transmission speed
has subproperty: File type
has subproperty: Resolution
has subproperty: Digital file characteristic (Manifestation)
has subproperty: File size
name: digitalFileCharacteristic
status: New-Proposed
definition: A technical specification relating to the digital encoding of text, image, audio, video, and other types of data in a resource.

Epoch (Work)
type: Property
domain: Work
sub property of: Epoch
name: epochWork
status: New-Proposed
definition: An arbitrary moment in time to which measurements of position for a body or orientation for an orbit are referred.

Groove characteristic
type: Property
sub property of: Sound characteristic
has subproperty: Groove characteristic (Manifestation)
name: grooveCharacteristic
status: New-Proposed
definition: The groove width of an analog disc or the groove pitch of an analog cylinder.

Parallel place of distribution
type: Property
has subproperty: Parallel place of distribution (Manifestation)
name: parallelPlaceOfDistribution
status: New-Proposed
definition: A place of distribution in a language and/or script that differs from that recorded in the place of distribution element.

New-Proposed
type: Concept

Book format
type: Property
has subproperty: Book format (Manifestation)
name: bookFormat
status: New-Proposed
definition: The result of folding a printed sheet to form a gathering of leaves (e.g., a sheet folded once to form a folio, twice to form a quarto, three times to form an octavo, etc.).

Video characteristic
type: Property
has subproperty: Video characteristic (Manifestation)
has subproperty: Broadcast standard
has subproperty: Video format
name: videoCharacteristic
status: New-Proposed
definition: A technical specification relating to the encoding of video images in a resource.

Key title
type: Property
sub property of: Title
has subproperty: Key title (Manifestation)
name: keyTitle
status: New-Proposed
definition: The unique name assigned to a resource by an ISSN registration agency.

Publication statement
type: Property
has subproperty: Publication statement (Manifestation)
name: publicationStatement
status: New-Proposed
definition: A statement identifying the place or places of publication, publisher or publishers, and date or dates of publication of a resource.

Other title information (Manifestation)
type: Property
domain: Manifestation
sub property of: Title (Manifestation)
sub property of: Other title information
name: otherTitleInformationManifestation
status: New-Proposed
definition: Information that appears in conjunction with, and is subordinate to, the title proper of the resource.

Award
type: Property
has subproperty: Award (Expression)
name: award
status: New-Proposed
definition: A formal recognition of excellence, etc., for the content of a resource by an award- or prize-granting body.
scope note: Definition source: RDA 7.25.0.1.1

Series Statement Encoding Scheme
type: Class
subclass of: RDA Syntax Encoding Scheme
name: SeriesStatementEncodingScheme
status: New-Proposed
definition: This subclass has been created to define the Syntax Encoding Scheme for the RDA Series Statement composite string. The Series Statement is composed of an ordered, concatenated list of properties: - Title proper of series - Parallel title of series - Other title information of series - Parallel other title information of series - Statement of responsibility relating to series - Parallel statement of responsibility relating to series - ISSN of series - Numbering within series - Title proper of subseries - Parallel title of subseries - Other title information of subseries - Parallel other title information of subseries - Statement of responsibility relating to subseries - Parallel statement of responsibility relating to subseries - ISSN of subseries - Numbering within subseries.

Equipment or system requirement (Manifestation)
type: Property
domain: Manifestation
name: equipmentOrSystemRequirementManifestation
status: New-Proposed
definition: The equipment or system required for use, playback, etc., of an analog, digital, etc., resource.

Note on numbering of serials
type: Property
sub property of: Note
has subproperty: Note on numbering of serials (Manifestation)
name: noteOnNumberingOfSerials
status: New-Proposed
definition: A note providing information on the numbering of the first and/or last issue or part, on complex or irregular numbering (including numbering errors), or on the period covered by a volume, issue, part, etc.

Applied material
type: Property
has subproperty: Applied material (Manifestation)
has subproperty: Emulsion on microfilm and microfiche
name: appliedMaterial
status: New-Proposed
definition: A physical or chemical substance applied to a base material of a resource.
scope note: Definition source: RDA 3.7.0.1.1

Language of expression
type: Property
domain: Expression
name: languageOfExpression
status: New-Proposed
definition: A language in which a work is expressed.

Place of publication (Manifestation)
type: Property
domain: Manifestation
sub property of: Place of publication
name: placeOfPublicationManifestation
status: New-Proposed
definition: A place associated with the publication, release, or issuing of a resource.

Key
type: Property
has subproperty: Key (Work)
name: key
status: New-Proposed
definition: The set of pitch relationships that establishes the tonal centre, or principal tonal centre, for a musical work. Key is designated by its pitch name and its mode, when it is major or minor.
scope note: Definition from: 6.22.0.1.1

Base material (Manifestation)
type: Property
domain: Manifestation
sub property of: Base material
has subproperty: Base material for microfilm, microfiche, photographic film, and motion picture film (Manifestation)
name: baseMaterialManifestation
status: New-Proposed
definition: The underlying physical material of a resource.

Format of notated music (Expression)
type: Property
domain: Expression
sub property of: Format of notated music
name: formatOfNotatedMusicExpression
status: New-Proposed
definition: The musical or physical layout of the content of a resource that is presented in the form of musical notation.

Colour content
type: Property
has subproperty: Colour content (Expression)
has subproperty: Colour content of resource designed for persons with visual impairments
has subproperty: Colour of still image
has subproperty: Colour of three-dimensional form
has subproperty: Colour of moving images
name: colourContent
status: New-Proposed
definition: The presence of colour, tone, etc., in the content of a resource. Colour content is also the specific colours, tones, etc., (including black and white) present in the content of a resource.
scope note: Definition source: RDA 3.12.0.1.1

Item-specific carrier characteristic
type: Property
domain: Item
has subproperty: Item-specific carrier characteristic of early printed resources
name: item-specificCarrierCharacteristic
status: New-Proposed
definition: A characteristic that applies to the carrier or carriers of the specific item being described and is assumed not to apply to other items exemplifying the same manifestation.

Production method for manuscript
type: Property
sub property of: Production method
has subproperty: Production method for manuscript (Manifestation)
name: productionMethodForManuscript
status: New-Proposed
definition: The process used to produce an original manuscript or a copy.

Earlier title proper
type: Property
sub property of: Title
has subproperty: Earlier title proper (Manifestation)
name: earlierTitleProper
status: New-Proposed
definition: A title proper appearing on an earlier iteration of an integrating resource that differs from that on the current iteration.

Academic degree (Work)
type: Property
domain: Work
sub property of: Dissertation or thesis information (Work)
sub property of: Academic degree
name: academicDegreeWork
status: New-Proposed
definition: A rank conferred as a guarantee of academic proficiency.

Additional scale information
type: Property
sub property of: Scale
has subproperty: Additional scale information (Expression)
name: additionalScaleInformation
status: New-Proposed
definition: Supplemental information pertaining to scale such as a statement of comparative measures or limitation of the scale to particular parts of the content of a resource.

Coverage of the content (Work)
type: Property
domain: Work
sub property of: Coverage of the content
name: coverageOfTheContentWork
status: New-Proposed
definition: The chronological or geographic coverage of the content of a resource.

Date of distribution (Manifestation)
type: Property
domain: Manifestation
sub property of: Date of distribution
name: dateOfDistributionManifestation
status: New-Proposed
definition: A date associated with the distribution of a resource.

Publication Statement Encoding Scheme
type: Class
subclass of: RDA Syntax Encoding Scheme
name: PublicationStatementEncodingScheme
status: New-Proposed
definition: This subclass has been created to define the Syntax Encoding Scheme for the RDA Publication Statement composite string. The Publication Statement is composed of an ordered, concatenated list of properties: - Place of publication - Parallel place of publication - Publisher's name - Parallel publisher's name - Date of publication

Note on manufacture statement
type: Property
sub property of: Note
has subproperty: Note on manufacture statement (Manifestation)
name: noteOnManufactureStatement
status: New-Proposed
definition: A note providing details on place of manufacture, manufacturer, or date of manufacture, or information on changes in the place of manufacture, manufacturer, or manufacturer’s name.

Nature of the content (Work)
type: Property
domain: Work
sub property of: Nature of the content
name: natureOfTheContentWork
status: New-Proposed
definition: The specific character of the content of a resource (e.g., legal articles, interim report).

Colour of still image
type: Property
sub property of: Colour content
has subproperty: Colour of still image (Expression)
name: colourOfStillImage
status: New-Proposed
definition: The presence of colour, tone, etc., in a still image or images contained in a resource. Colour of still image is also the specific colours, tones, etc., (including black and white) present in a still image or images contained in a resource.

Numbering within series (Manifestation)
type: Property
domain: Manifestation
sub property of: Numbering within series
name: numberingWithinSeriesManifestation
status: New-Proposed
definition: A designation of the sequencing of a part or parts within a series. Numbering within series may include a numeral, a letter, any other character, or the combination of these with or without an accompanying caption (volume, number, etc.) and/or a chronological designation.

Variant title (Manifestation)
type: Property
domain: Manifestation
sub property of: Title (Manifestation)
sub property of: Variant title
name: variantTitleManifestation
status: New-Proposed
definition: A title associated with a resource that differs from a title recorded as the title proper, a parallel title proper, other title information, parallel other title information, earlier title proper, later title proper, key title, or abbreviated title.

Transmission speed (Manifestation)
type: Property
domain: Manifestation
sub property of: Digital file characteristic (Manifestation)
sub property of: Transmission speed
name: transmissionSpeedManifestation
status: New-Proposed
definition: The speed at which streaming audio or video is designed to play.

Carrier type
type: Property
has subproperty: Carrier type (Manifestation)
name: carrierType
status: New-Proposed
definition: A categorization reflecting the format of the storage medium and housing of a carrier in combination with the type of intermediation device required to view, play, run, etc., the content of a resource.
scope note: Definition source: RDA 3.3.0.1.1

Restrictions on use
type: Property
has subproperty: Restrictions on use (Manifestation)
name: restrictionsOnUse
status: New-Proposed
definition: Limitations placed on uses such as reproduction, publication, exhibition, etc.

Note on title (Manifestation)
type: Property
domain: Manifestation
sub property of: Note on manifestation or item (Manifestation)
sub property of: Note on title
name: noteOnTitleManifestation
status: New-Proposed
definition: A note providing information on the source from which a title was taken, the date the title was viewed, variations in titles, inaccuracies, deletions, etc., or other information relating to a title.

Designation of a named revision of an edition (Manifestation)
type: Property
domain: Manifestation
sub property of: Designation of a named revision of an edition
name: designationOfANamedRevisionOfAnEditionManifestation
status: New-Proposed
definition: A word, character, or group of words and/or characters, identifying a particular revision of a named edition.

Designation of edition
type: Property
has subproperty: Designation of edition (Manifestation)
name: designationOfEdition
status: New-Proposed
definition: A word, character, or group of words and/or characters, identifying the edition to which a resource belongs.

Producer's name (Manifestation)
type: Property
domain: Manifestation
sub property of: Producer's name
name: producersNameManifestation
status: New-Proposed
definition: The name of a person, family, or corporate body responsible for inscribing, fabricating, constructing, etc., a resource in an unpublished form.

Numbering within series
type: Property
has subproperty: Numbering within series (Manifestation)
name: numberingWithinSeries
status: New-Proposed
definition: A designation of the sequencing of a part or parts within a series. Numbering within series may include a numeral, a letter, any other character, or the combination of these with or without an accompanying caption (volume, number, etc.) and/or a chronological designation.

Configuration of playback channels
type: Property
sub property of: Sound characteristic
has subproperty: Configuration of playback channels (Manifestation)
name: configurationOfPlaybackChannels
status: New-Proposed
definition: The number of sound channels used to make a recording (e.g., one channel for a monophonic recording, two channels for a stereophonic recording).

Date of publication
type: Property
has subproperty: Date of publication (Manifestation)
name: dateOfPublication
status: New-Proposed
definition: A date associated with the publication, release, or issuing of a resource.

Restrictions on use (Manifestation)
type: Property
domain: Manifestation
sub property of: Restrictions on use
name: restrictionsOnUseManifestation
status: New-Proposed
definition: Limitations placed on uses such as reproduction, publication, exhibition, etc.

Layout of cartographic images (Manifestation)
type: Property
domain: Manifestation
sub property of: Layout (Manifestation)
sub property of: Layout of cartographic images
name: layoutOfCartographicImagesManifestation
status: New-Proposed
definition: The arrangement of a cartographic image or images in a resource consisting of one or more sheets.

Note on expression (Expression)
type: Property
domain: Expression
sub property of: Note
name: noteExpression
status: New-Proposed
definition: An annotation providing additional information relating to content recorded as an expression attribute.

Date of distribution
type: Property
has subproperty: Date of distribution (Manifestation)
name: dateOfDistribution
status: New-Proposed
definition: A date associated with the distribution of a resource.

Recording medium (Manifestation)
type: Property
domain: Manifestation
sub property of: Sound characteristic (Manifestation)
sub property of: Recording medium
name: recordingMediumManifestation
status: New-Proposed
definition: The type of medium used to record sound on an audio carrier (e.g., magnetic, optical).

Projection characteristic of motion picture film
type: Property
has subproperty: Projection characteristic of motion picture film (Manifestation)
has subproperty: Projection speed
has subproperty: Presentation format
name: projectionCharacteristicOfMotionPictureFilm
status: New-Proposed

Alternative Chronological Designation of Last Issue or Part of Sequence
type: Property
sub property of: Numbering of serials
has subproperty: Alternative Chronological Designation of Last Issue or Part of Sequence (Manifestation)
name: alternativeChronologicalDesignationOfLastIssueOrPartOfSequence
status: New-Proposed
definition: A second or subsequent system of numbering presented in the form of a date (e.g., a year; year and month; month, day, and year) on the last issue or part of a sequence of numbering for a serial.

Year degree granted
type: Property
has subproperty: Year degree granted (Work)
name: yearDegreeGranted
status: New-Proposed
definition: The calendar year in which a granting institution or faculty conferred an academic degree on a candidate.

Later title proper (Manifestation)
type: Property
domain: Manifestation
sub property of: Title (Manifestation)
name: laterTitleProperManifestation
status: New-Proposed
definition: A title proper appearing on a later issue or part of a multipart monograph or serial that differs from that on the first or earliest issue or part.

Extent of three-dimensional form (Item)
type: Property
domain: Item
sub property of: Extent (Item)
sub property of: Extent of three-dimensional form
name: extentOfThreeDimensionalFormItem
status: New-Proposed
definition: The number and type of units and/or subunits making up a resource consisting of one or more three-dimensional forms.

Generation of audio recording (Manifestation)
type: Property
domain: Manifestation
sub property of: Generation (Manifestation)
sub property of: Generation of audio recording
name: generationOfAudioRecordingManifestation
status: New-Proposed
definition: The relationship between an original carrier of an audio recording and the carrier of a reproduction made from the original (e.g., a tape duplication master, a test pressing).

File size (Manifestation)
type: Property
domain: Manifestation
sub property of: Digital file characteristic (Manifestation)
sub property of: File size
name: fileSizeManifestation
status: New-Proposed
definition: The number of bytes in a digital file.

Manufacture statement
type: Property
has subproperty: Manufacture statement (Manifestation)
name: manufactureStatement
status: New-Proposed
definition: A statement identifying the place or places of manufacture, manufacturer or manufacturers, and date or dates of manufacture of a resource.

Note on statement of responsibility
type: Property
sub property of: Note
has subproperty: Note on statement of responsibility (Manifestation)
name: noteOnStatementOfResponsibility
status: New-Proposed
definition: A note providing information on a person, family, or corporate body not named in a statement of responsibility to whom responsibility for the intellectual or artistic content of the resource has been attributed, on variant forms of names appearing in the resource, on changes in statements of responsibility, or other information relating to a statement of responsibility.

Signatory to a treaty, etc. (Work)
type: Property
domain: Work
sub property of: Signatory to a treaty, etc.
name: signatoryToATreatyEtcWork
status: New-Proposed
definition: A government or other party that has formally signed a treaty, etc., as an adherent to its terms and conditions.

Place And Date of Capture Encoding Scheme
type: Class
subclass of: RDA Syntax Encoding Scheme
name: PlaceAndDateOfCaptureEncodingScheme
status: New-Proposed
definition: This encoding scheme has been created to define the Syntax Encoding Scheme for the RDA Place and date of capture composite string. Place and date of capture is composed of an ordered, concatenated list of properties: - Place of capture -- Date of capture.

Extent of notated music
type: Property
sub property of: Extent
has subproperty: Extent of notated music (Item)
has subproperty: Extent of notated music (Manifestation)
name: extentOfNotatedMusic
status: New-Proposed
definition: The number and type of units and/or subunits making up a resource consisting of notated music, with or without accompanying text and/or illustrations.

Dissertation or thesis information (Work)
type: Property
domain: Work
range: Dissertation Or Thesis Information Encoding Scheme
sub property of: Dissertation or thesis information
has subproperty: Academic degree (Work)
has subproperty: Academic degree
name: dissertationOrThesisInformationWork
status: New-Proposed
definition: Information relating to a work presented as part of the formal requirements for an academic degree

Resolution (Manifestation)
type: Property
domain: Manifestation
sub property of: Digital file characteristic (Manifestation)
sub property of: Resolution
name: resolutionManifestation
status: New-Proposed
definition: The clarity or fineness of detail in a digital image, expressed by the measurement of the image in pixels, etc.

Parallel manufacturer's name
type: Property
has subproperty: Parallel manufacturer's name (Manifestation)
name: parallelManufacturersName
status: New-Proposed
definition: A manufacturer’s name in a language and/or script that differs from that recorded in the manufacturer’s name element.

Performer, narrator, and/or presenter (Expression)
type: Property
domain: Expression
sub property of: Performer, narrator, and/or presenter
name: performerNarratorAndOrPresenterExpression
status: New-Proposed
definition: A person, family, or corporate body responsible for performing, narrating, and/or presenting a work.

Extent of notated music (Manifestation)
type: Property
domain: Manifestation
sub property of: Extent (Manifestation)
sub property of: Extent of notated music
name: extentOfNotatedMusicManifestation
status: New-Proposed
definition: The number and type of units and/or subunits making up a resource consisting of notated music, with or without accompanying text and/or illustrations.

Note on dimensions of manifestation
type: Property
domain: Manifestation
sub property of: Note on manifestation or item (Manifestation)
sub property of: Note
name: noteOnDimensionsOfManifestation
status: New-Proposed
definition: A note providing information about the dimensions of a manifestation not recorded formally as part of the dimensions element.

Title of the work
type: Property
domain: Work
sub property of: Title
has subproperty: Preferred title for the work
has subproperty: Variant title for the work
name: titleOfTheWork
status: New-Proposed
definition: A word, character, or group of words and/or characters by which a work is known.

Dissertation or thesis information
type: Property
has subproperty: Dissertation or thesis information (Work)
name: dissertationOrThesisInformation
status: New-Proposed

Edition statement
type: Property
has subproperty: Edition statement (Manifestation)
name: editionStatement
status: New-Proposed
definition: A statement identifying the edition to which a resource belongs.

Projection of cartographic content
type: Property
has subproperty: Projection of cartographic content (Expression)
name: projectionOfCartographicContent
status: New-Proposed
definition: The method or system used to represent the surface of the Earth or of a celestial sphere on a plane.

Parallel statement of responsibility relating to series
type: Property
has subproperty: Parallel statement of responsibility relating to series (Manifestation)
name: parallelStatementOfResponsibilityRelatingToSeries
status: New-Proposed
definition: A statement relating to series in a language and/or script that differs from that recorded in the statement of responsibility relating to series element.

Statement of responsibility relating to the edition (Manifestation)
type: Property
domain: Manifestation
sub property of: Statement of responsibility relating to the edition
name: StatementOfResponsibilityRelatingToEditionManifestation
status: New-Proposed
definition: A statement relating to the identification of any persons, families, or corporate bodies responsible for the edition being described but not to all editions.

Alternative Chronological Designation of Last Issue or Part of Sequence (Manifestation)
type: Property
domain: Manifestation
sub property of: Numbering of serials (Manifestation)
sub property of: Alternative Chronological Designation of Last Issue or Part of Sequence
name: alternativeChronologicalDesignationOfLastIssueOrPartOfSequenceManifestation
status: New-Proposed
definition: A second or subsequent system of numbering presented in the form of a date (e.g., a year; year and month; month, day, and year) on the last issue or part of a sequence of numbering for a serial.

Equinox
type: Property
has subproperty: Equinox (Work)
name: equinox
status: New-Proposed
definition: One of two points of intersection of the ecliptic and the celestial equator, occupied by the sun when its declination is 0°.

Emulsion on microfilm and microfiche (Manifestation)
type: Property
domain: Manifestation
sub property of: Applied material (Manifestation)
sub property of: Emulsion on microfilm and microfiche
name: emulsionOnMicrofilmAndMicroficheManifestation
status: New-Proposed
definition: A suspension of light-sensitive chemicals used as a coating on a microfilm or microfiche (e.g., silver halide).

Terms of availability
type: Property
has subproperty: Terms of availability (Manifestation)
name: termsOfAvailability
status: New-Proposed
definition: The conditions under which the publisher or distributor will normally supply a resource, or the price of a resource.

Presentation format (Manifestation)
type: Property
domain: Manifestation
sub property of: Projection characteristic of motion picture film (Manifestation)
sub property of: Presentation format
name: presentationFormatManifestation
status: New-Proposed
definition: The format used in the production of a projected image (e.g., Cinerama, IMAX).

Other title information
type: Property
sub property of: Title
has subproperty: Other title information (Manifestation)
name: otherTitleInformation
status: New-Proposed
definition: Information that appears in conjunction with, and is subordinate to, the title proper of the resource.

Manufacturer's name
type: Property
has subproperty: Manufacturer's name (Manifestation)
name: manufacturersName
status: New-Proposed
definition: The name of a person, family, or corporate body responsible for printing, duplicating, casting, etc., a resource in a published form.

Production method for tactile resource
type: Property
sub property of: Production method
has subproperty: Production method for tactile resource (Manifestation)
name: productionMethodForTactileResource
status: New-Proposed
definition: The process used to produce a tactile resource (e.g., embossing, thermoform).

Parallel other title information of subseries (Manifestation)
type: Property
domain: Manifestation
sub property of: Parallel other title information of subseries
name: parallelOtherTitleInformationOfSubseriesManifestation
status: New-Proposed
definition: Other title information of a subseries in a language and/or script that differs from that recorded in the other title information of subseries element.

Note on distribution statement
type: Property
sub property of: Note
has subproperty: Note on distribution statement (Manifestation)
name: noteOnDistributionStatement
status: New-Proposed
definition: A note providing details on place of distribution, distributor, or date of distribution, or information on changes in the place of distribution, distributor, or distributor’s name.

Chronological designation of last issue or part of sequence
type: Property
sub property of: Numbering of serials
has subproperty: Chronological designation of last issue or part of sequence (Manifestation)
name: chronologicalDesignationOfLastIssueOrPartOfSequence
status: New-Proposed
definition: Numbering presented in the form of a date (e.g., a year; year and month; month, day, and year) on the last issue or part of a sequence of numbering for a serial.

Note on frequency (Manifestation)
type: Property
domain: Manifestation
sub property of: Note on manifestation or item (Manifestation)
sub property of: Note on frequency
name: noteOnFrequencyManifestation
status: New-Proposed
definition: A note providing details on the currency of the contents, on the frequency of release of issues or parts of a serial or the frequency of updates to an integrating resource, or on changes in frequency.

Illustrative content
type: Property
has subproperty: Illustrative content (Expression)
name: illustrativeContent
status: New-Proposed
definition: Content designed to illustrate the primary content of a resource.
scope note: Definition source: RDA 7.12.0.1.1

File size
type: Property
sub property of: Digital file characteristic
has subproperty: File size (Manifestation)
name: fileSize
status: New-Proposed
definition: The number of bytes in a digital file.

Generation (Manifestation)
type: Property
domain: Manifestation
sub property of: Generation
has subproperty: Generation of videotape (Manifestation)
has subproperty: Generation of audio recording (Manifestation)
has subproperty: Generation of motion picture film (Manifestation)
has subproperty: Generation of microform (Manifestation)
has subproperty: Generation of digital resource (Manifestation)
name: generationManifestation
status: New-Proposed
definition: The relationship between an original carrier and the carrier of a reproduction made from the original (e.g., a first generation camera master, a second generation printing master).

Note on distribution statement (Manifestation)
type: Property
domain: Manifestation
sub property of: Note on manifestation or item (Manifestation)
sub property of: Note on distribution statement
name: noteOnDistributionStatementManifestation
status: New-Proposed
definition: A note providing details on place of distribution, distributor, or date of distribution, or information on changes in the place of distribution, distributor, or distributor’s name.

Manufacture Statement Encoding Scheme
type: Class
subclass of: RDA Syntax Encoding Scheme
name: ManufactureStatementEncodingScheme
status: New-Proposed
definition: This subclass has been created to define the Syntax Encoding Scheme for the RDA Manufacture Statement composite string. The Manufacture Statement is composed of an ordered, concatenated list of properties: - Place of manufacture - Parallel place of manufacture - Manufacturer's name - Parallel manufacturer's name - Date of manufacture.

Place of distribution
type: Property
has subproperty: Place of distribution (Manifestation)
name: placeOfDistribution
status: New-Proposed
definition: A place associated with the distribution of a resource.

Layout of cartographic images
type: Property
sub property of: Layout
has subproperty: Layout of cartographic images (Manifestation)
name: layoutOfCartographicImages
status: New-Proposed
definition: The arrangement of a cartographic image or images in a resource consisting of one or more sheets.

Digital representation of cartographic content (Manifestation)
type: Property
domain: Manifestation
sub property of: Digital file characteristic (Manifestation)
sub property of: Digital representation of cartographic content
name: digitalRepresentationOfCartographicContentManifestation
status: New-Proposed
definition: A set of technical details relating to the encoding of geospatial information in a cartographic resource.

Parallel statement of responsibility relating to title proper
type: Property
sub property of: Statement of responsibility
has subproperty: Parallel statement of responsibility relating to title proper (Manifestation)
name: parallelStatementOfResponsibilityRelatingToTitleProper
status: New-Proposed
definition: A statement of responsibility relating to title proper in a language and/or script that differs from that recorded in the statement of responsibility relating to title proper element.

Playing speed (Manifestation)
type: Property
domain: Manifestation
sub property of: Sound characteristic (Manifestation)
sub property of: Playing speed
name: playingSpeedManifestation
status: New-Proposed
definition: The speed at which an audio carrier must be operated to produce the sound intended.

System of organization (Work)
type: Property
domain: Work
sub property of: System of organization
name: systemOfOrganizationWork
status: New-Proposed
definition: A system of arranging materials in an archival resource or a collection.

Date of production
type: Property
has subproperty: Date of production (Manifestation)
name: dateOfProduction
status: New-Proposed
definition: A date associated with the inscription, fabrication, construction, etc., of a resource in an unpublished form.
scope note: Definition source: RDA 2.7.5.1.1

Other distinguishing characteristic of the work
type: Property
domain: Work
name: otherDistinguishingCharacteristicOfTheWork
status: New-Proposed
definition: A characteristic other than form of work, date of work, or place of origin of the work that serves to differentiate a work from another work with the same title or from the name of a person, family, or corporate body.

Media type (Manifestation)
type: Property
domain: Manifestation
sub property of: Media type
name: mediaTypeManifestation
status: New-Proposed
definition: A categorization reflecting the general type of intermediation device required to view, play, run, etc., the content of a resource.

Form of tactile notation (Expression)
type: Property
domain: Expression
sub property of: Form of notation (Expression)
sub property of: Form of tactile notation
name: formOfTactileNotationExpression
status: New-Proposed
definition: A set of characters and/or symbols used to express the content of a resource in a form that can be perceived through touch.

Other title information of subseries
type: Property
has subproperty: Other title information of subseries (Manifestation)
name: otherTitleInformationOfSubseries
status: New-Proposed
definition: Information that appears in conjunction with, and is subordinate to, the title proper of a subseries.

Parallel designation of edition
type: Property
has subproperty: Parallel designation of edition (Manifestation)
name: parallelDesignationOfEdition
status: New-Proposed
definition: A designation of edition in a language and/or script that differs from that recorded in the designation of edition element.

Vertical scale of cartographic content (Expression)
type: Property
domain: Expression
sub property of: Scale (Expression)
sub property of: Vertical scale of cartographic content
name: verticalScaleCartographicContentExpression
status: New-Proposed
definition: The scale of elevation or vertical dimension of the cartographic content of a resource.

Statement of responsibility relating to title proper (Manifestation)
type: Property
domain: Manifestation
sub property of: Statement of responsibility relating to title proper
name: statementOfResponsibilityRelatingToTitleProperManifestation
status: New-Proposed
definition: A statement associated with the title proper of a resource that relates to the identification and/or function of any persons, families, or corporate bodies responsible for the creation of, or contributing to the realization of, the intellectual or artistic content of the resource.

Form of notation
type: Property
has subproperty: Form of musical notation (Expression)
has subproperty: Form of tactile notation
has subproperty: Script
has subproperty: Form of notation (Expression)
has subproperty: Form of musical notation
has subproperty: Form of notated movement (Expression)
has subproperty: Form of notated movement
name: formOfNotation
status: New-Proposed
definition: A set of characters and/or symbols used to express the content of a resource.
scope note: Definition source: RDA 7.11.0.1.1

Tape configuration (Manifestation)
type: Property
domain: Manifestation
sub property of: Sound characteristic (Manifestation)
sub property of: Tape configuration
name: tapeConfigurationManifestation
status: New-Proposed
definition: The number of tracks on an audiotape.

Intended audience (Work)
type: Property
domain: Work
sub property of: Intended audience
name: intendedAudienceWork
status: New-Proposed
definition: The class of user for which the content of a resource is intended, or for whom the content is considered suitable, as defined by age group (e.g., children, young adults, adults, etc.), educational level (e.g., primary, secondary, etc.), type of disability, or other categorization.

Note on title
type: Property
sub property of: Note
has subproperty: Note on title (Manifestation)
name: noteOnTitle
status: New-Proposed
definition: A note providing information on the source from which a title was taken, the date the title was viewed, variations in titles, inaccuracies, deletions, etc., or other information relating to a title.

Title proper of series (Manifestation)
type: Property
domain: Manifestation
sub property of: Title proper of series
name: titleProperOfSeriesManifestation
status: New-Proposed
definition: The chief name of a series (i.e., the title normally used when citing the series).

Note on frequency
type: Property
sub property of: Note
has subproperty: Note on frequency (Manifestation)
name: noteOnFrequency
status: New-Proposed
definition: A note providing details on the currency of the contents, on the frequency of release of issues or parts of a serial or the frequency of updates to an integrating resource, or on changes in frequency.

Parallel publisher's name
type: Property
has subproperty: Parallel publisher's name (Manifestation)
name: parallelPublishersName
status: New-Proposed
definition: A publisher’s name in a language and/or script that differs from that recorded in the publisher’s name element.

Regional encoding (Manifestation)
type: Property
domain: Manifestation
sub property of: Digital file characteristic (Manifestation)
sub property of: Regional encoding
name: regionalEncodingManifestation
status: New-Proposed
definition: A code identifying the region of the world for which a videodisc has been encoded and preventing the disc from being played on a player sold in a different region.

Special playback characteristic (Manifestation)
type: Property
domain: Manifestation
sub property of: Sound characteristic (Manifestation)
sub property of: Special playback characteristic
name: specialPlaybackCharacteristicManifestation
status: New-Proposed
definition: An equalization system, noise reduction system, etc., used in making an audio recording.

Note on changes in content characteristics (Expression)
type: Property
domain: Expression
sub property of: Note on changes in content characteristics
name: noteonChangesinContentCharacteristicsExpression
status: New-Proposed
definition: A note on changes in content characteristics that occur in subsequent issues or parts of a resource issued in successive parts or between iterations of an integrating resource.

Note
type: Property
has subproperty: Note on dimensions of item
has subproperty: Note on manifestation or item (Manifestation)
has subproperty: Note on changes in content characteristics
has subproperty: Note on manifestation or item (Item)
has subproperty: Note on extent of item
has subproperty: Note on title
has subproperty: Note on publication statement
has subproperty: Note on expression (Expression)
has subproperty: Note on dimensions of manifestation
has subproperty: Note on copyright date
has subproperty: Note on series statement
has subproperty: Note on distribution statement
has subproperty: Note on issue, part, or iteration used as the basis for identification of the resource
has subproperty: Note on extent of manifestation
has subproperty: Note on statement of responsibility
has subproperty: Note on changes in carrier characteristics
has subproperty: Note on manufacture statement
has subproperty: Note on frequency
has subproperty: Note on production statement
has subproperty: Note on numbering of serials
has subproperty: Note on edition statement
name: note
status: New-Proposed
definition: An annotation providing additional information relating to data recorded in another element.

Vertical scale of cartographic content
type: Property
sub property of: Scale
has subproperty: Vertical scale of cartographic content (Expression)
name: verticalScaleCartographicContent
status: New-Proposed
definition: The scale of elevation or vertical dimension of the cartographic content of a resource.

Sound content (Expression)
type: Property
domain: Expression
sub property of: Sound content
name: soundContentExpression
status: New-Proposed
definition: The presence of sound in a resource other than one that consists primarily of recorded sound.

Abbreviated title
type: Property
sub property of: Title
has subproperty: Abbreviated title (Manifestatiion)
name: abbreviatedTitle
status: New-Proposed
definition: A title that has been abbreviated for purposes of indexing or identification.

Production method
type: Property
has subproperty: Production method (Manifestation)
has subproperty: Production method for manuscript
has subproperty: Production method for tactile resource
name: productionMethod
status: New-Proposed
definition: The process used to produce a resource.
scope note: Definition source: RDA 2.3.0.1.1

Item-specific carrier characteristic of early printed resources
type: Property
comment: Includes rubrication, illumination, and other hand colouring, manuscript additions, and binding.
domain: Item
sub property of: Item-specific carrier characteristic
name: item-specificCarrierCharacteristicOfEarlyPrintedResources
status: New-Proposed
definition: A characteristic that applies to the carrier or carriers of the specific early printed item being described and is assumed not to apply to other items exemplifying the same manifestation.

Parallel place of manufacture (Manifestation)
type: Property
domain: Manifestation
sub property of: Parallel place of manufacture
name: parallelPlaceOfManufactureManifestation
status: New-Proposed
definition: A place of manufacture in a language and/or script that differs from that recorded in the place of manufacture element.

Media type
type: Property
has subproperty: Media type (Manifestation)
name: mediaType
status: New-Proposed
definition: A categorization reflecting the general type of intermediation device required to view, play, run, etc., the content of a resource.
scope note: Definition source: RDA 3.2.0.1.1

Accessibility content (Expression)
type: Property
domain: Expression
sub property of: Accessibility content
name: accessibilityContentExpression
status: New-Proposed
definition: Content that assists those with a sensory impairment in the greater understanding of content which their impairment prevents them fully seeing or hearing.

Numeric designation of a musical work
type: Property
domain: Work
name: numericDesignationOfAMusicalWork
status: New-Proposed
definition: A serial number, opus number, or thematic index number assigned to a musical work by a composer, publisher, or a musicologist.
scope note: Definition from: 6.21.0.1.1

Statement of responsibility relating to title proper
type: Property
has subproperty: Statement of responsibility relating to title proper (Manifestation)
name: statementOfResponsibilityRelatingToTitleProper
status: New-Proposed
definition: A statement associated with the title proper of a resource that relates to the identification and/or function of any persons, families, or corporate bodies responsible for the creation of, or contributing to the realization of, the intellectual or artistic content of the resource.

Statement of responsibility
type: Property
has subproperty: Parallel statement of responsibility relating to title proper
has subproperty: Statement of responsibility (Manifestation)
name: statementOfResponsibility
status: New-Proposed
definition: A statement relating to the identification and/or function of any persons, families, or corporate bodies responsible for the creation of, or contributing to the realization of, the intellectual or artistic content of a resource.

Copyright date
type: Property
has subproperty: Copyright date (Manifestation)
name: copyrightDate
status: New-Proposed
definition: A date associated with a claim of protection under copyright or a similar regime.
scope note: Definition source: RDA 2.10.0.1.1

Additional scale information (Expression)
type: Property
domain: Expression
sub property of: Scale (Expression)
sub property of: Additional scale information
name: additionalScaleInformationExpression
status: New-Proposed
definition: Supplemental information pertaining to scale such as a statement of comparative measures or limitation of the scale to particular parts of the content of a resource.

Parallel designation of a named revision of an edition
type: Property
has subproperty: Parallel designation of a named revision of an edition (Manifestation)
name: parallelDesignationOfANamedRevisionOfAnEdition
status: New-Proposed
definition: A designation of a named revision of an edition in a language and/or script that differs from that recorded in the designation of a named revision of an edition element.

Chronological designation of first issue or part of sequence (Manifestation)
type: Property
domain: Manifestation
sub property of: Numbering of serials (Manifestation)
sub property of: Chronological designation of first issue or part of sequence
name: chronologicalDesignationOfFirstIssueOrPartOfSequenceManifestation
status: New-Proposed
definition: Numbering presented in the form of a date (e.g., a year; year and month; month, day, and year) on the first issue or part of a sequence of numbering for a serial.

Extent of notated music (Item)
type: Property
domain: Item
sub property of: Extent of notated music
name: extentOfNotatedMusicItem
status: New-Proposed
definition: The number and type of units and/or subunits making up a resource consisting of notated music, with or without accompanying text and/or illustrations.

Layout
type: Property
comment: Associated with the FRBR Manifestation entity.
has subproperty: Layout of tactile text
has subproperty: Layout of cartographic images
has subproperty: Layout (Manifestation)
has subproperty: Layout of tactile musical notation
name: layout
status: New-Proposed
definition: The arrangement of text, images, etc., in a resource.
scope note: Definition source: RDA 3.11.0.1.1

Track configuration
type: Property
sub property of: Sound characteristic
has subproperty: Track configuration (Manifestation)
name: trackConfiguration
status: New-Proposed
definition: The configuration of the audio track on a sound-track film (e.g., centre track).

File type (Manifestation)
type: Property
domain: Manifestation
sub property of: Digital file characteristic (Manifestation)
sub property of: File type
name: fileTypeManifestation
status: New-Proposed
definition: A general type of data content encoded in a computer file.

Medium of performance
type: Property
has subproperty: Medium of performance (Work)
name: mediumOfPerformance
status: New-Proposed

Layout of tactile musical notation (Manifestation)
type: Property
domain: Manifestation
sub property of: Layout (Manifestation)
sub property of: Layout of tactile musical notation
name: layoutOfTactileMusicalNotationManifestation
status: New-Proposed
definition: The arrangement of tactile musical notation in a resource (e.g., bar by bar, line by line).

Production statement (Manifestation)
type: Property
domain: Manifestation
range: Production Statement Encoding Scheme
sub property of: Production statement
name: productionStatementManifestation
status: New-Proposed
definition: A statement identifying the place or places of production, producer or producers, and date or dates of production of a resource in an unpublished form.

Video format (Manifestation)
type: Property
domain: Manifestation
sub property of: Video characteristic (Manifestation)
sub property of: Video format
name: videoFormatManifestation
status: New-Proposed
definition: A standard, etc., used to encode the analog video content of a resource.

Resolution
type: Property
sub property of: Digital file characteristic
has subproperty: Resolution (Manifestation)
name: resolution
status: New-Proposed
definition: The clarity or fineness of detail in a digital image, expressed by the measurement of the image in pixels, etc.

Numbering within subseries
type: Property
has subproperty: Numbering within subseries (Manifestation)
name: numberingWithinSubseries
status: New-Proposed
definition: A designation of the sequencing of a part or parts within a subseries. Numbering within series may include a numeral, a letter, any other character, or the combination of these with or without an accompanying caption (volume, number, etc.) and/or a chronological designation.

Epoch
type: Property
has subproperty: Epoch (Work)
name: epoch
status: New-Proposed
definition: An arbitrary moment in time to which measurements of position for a body or orientation for an orbit are referred.

Parallel title proper
type: Property
sub property of: Title
has subproperty: Parallel title proper (Manifestation)
name: parallelTitleProper
status: New-Proposed
definition: The title proper in another language and/or script.

Book format (Manifestation)
type: Property
domain: Manifestation
sub property of: Book format
name: bookFormatManifestation
status: New-Proposed
definition: The result of folding a printed sheet to form a gathering of leaves (e.g., a sheet folded once to form a folio, twice to form a quarto, three times to form an octavo, etc.).

Scale of still image or three-dimensional form
type: Property
sub property of: Scale
has subproperty: Scale of still image or three-dimensional form (Expression)
name: scaleOfStillImageOrThree-dimensionalForm
status: New-Proposed
definition: The ratio of the dimensions of a still image or three-dimensional form contained or embodied in a resource to the dimensions of the entity it represents.

Dimensions of still image (Item)
type: Property
domain: Item
sub property of: Dimensions (Item)
sub property of: Dimensions of still image
name: dimensionsOfStillImageItem
status: New-Proposed
definition: The measurements of the pictorial area of a still image.

Cataloguer's note
type: Property
name: cataloguersNote
status: New-Proposed
definition: An annotation that might be helpful to those using or revising the authorized access point representing an entity or relationship data, or creating an authorized access point representing a related entity.

Type of recording
type: Property
sub property of: Sound characteristic
has subproperty: Type of recording (Manifestation)
name: typeOfRecordingAnalogDigital
status: New-Proposed
definition: The method used to encode audio content for playback (i.e., analog or digital).

Publisher's number for music
type: Property
comment: See also Plate number for music.
sub property of: Identifier for the manifestation
has subproperty: Publisher's number for music (Manifestation)
name: publishersNumberForMusic
status: New-Proposed
definition: A numbering designation assigned to a resource by a music publisher, appearing normally only on the title page, the cover, and/or the first page of music.
scope note: Definition source: RDA 2.14.1.1.1

Alternative Numeric and/or Alphabetic Designation of First Issue or Part of Sequence (Manifestation)
type: Property
domain: Manifestation
sub property of: Numbering of serials (Manifestation)
sub property of: Alternative Numeric and/or Alphabetic Designation of First Issue or Part of Sequence
name: alternativeNumericAndOrAlphabeticDesignationOfFirstIssueOrPartOfSequenceManifestation
status: New-Proposed
definition: A second or subsequent system of numbering presented in numeric and/or alphabetic form on the first issue or part of a sequence of numbering for a serial.

Alternative Numeric and/or Alphabetic Designation of First Issue or Part of Sequence
type: Property
sub property of: Numbering of serials
has subproperty: Alternative Numeric and/or Alphabetic Designation of First Issue or Part of Sequence (Manifestation)
name: alternativeNumericAndOrAlphabeticDesignationOfFirstIssueOrPartOfSequence
status: New-Proposed
definition: A second or subsequent system of numbering presented in numeric and/or alphabetic form on the first issue or part of a sequence of numbering for a serial.

Parallel designation of a named revision of an edition (Manifestation)
type: Property
domain: Manifestation
sub property of: Parallel designation of a named revision of an edition
name: parallelDesignationOfANamedRevisionOfAnEditionManifestation
status: New-Proposed
definition: A designation of a named revision of an edition in a language and/or script that differs from that recorded in the designation of a named revision of an edition element.

Colour of moving images
type: Property
sub property of: Colour content
has subproperty: Colour of moving images (Expression)
name: colourOfMovingImage
status: New-Proposed
definition: The presence of colour, tone, etc., in a moving image or images contained in a resource. Colour of moving image is also the specific colours, tones, etc., (including black and white) present in a moving image or images contained in a resource.

Sound characteristic
type: Property
has subproperty: Configuration of playback channels
has subproperty: Recording medium
has subproperty: Tape configuration
has subproperty: Groove characteristic
has subproperty: Type of recording
has subproperty: Track configuration
has subproperty: Playing speed
has subproperty: Special playback characteristic
has subproperty: Sound characteristic (Manifestation)
name: soundCharacteristic
status: New-Proposed
definition: A technical specification relating to the encoding of sound in a resource.
scope note: Definition source: RDA 3.17.0.1.1

Date of manufacture (Manifestation)
type: Property
domain: Manifestation
sub property of: Date of manufacture
name: dateOfManufactureManifestation
status: New-Proposed
definition: A date associated with the printing, duplicating, casting, etc., of a resource in a published form.

Other details of cartographic content
type: Property
has subproperty: Other details of cartographic content (Expression)
name: otherDetailsOfCartographicContent
status: New-Proposed
definition: Mathematical data and other features of the cartographic content of a resource not recorded in statements of scale, projection, and coordinates.

Special playback characteristic
type: Property
sub property of: Sound characteristic
has subproperty: Special playback characteristic (Manifestation)
name: specialPlaybackCharacteristic
status: New-Proposed
definition: An equalization system, noise reduction system, etc., used in making an audio recording.

Colour content (Expression)
type: Property
domain: Expression
sub property of: Colour content
has subproperty: Colour of moving images (Expression)
has subproperty: Colour content of resource designed for persons with visual impairments (Expression)
has subproperty: Colour of three-dimensional form (Expression)
has subproperty: Colour of still image (Expression)
name: colourContentExpression
status: New-Proposed
definition: The presence of colour, tone, etc., in the content of a resource. Colour content is also the specific colours, tones, etc., (including black and white) present in the content of a resource.

Supplementary content
type: Property
has subproperty: Supplementary content (Expression)
name: supplementaryContent
status: New-Proposed
definition: Content (e.g., an index, bibliography, or appendix) designed to supplement the primary content of a resource.

Place of publication
type: Property
has subproperty: Place of publication (Manifestation)
name: placeOfPublication
status: New-Proposed
definition: A place associated with the publication, release, or issuing of a resource.

Other distinguishing characteristic of the expression
type: Property
domain: Expression
name: otherDistinguishingCharacteristicOfTheExpression
status: New-Proposed
definition: A characteristic other than content type, language of expression, or date of expression that serves to differentiate an expression from another expression of the same work.
scope note: Definition source: RDA 6.14.0.1.1

Note on copyright date (Manifestation)
type: Property
domain: Manifestation
sub property of: Note on manifestation or item (Manifestation)
sub property of: Note on copyright date
name: noteOnCopyrightDateManifestation
status: New-Proposed
definition: A note providing additional information about copyright dates applying to various aspects of a resource.

Date of production (Manifestation)
type: Property
domain: Manifestation
sub property of: Date of production
name: dateOfProductionManifestation
status: New-Proposed
definition: A date associated with the inscription, fabrication, construction, etc., of a resource in an unpublished form.

Projection of cartographic content (Expression)
type: Property
domain: Expression
sub property of: Projection of cartographic content
name: projectionOfCartographicContentExpression
status: New-Proposed
definition: The method or system used to represent the surface of the Earth or of a celestial sphere on a plane.

Production statement
type: Property
has subproperty: Production statement (Manifestation)
name: productionStatement
status: New-Proposed
definition: A statement identifying the place or places of production, producer or producers, and date or dates of production of a resource in an unpublished form.

Statement of responsibility relating to a named revision of an edition
type: Property
has subproperty: Statement of responsibility relating to a named revision of an edition (Manifestation)
name: statementOfResponsibilityRelatingToANamedRevisionOfAnEdition
status: New-Proposed
definition: A statement relating to the identification of any persons, families, or corporate bodies responsible for a named revision of an edition.

Publication statement (Manifestation)
type: Property
domain: Manifestation
range: Publication Statement Encoding Scheme
sub property of: Publication statement
name: publicationStatementManifestation
status: New-Proposed
definition: A statement identifying the place or places of publication, publisher or publishers, and date or dates of publication of a resource.

Production Statement Encoding Scheme
type: Class
subclass of: SyntaxEncodingScheme
name: ProductionStatementEncodingScheme
status: New-Proposed
definition: This subclass has been created to define the Syntax Encoding Scheme for the RDA Production Statement composite string. The Production Statement is composed of an ordered, concatenated list of properties: - Place of production - Parallel place of production - Producer's name - Parallel producer's name - Date of production

Extent of still image (Manifestation)
type: Property
domain: Manifestation
sub property of: Extent (Manifestation)
sub property of: Extent of still image
name: extentOfStillImageManifestation
status: New-Proposed
definition: The number and type of units and/or subunits making up a resource consisting of one or more still images.

Content type (Expression)
type: Property
domain: Expression
sub property of: Content type
name: contentTypeExpression
status: New-Proposed
definition: A categorization reflecting the fundamental form of communication in which the content is expressed and the human sense through which it is intended to be perceived. For content expressed in the form of an image or images, content type also reflects the number of spatial dimensions in which the content is intended to be perceived and the perceived presence or absence of movement.

Edition statement (Manifestation)
type: Property
domain: Manifestation
range: Edition Statement Encoding Scheme
sub property of: Edition statement
name: editionStatementManifestation
status: New-Proposed
definition: A statement identifying the edition to which a resource belongs.

Place of capture (Expression)
type: Property
domain: Expression
sub property of: Place of capture
name: placeOfCaptureExpression
status: New-Proposed
definition: The place associated with the capture (i.e., recording, filming, etc.) of the content of a resource.

Note on edition statement
type: Property
sub property of: Note
has subproperty: Note on edition statement (Manifestation)
name: noteOnEditionStatement
status: New-Proposed
definition: A note providing information on the source of an edition statement, on edition statements relating to issues, parts, etc., on changes in edition statements, or other information relating to an edition statement.

Variant title for the work
type: Property
domain: Work
sub property of: titleOfWork
name: variantTitleForTheWork
status: New-Proposed
definition: A title or form of title by which a work is known that differs from the title or form of title chosen as the preferred title for the work.

Broadcast standard
type: Property
sub property of: Video characteristic
has subproperty: Broadcast standard (Manifestation)
name: broadcastStandard
status: New-Proposed
definition: A system used to format a video resource for television broadcast.

Coordinates of cartographic content (Work)
type: Property
domain: Work
sub property of: Coordinates of cartographic content
has subproperty: Strings of coordinate pairs (Work)
has subproperty: Longitude and latitude (Work)
has subproperty: Right ascension and declination (Work)
name: coordinatesOfCartographicContentWork
status: New-Proposed
definition: A mathematical system for identifying the area covered by the cartographic content of a resource. Coordinates may be expressed by means of longitude and latitude on the surface of planets or by the angles of right ascension and declination for celestial charts.

Polarity (Manifestation)
type: Property
domain: Manifestation
sub property of: Polarity
name: polarityManifestation
status: New-Proposed
definition: The relationship of the colours and tones in an image to the colours and tones of the object filmed (e.g., positive, negative).

Video characteristic (Manifestation)
type: Property
domain: Manifestation
sub property of: Video characteristic
has subproperty: Video format (Manifestation)
has subproperty: Broadcast standard (Manifestation)
name: videoCharacteristicManifestation
status: New-Proposed
definition: A technical specification relating to the encoding of video images in a resource.

Terms of availability (Manifestation)
type: Property
domain: Manifestation
sub property of: Terms of availability
name: termsOfAvailabilityManifestation
status: New-Proposed
definition: The conditions under which the publisher or distributor will normally supply a resource, or the price of a resource.

Restrictions on access (Item)
type: Property
domain: Item
sub property of: Restrictions on access
name: restrictionsOnAccessItem
status: New-Proposed
definition: Limitations placed on access to a resource.

Date of capture (Expression)
type: Property
domain: Expression
sub property of: Date of capture
name: dateOfCaptureExpression
status: New-Proposed
definition: A date or range of dates associated with the capture (i.e., recording, filming, etc.) of the content of a resource.

Sound content
type: Property
has subproperty: Sound content (Expression)
has subproperty: Sound content (Manifestation)
name: soundContent
status: New-Proposed
definition: The presence of sound in a resource other than one that consists primarily of recorded sound.

Preferred citation (Manifestation)
type: Property
domain: Manifestation
sub property of: Preferred citation
name: preferredCitationManifestation
status: New-Proposed
definition: A citation for a resource in the form preferred by a creator, publisher, custodian, indexing or abstracting service, etc.

Extent of three-dimensional form
type: Property
sub property of: Extent
has subproperty: Extent of three-dimensional form (Item)
has subproperty: Extent of three-dimensional form (Manifestation)
name: extentOfThreeDimensionalForm
status: New-Proposed
definition: The number and type of units and/or subunits making up a resource consisting of one or more three-dimensional forms.

Format of notated music
type: Property
has subproperty: Format of notated music (Expression)
name: formatOfNotatedMusic
status: New-Proposed
definition: The musical or physical layout of the content of a resource that is presented in the form of musical notation.

Granting institution or faculty
type: Property
has subproperty: Granting institution or faculty (Work)
name: grantingInstitutionOrFaculty
status: New-Proposed
definition: An institution or faculty conferring an academic degree on a candidate.

Note on production statement (Manifestation)
type: Property
domain: Manifestation
sub property of: Note on manifestation or item (Manifestation)
sub property of: Note on production statement
name: noteOnProductionStatementManifestation
status: New-Proposed
definition: A note providing details on place of production, producer, or date of production, or information on changes in the place of production, producer, or producer’s name.

Parallel title proper of subseries
type: Property
has subproperty: Parallel title proper of subseries (Manifestation)
name: parallelTitleProperOfSubseries
status: New-Proposed
definition: The title proper of a subseries in another language and/or script.

Right ascension and declination
type: Property
sub property of: Coordinates of cartographic content
has subproperty: Right ascension and declination (Work)
name: rightAscensionAndDeclination
status: New-Proposed
definition: A system for identifying the location of a celestial object in the sky covered by the cartographic content of a resource using the angles of right ascension and declination.

Statement of responsibility relating to the edition
type: Property
has subproperty: Statement of responsibility relating to the edition (Manifestation)
name: StatementOfResponsibilityRelatingToTheEdition
status: New-Proposed
definition: A statement relating to the identification of any persons, families, or corporate bodies responsible for the edition being described but not to all editions.

Parallel title proper of subseries (Manifestation)
type: Property
domain: Manifestation
sub property of: Parallel title proper of subseries
name: parallelTitleProperOfSubseriesManifestation
status: New-Proposed
definition: The title proper of a subseries in another language and/or script.

Note on series statement
type: Property
sub property of: Note
has subproperty: Note on series statement (Manifestation)
name: noteOnSeriesStatement
status: New-Proposed
definition: A note providing information on complex series statements, incorrect numbering within series, or changes in series statements.

Uniform resource locator (Item)
type: Property
domain: Item
sub property of: Uniform resource locator
name: uniformResourceLocatorItem
status: New-Proposed
definition: The address of a remote access resource.

Preferred citation
type: Property
has subproperty: Preferred citation (Item)
has subproperty: Preferred citation (Manifestation)
name: preferredCitation
status: New-Proposed
definition: A citation for a resource in the form preferred by a creator, publisher, custodian, indexing or abstracting service, etc.

Parallel publisher's name (Manifestation)
type: Property
domain: Manifestation
sub property of: Parallel publisher's name
name: parallelPublishersNameManifestation
status: New-Proposed
definition: A publisher’s name in a language and/or script that differs from that recorded in the publisher’s name element.

Preferred citation (Item)
type: Property
domain: Item
sub property of: Preferred citation
name: preferredCitationItem
status: New-Proposed
definition: A citation for a resource in the form preferred by a creator, publisher, custodian, indexing or abstracting service, etc.

Place of manufacture
type: Property
has subproperty: Place of manufacture (Manifestation)
name: placeOfManufacture
status: New-Proposed
definition: A place associated with the printing, duplicating, casting, etc., of a resource in a published form.

Parallel statement of responsibility relating to series (Manifestation)
type: Property
domain: Manifestation
sub property of: Parallel statement of responsibility relating to series
name: parallelStatementOfResponsibilityRelatingToSeriesManifestation
status: New-Proposed
definition: A statement relating to series in a language and/or script that differs from that recorded in the statement of responsibility relating to series element.

Projection speed
type: Property
sub property of: Projection characteristic of motion picture film
has subproperty: Projection speed (Manifestation)
name: projectionSpeed
status: New-Proposed
definition: The speed at which a projected carrier must be operated to produce the moving image intended.

Note on manifestation or item (Item)
type: Property
domain: Item
sub property of: Note
has subproperty: Note on dimensions of item
has subproperty: Note on extent of item
name: noteItem
status: New-Proposed
definition: An annotation providing additional information relating to manifestation or item attributes.

Parallel other title information of subseries
type: Property
has subproperty: Parallel other title information of subseries (Manifestation)
name: parallelOtherTitleInformationOfSubseries
status: New-Proposed
definition: Other title information of a subseries in a language and/or script that differs from that recorded in the other title information of subseries element.

Artistic and/or technical credit
type: Property
has subproperty: Artistic and/or technical credit (Expression)
name: artisticAndOrTechnicalCredit
status: New-Proposed
definition: A listing of persons, families, or corporate bodies making contributions to the artistic and/or technical production of a resource.

Nature of the content
type: Property
has subproperty: Nature of the content (Work)
name: natureOfTheContent
status: New-Proposed
definition: The specific character of the content of a resource (e.g., legal articles, interim report).
scope note: Definition source: RDA 7.3.0.1.1

Distribution statement (Manifestation)
type: Property
domain: Manifestation
range: Distribution Statement Encoding Scheme
sub property of: Distribution statement
name: distributionStatementManifestation
status: New-Proposed
definition: A statement identifying the place or places of distribution, distributor or distributors, and date or dates of distribution of a resource.

Extent of still image (Item)
type: Property
domain: Item
sub property of: Extent (Item)
sub property of: Extent of still image
name: extentOfStillImageItem
status: New-Proposed
definition: The number and type of units and/or subunits making up a resource consisting of one or more still images.

Parallel statement of responsibility relating to subseries (Manifestation)
type: Property
domain: Manifestation
range: Series Statement Encoding Scheme
sub property of: Parallel statement of responsibility relating to subseries
sub property of: Series statement (Manifestation)
name: parallelStatementOfResponsibilityRelatingToSubseriesManifestation
status: New-Proposed
definition: A statement relating to subseries in a language and/or script that differs from that recorded in the statement of responsibility relating to subseries element.

Extent (Item)
type: Property
domain: Item
sub property of: Extent
has subproperty: Extent of text (Item)
has subproperty: Extent of cartographic resource (Item)
has subproperty: Extent of still image (Item)
has subproperty: Extent of three-dimensional form (Item)
name: extentItem
status: New-Proposed
definition: The number and type of units and/or subunits making up a resource.

Note on changes in carrier characteristics (Manifestation)
type: Property
domain: Manifestation
sub property of: Note on manifestation or item (Manifestation)
sub property of: Note on changes in carrier characteristics
name: noteOnChangesInCarrierCharacteristicsManifestation
status: New-Proposed
definition: A note on changes in carrier characteristics that occur in subsequent issues or parts of a resource issued in successive parts or between iterations of an integrating resource.

Note on dimensions of item
type: Property
domain: Item
sub property of: Note on manifestation or item (Item)
sub property of: Note
name: noteOnDimensionsOfItem
status: New-Proposed
definition: A note providing information about the dimensions of the specific item being described that is not recorded formally as part of the dimensions element.

Parallel title proper of series (Manifestation)
type: Property
domain: Manifestation
sub property of: Parallel title proper of series
name: parallelTitleProperOfSeriesManifestation
status: New-Proposed
definition: The title proper of a series in another language and/or script.

Parallel statement of responsibility relating to the edition
type: Property
has subproperty: Parallel statement of responsibility relating to the edition (Manifestation)
name: parallelStatementOfResponsibilityRelatingToTheEdition
status: New-Proposed
definition: A statement of responsibility relating to the edition in a language and/or script that differs from that recorded in the statement of responsibility relating to the edition element.

Other title information of series (Manifestation)
type: Property
domain: Manifestation
sub property of: Other title information of series
name: otherTitleInformationOfSeriesManifestation
status: New-Proposed
definition: Information that appears in conjunction with, and is subordinate to, the title proper of a series.

Extent of cartographic resource (Manifestation)
type: Property
domain: Manifestation
sub property of: Extent (Manifestation)
sub property of: Extent of cartographic resource
name: extentOfCartographicResourceManifestation
status: New-Proposed
definition: The number and type of units and/or subunits making up a cartographic resource.

Note on publication statement (Manifestation)
type: Property
domain: Manifestation
sub property of: Note on manifestation or item (Manifestation)
sub property of: Note on publication statement
name: noteOnPublicationStatementManifestation
status: New-Proposed
definition: A note providing details on place of publication, publisher, or date of publication, information on changes in the place of publication, publisher, or publisher’s name, or on suspension of publication.

Other title information of subseries (Manifestation)
type: Property
domain: Manifestation
sub property of: Other title information of subseries
name: otherTitleInformationOfSubseriesManifestation
status: New-Proposed
definition: Information that appears in conjunction with, and is subordinate to, the title proper of a subseries.

Identifier for the item
type: Property
domain: Item
name: identifierForTheItem
status: New-Proposed
definition: A character string associated with an item that serves to differentiate that item from other items.

ISSN of subseries
type: Property
has subproperty: ISSN of subseries (Manifestation)
name: issnOfSubseries
status: New-Proposed
definition: The identifier assigned to a subseries by an ISSN registration agency.

Form of work
type: Property
domain: Work
name: formOfWork
status: New-Proposed
definition: A class or genre to which a work belongs.
scope note: Definition source: RDA 6.4.0.1.1

Alternative Numeric and/or Alphabetic Designation of Last Issue or Part of Sequence
type: Property
sub property of: Numbering of serials
has subproperty: Alternative Numeric and/or Alphabetic Designation of Last Issue or Part of Sequence (Manifestation)
name: alternativeNumericAndOrAlphabeticDesignationOfLastIssueOrPartOfSequence
status: New-Proposed
definition: A second or subsequent system of numbering presented in numeric and/or alphabetic form on the last issue or part of a sequence of numbering for a serial.

Script (Expression)
type: Property
domain: Expression
sub property of: Form of notation (Expression)
sub property of: Script
name: scriptExpression
status: New-Proposed
definition: A set of characters and/or symbols used to express the written language content of a resource.

Sound content (Manifestation)
type: Property
domain: Manifestation
sub property of: Sound content
name: soundContentManifestation
status: New-Proposed
definition: The presence of sound in a resource other than one that consists primarily of recorded sound.

Parallel other title information of series (Manifestation)
type: Property
domain: Manifestation
sub property of: Parallel other title information of series
name: parallelOtherTitleInformationOfSeriesManifestation
status: New-Proposed
definition: Other title information of a series in a language and/or script that differs from that recorded in the other title information of series element.

Note on issue, part, or iteration used as the basis for identification of the resource
type: Property
sub property of: Note
has subproperty: Note on issue, part, or iteration used as the basis for identification of the resource (Manifestation)
name: noteOnIssuePartOrIterationUsedAsTheBasisForIdentificationOfTheResource
status: New-Proposed
definition: A note identifying the issue or part of a multipart monograph or serial, or the iteration of an integrating resource that has been used as the basis for the identification of a resource.

Status of identification
type: Property
name: statusOfIdentification
status: New-Proposed
definition: An indication of the level of authentication of the data identifying an entity.

Parallel title proper of series
type: Property
has subproperty: Parallel title proper of series (Manifestation)
name: parallelTitleProperOfSeries
status: New-Proposed
definition: The title proper of a series in another language and/or script.

RDA Group 1 Elements
note: This is the provisional registration of the RDA Group 1 Element Vocabulary, managed by the DCMI/RDA Task Group.

Generation of digital resource (Manifestation)
type: Property
domain: Manifestation
sub property of: Generation (Manifestation)
sub property of: Generation of digital resource
name: generationOfDigitalResourceManifestation
status: New-Proposed
definition: The relationship between an original carrier of a digital resource and the carrier of a reproduction made from the original (e.g., a derivative master).

Layout of tactile text (Manifestation)
type: Property
domain: Manifestation
sub property of: Layout (Manifestation)
sub property of: Layout of tactile text
name: layoutOfTactileTextManifestation
status: New-Proposed

Title
type: Property
has subproperty: Title (Manifestation)
has subproperty: Other title information
has subproperty: Earlier title proper
has subproperty: Parallel title proper
has subproperty: Title proper
has subproperty: Title of the work
has subproperty: Variant title for the work
has subproperty: Key title
has subproperty: Abbreviated title
has subproperty: Variant title
has subproperty: Later title proper
has subproperty: Parallel other title information
name: title
status: New-Proposed
definition: A word, character, or group of words and/or characters that names a resource or a work contained in it.

Frequency
type: Property
has subproperty: Frequency (Manifestation)
name: frequency
status: New-Proposed
definition: The intervals at which the issues or parts of a serial or the updates to an integrating resource are issued.

Performer, narrator, and/or presenter
type: Property
has subproperty: Performer, narrator, and/or presenter (Expression)
name: performerNarratorAndOrPresenter
status: New-Proposed
definition: A person, family, or corporate body responsible for performing, narrating, and/or presenting a work.

Other details of cartographic content (Expression)
type: Property
domain: Expression
sub property of: Other details of cartographic content
name: otherDetailsOfCartographicContentExpression
status: New-Proposed
definition: Mathematical data and other features of the cartographic content of a resource not recorded in statements of scale, projection, and coordinates.

Series statement (Manifestation)
type: Property
domain: Manifestation
range: Series Statement Encoding Scheme
sub property of: Series statement
has subproperty: Parallel statement of responsibility relating to subseries (Manifestation)
name: seriesStatementManifestation
status: New-Proposed
definition: A statement identifying a series to which a resource belongs and the numbering of the resource within the series. A series statement may also include information identifying one or more subseries to which the resource being described belongs.

Configuration of playback channels (Manifestation)
type: Property
domain: Manifestation
sub property of: Sound characteristic (Manifestation)
sub property of: Configuration of playback channels
name: configurationOfPlaybackChannelsManifestation
status: New-Proposed
definition: The number of sound channels used to make a recording (e.g., one channel for a monophonic recording, two channels for a stereophonic recording).

Generation of audio recording
type: Property
sub property of: Generation
has subproperty: Generation of audio recording (Manifestation)
name: generationOfAudioRecording
status: New-Proposed
definition: The relationship between an original carrier of an audio recording and the carrier of a reproduction made from the original (e.g., a tape duplication master, a test pressing).

Statement of responsibility relating to subseries (Manifestation)
type: Property
domain: Manifestation
sub property of: Statement of responsibility relating to subseries
name: statementOfResponsibilityRelatingToSubseriesManifestatiion
status: New-Proposed
definition: A statement relating to the identification of any persons, families, or corporate bodies responsible for a subseries.

Summarization of the content
type: Property
has subproperty: Summarization of the content (Expression)
name: summarizationOfTheContent
status: New-Proposed
definition: An abstract, summary, synopsis, etc., of the content of a resource.

Parallel place of publication (Manifestation)
type: Property
domain: Manifestation
sub property of: Parallel place of publication
name: parallelPlaceOfPublicationManifestation
status: New-Proposed
definition: A place of publication in a language and/or script that differs from that recorded in the place of publication element.

Abbreviated title (Manifestatiion)
type: Property
domain: Manifestation
sub property of: Title (Manifestation)
sub property of: Abbreviated title
name: abbreviatedTitleManifestation
status: New-Proposed
definition: A title that has been abbreviated for purposes of indexing or identification.

Base material for microfilm, microfiche, photographic film, and motion picture film (Manifestation)
type: Property
domain: Manifestation
sub property of: Base material (Manifestation)
sub property of: Base material for microfilm, microfiche, photographic film, and motion picture film
name: baseMaterialforMicrofilmMicrofichePhotographicFilmAndMotionPictureFilmManifestation
status: New-Proposed
definition: The underlying physical material of a microfilm, microfiche, photographic film, or motion picture film resource.

Publisher's name
type: Property
has subproperty: Publisher's name (Manifestation)
name: publishersName
status: New-Proposed
definition: The name of a person, family, or corporate body responsible for publishing, releasing, or issuing a resource.

Production method for tactile resource (Manifestation)
type: Property
domain: Manifestation
sub property of: Production method (Manifestation)
sub property of: productionMethodForTactileResources
name: productionMethodForTactileResourceManifestation
status: New-Proposed
definition: The process used to produce a tactile resource (e.g., embossing, thermoform).

Parallel place of production
type: Property
has subproperty: Parallel place of production (Manifestation)
name: parallelPlaceOfProduction
status: New-Proposed
definition: A place of production in a language and/or script that differs from that recorded in the place of production element.

Note on extent of manifestation
type: Property
domain: Manifestation
sub property of: Note on manifestation or item (Manifestation)
sub property of: Note
name: noteOnExtentOfManifestation
status: New-Proposed
definition: A note providing information on the extent of a manifestation that is not recorded formally as part of the extent element.

Reduction ration (Manifestation)
type: Property
domain: Manifestation
sub property of: Reduction ratio
name: reductionRatioManifestation
status: New-Proposed
definition: The size of a micro-image in relation to the original from which it was produced.

Mount
type: Property
comment: Associated with the FRBR Manifestation entity.
has subproperty: Mount (Manifestation)
name: mount
status: New-Proposed
definition: The physical material used for the support or backing to which the base material of a resource has been attached.
scope note: Definition source: RDA 3.8.0.1.1

Note on production statement
type: Property
sub property of: Note
has subproperty: Note on production statement (Manifestation)
name: noteOnProductionStatement
status: New-Proposed
definition: A note providing details on place of production, producer, or date of production, or information on changes in the place of production, producer, or producer’s name.

Note on issue, part, or iteration used as the basis for identification of the resource (Manifestation)
type: Property
domain: Manifestation
sub property of: Note on manifestation or item (Manifestation)
sub property of: Note on issue, part, or iteration used as the basis for identification of the resource
name: noteOnIssuePartOrIterationUsedAsTheBasisForIdentificationOfTheResourceManifestation
status: New-Proposed
definition: A note identifying the issue or part of a multipart monograph or serial, or the iteration of an integrating resource that has been used as the basis for the identification of a resource.

Recording medium
type: Property
sub property of: Sound characteristic
has subproperty: Recording medium (Manifestation)
name: recordingMedium
status: New-Proposed
definition: The type of medium used to record sound on an audio carrier (e.g., magnetic, optical).

Extent of cartographic resource (Item)
type: Property
domain: Item
sub property of: Extent (Item)
sub property of: Extent of cartographic resource
name: extentOfCartographicResourceItem
status: New-Proposed
definition: The number and type of units and/or subunits making up a cartographic resource.

Numeric and/or alphabetic designation of first issue or part of sequence
type: Property
sub property of: Numbering of serials
has subproperty: Numeric and/or alphabetic designation of first issue or part of sequence (Manifestation)
name: numericAndOrAlphabeticDesignationOfFirstIssueOrPartOfSequence
status: New-Proposed
definition: Numbering presented in numeric and/or alphabetic form on the first issue or part of a sequence of numbering for a serial.

Identifier for the work
type: Property
domain: Work
name: identifierForTheWork
status: New-Proposed
definition: A character string uniquely associated with a work, or with a surrogate for a work (e.g., an authority record) that serves to differentiate that work from other works.
scope note: Definition source: RDA 6.10.0.1.1.

Statement of responsibility relating to subseries
type: Property
has subproperty: Statement of responsibility relating to subseries (Manifestation)
name: statementOfResponsibilityRelatingToSubseries
status: New-Proposed
definition: A statement relating to the identification of any persons, families, or corporate bodies responsible for a subseries.

Scale of still image or three-dimensional form (Expression)
type: Property
domain: Expression
sub property of: Scale (Expression)
sub property of: Scale of still image or three-dimensional form
name: scaleOfStillImageOrThreeDimensionalFormExpression
status: New-Proposed
definition: The ratio of the dimensions of a still image or three-dimensional form contained or embodied in a resource to the dimensions of the entity it represents.

Form of musical notation (Expression)
type: Property
domain: Expression
sub property of: Form of notation (Expression)
sub property of: Form of musical notation
name: formOfMusicalNotationExpression
status: New-Proposed
definition: A set of characters and/or symbols used to express the musical content of a resource.

Note on manifestation or item (Manifestation)
type: Property
domain: Manifestation
sub property of: Note
has subproperty: Note on publication statement (Manifestation)
has subproperty: Note on distribution statement (Manifestation)
has subproperty: Note on production statement (Manifestation)
has subproperty: Note on copyright date (Manifestation)
has subproperty: Note on extent of manifestation
has subproperty: Note on issue, part, or iteration used as the basis for identification of the resource (Manifestation)
has subproperty: Note on series statement (Manifestation)
has subproperty: Note on frequency (Manifestation)
has subproperty: Note on changes in carrier characteristics (Manifestation)
has subproperty: Note on edition statement (Manifestation)
has subproperty: Note on title (Manifestation)
has subproperty: Note on statement of responsibility (Manifestation)
has subproperty: Note on manufacture statement (Manifestation)
has subproperty: Note on dimensions of manifestation
has subproperty: Note on numbering of serials (Manifestation)
name: noteManifestation
status: New-Proposed
definition: An annotation providing additional information relating to manifestation or item attributes.

Generation of motion picture film
type: Property
sub property of: Generation
has subproperty: Generation of motion picture film (Manifestation)
name: generationOfMotionPictureFilm
status: New-Proposed
definition: The relationship between an original carrier of a motion picture film resource and the carrier of a reproduction made from the original (e.g., a reference print).

Transmission speed
type: Property
sub property of: Digital file characteristic
has subproperty: Transmission speed (Manifestation)
name: transmissionSpeed
status: New-Proposed
definition: The speed at which streaming audio or video is designed to play.

Parallel manufacturer's name (Manifestation)
type: Property
domain: Manifestation
sub property of: Parallel manufacturer's name
name: parallelManufacturersNameManifestation
status: New-Proposed
definition: A manufacturer’s name in a language and/or script that differs from that recorded in the manufacturer’s name element.

Uniform resource locator (Manifestation)
type: Property
domain: Manifestation
sub property of: Uniform resource locator
name: uniformResourceLocatorManifestation
status: New-Proposed
definition: The address of a remote access resource.

Place of production
type: Property
has subproperty: Place of production (Manifestation)
name: placeOfProduction
status: New-Proposed
definition: A place associated with the inscription, fabrication, construction, etc., of a resource in an unpublished form.
scope note: Definition source: RDA 2.7.1.1.1

Extent
type: Property
has subproperty: Extent of still image
has subproperty: Extent of cartographic resource
has subproperty: Extent (Item)
has subproperty: Extent of text
has subproperty: Extent (Manifestation)
has subproperty: Extent of notated music
has subproperty: Extent of three-dimensional form
name: extent
status: New-Proposed
definition: The number and type of units and/or subunits making up a resource.
scope note: Definition source: RDA 3.4.0.1.1

Extent of text
type: Property
sub property of: Extent
has subproperty: Extent of text (Item)
has subproperty: Extent of text (Manifestation)
name: extentOfText
status: New-Proposed
definition: The number and type of units and/or subunits making up a resource consisting of text, with or without accompanying illustrations.

Date of publication (Manifestation)
type: Property
domain: Manifestation
sub property of: Date of publication
name: dateOfPublicationManifestation
status: New-Proposed
definition: A date associated with the publication, release, or issuing of a resource.

Note on statement of responsibility (Manifestation)
type: Property
domain: Manifestation
sub property of: Note on manifestation or item (Manifestation)
sub property of: Note on statement of responsibility
name: noteOnStatementOfResponsibilityManifestation
status: New-Proposed
definition: A note providing information on a person, family, or corporate body not named in a statement of responsibility to whom responsibility for the intellectual or artistic content of the resource has been attributed, on variant forms of names appearing in the resource, on changes in statements of responsibility, or other information relating to a statement of responsibility.

File type
type: Property
sub property of: Digital file characteristic
has subproperty: File type (Manifestation)
name: fileType
status: New-Proposed
definition: A general type of data content encoded in a computer file.

Date of capture
type: Property
has subproperty: Date of capture (Expression)
name: dateOfCapture
status: New-Proposed
definition: A date or range of dates associated with the capture (i.e., recording, filming, etc.) of the content of a resource.

Horizontal scale of cartographic content (Expression)
type: Property
domain: Expression
sub property of: Scale (Expression)
sub property of: Horizontal scale of cartographic content
name: horizontalScaleOfCartographicContentExpression
status: New-Proposed
definition: The ratio of horizontal distances in the cartographic content of a resource to the actual distances they represent.

Dimensions of map, etc. (Item)
type: Property
domain: Item
sub property of: Dimensions (Item)
sub property of: Dimensions of map, etc.
name: dimensionsOfMapEtcItem
status: New-Proposed
definition: The measurements of the face of a map, etc.

Custodial history of item
type: Property
domain: Item
name: custodialHistoryOfItem
status: New-Proposed
definition: A record of previous ownership or custodianship of an item.

Base material
type: Property
has subproperty: Base material (Manifestation)
has subproperty: Base material for microfilm, microfiche, photographic film, and motion picture film
name: baseMaterial
status: New-Proposed
definition: The underlying physical material of a resource.
scope note: Definition source: RDA 3.6.0.1.1

Note on copyright date
type: Property
sub property of: Note
has subproperty: Note on copyright date (Manifestation)
name: noteOnCopyrightDate
status: New-Proposed
definition: A note providing additional information about copyright dates applying to various aspects of a resource.

Source consulted
type: Property
name: sourceConsulted
status: New-Proposed
definition: A resource used in determining the name, title or other identifying attributes of an entity, or in determining the relationship between entities.

Strings of coordinate pairs
type: Property
sub property of: Coordinates of cartographic content
has subproperty: Strings of coordinate pairs (Work)
name: stringsOfCoordinatePairs
status: New-Proposed
definition: A system for identifying the precise area covered by the cartographic content of a resource using coordinates for each vertex of a polygon.

Statement of responsibility relating to series
type: Property
has subproperty: Statement of responsibility relating to series (Manifestation)
name: statementOfResponsibilityRelatingToSeries
status: New-Proposed
definition: A statement relating to the identification of any persons, families, or corporate bodies responsible for a series.

Intended audience
type: Property
has subproperty: Intended audience (Work)
name: intendedAudience
status: New-Proposed
definition: The class of user for which the content of a resource is intended, or for whom the content is considered suitable, as defined by age group (e.g., children, young adults, adults, etc.), educational level (e.g., primary, secondary, etc.), type of disability, or other categorization.

Digital file characteristic (Manifestation)
type: Property
domain: Manifestation
sub property of: Digital file characteristic
has subproperty: Transmission speed (Manifestation)
has subproperty: Resolution (Manifestation)
has subproperty: Encoding format (Manifestation)
has subproperty: File type (Manifestation)
has subproperty: Regional encoding (Manifestation)
has subproperty: Digital representation of cartographic content (Manifestation)
has subproperty: File size (Manifestation)
name: digitalFileCharacteristicManifestation
status: New-Proposed
definition: A technical specification relating to the digital encoding of text, image, audio, video, and other types of data in a resource.

Dimensions (Item)
type: Property
domain: Item
sub property of: Dimensions
has subproperty: Dimensions of map, etc. (Item)
has subproperty: Dimensions of still image (Item)
name: dimensionsItem
status: New-Proposed
definition: The measurements of the carrier or carriers and/or the container of a resource.

Equinox (Work)
type: Property
domain: Work
sub property of: Equinox
name: equinoxWork
status: New-Proposed
definition: One of two points of intersection of the ecliptic and the celestial equator, occupied by the sun when its declination is 0°.

Granting institution or faculty (Work)
type: Property
domain: Work
range: Dissertation Or Thesis Information Encoding Scheme
sub property of: Granting institution or faculty
name: grantingInstitutionOrFacultyWork
status: New-Proposed
definition: An institution or faculty conferring an academic degree on a candidate.

Form of notated movement
type: Property
sub property of: Form of notation
name: formOfNotatedMovement
status: New-Proposed
definition: A set of characters and/or symbols used to express the movement content of a resource.

ISSN of series
type: Property
has subproperty: ISSN of series (Manifestation)
name: issnOfSeries
status: New-Proposed
definition: The identifier assigned to a series by an ISSN registration agency.
scope note: ISO 3297

Parallel place of production (Manifestation)
type: Property
domain: Manifestation
sub property of: Parallel place of production
name: parallelPlaceOfProductionManifestation
status: New-Proposed
definition: A place of production in a language and/or script that differs from that recorded in the place of production element.

Dimensions
type: Property
has subproperty: Dimensions (Manifestation)
has subproperty: Dimensions (Item)
has subproperty: Dimensions of map, etc.
has subproperty: Dimensions of still image
name: dimensions
status: New-Proposed
definition: The measurements of the carrier or carriers and/or the container of a resource.
scope note: Definition source: RDA 3.5.0.1.1

Parallel statement of responsibility relating to a named revision of an edition
type: Property
has subproperty: Parallel statement of responsibility relating to a named revision of an edition (Manifestation)
name: parallelStatementOfResponsibilityRelatingToANamedRevisionOfAnEdition
status: New-Proposed
definition: A statement of responsibility relating to a named revision of an edition in a language and/or script that differs from that recorded in the statement of responsibility relating to a named revision of an edition element.

Alternative Chronological Designation of First Issue or Part of Sequence (Manifestation)
type: Property
domain: Manifestation
sub property of: Numbering of serials (Manifestation)
sub property of: Alternative Chronological Designation of First Issue or Part of Sequence
name: alternativeChronologicalDesignationOfFirstIssueOrPartOfSequenceManifestation
status: New-Proposed
definition: A second or subsequent system of numbering presented in the form of a date (e.g., a year; year and month; month, day, and year) on the first issue or part of a sequence of numbering for a serial.

Medium of performance (Work)
type: Property
domain: Work
sub property of: Medium of performance
name: mediumOfPerformanceWork
status: New-Proposed
definition: The instrumental, instruments, voice, voices, etc., for which a musical work was originally conceived.

Producer's name
type: Property
has subproperty: Producer's name (Manifestation)
name: producersName
status: New-Proposed
definition: The name of a person, family, or corporate body responsible for inscribing, fabricating, constructing, etc., a resource in an unpublished form.

Font size
type: Property
has subproperty: Font size (Manifestation)
name: fontSize
status: New-Proposed
definition: The size of the type used to represent the characters and symbols in a resource.
scope note: Definition source: RDA 3.14.0.1.1

Parallel place of manufacture
type: Property
has subproperty: Parallel place of manufacture (Manifestation)
name: parallelPlaceOfManufacture
status: New-Proposed
definition: A place of manufacture in a language and/or script that differs from that recorded in the place of manufacture element.

Dimensions of still image
type: Property
sub property of: Dimensions
has subproperty: Dimensions of still image (Item)
has subproperty: Dimensions of still image (Manifestation)
name: dimensionsOfStillImage
status: New-Proposed
definition: The measurements of the pictorial area of a still image.

Layout (Manifestation)
type: Property
domain: Manifestation
sub property of: Layout
has subproperty: Layout of tactile musical notation (Manifestation)
has subproperty: Layout of tactile text (Manifestation)
has subproperty: Layout of cartographic images (Manifestation)
name: layoutManifestation
status: New-Proposed
definition: The arrangement of text, images, etc., in a resource.

Generation of microform
type: Property
sub property of: Generation
has subproperty: Generation of microform (Manifestation)
name: generationOfMicroform
status: New-Proposed
definition: The relationship between an original carrier of a microform resource and the carrier of a reproduction made from the original (e.g., a printing master).

Summarization of the content (Expression)
type: Property
domain: Expression
sub property of: Summarization of the content
name: summarizationOfTheContentExpression
status: New-Proposed
definition: An abstract, summary, synopsis, etc., of the content of a resource.

Aspect ratio (Expression)
type: Property
domain: Expression
sub property of: Aspect ratio
name: aspectRatioExpression
status: New-Proposed
definition: The ratio of the width to the height of a moving image.

Sound characteristic (Manifestation)
type: Property
domain: Manifestation
sub property of: Sound characteristic
has subproperty: Groove characteristic (Manifestation)
has subproperty: Tape configuration (Manifestation)
has subproperty: Configuration of playback channels (Manifestation)
has subproperty: Special playback characteristic (Manifestation)
has subproperty: Type of recording (Manifestation)
has subproperty: Recording medium (Manifestation)
has subproperty: Track configuration (Manifestation)
has subproperty: Playing speed (Manifestation)
name: soundCharacteristicManifestation
status: New-Proposed
definition: A technical specification relating to the encoding of sound in a resource.

Presentation format
type: Property
sub property of: Projection characteristic of motion picture film
has subproperty: Presentation format (Manifestation)
name: presentationFormat
status: New-Proposed
definition: The format used in the production of a projected image (e.g., Cinerama, IMAX).

Broadcast standard (Manifestation)
type: Property
domain: Manifestation
sub property of: Video characteristic (Manifestation)
sub property of: Broadcast standard
name: broadcastStandardManifestation
status: New-Proposed
definition: A system used to format a video resource for television broadcast.

Generation of motion picture film (Manifestation)
type: Property
domain: Manifestation
sub property of: Generation (Manifestation)
sub property of: Generation of motion picture film
name: generationOfMotionPictureFilmManifestation
status: New-Proposed
definition: The relationship between an original carrier of a motion picture film resource and the carrier of a reproduction made from the original (e.g., a reference print).

Scale (Expression)
type: Property
domain: Expression
sub property of: Scale
has subproperty: Horizontal scale of cartographic content (Expression)
has subproperty: Additional scale information (Expression)
has subproperty: Vertical scale of cartographic content (Expression)
has subproperty: Scale of still image or three-dimensional form (Expression)
name: scaleExpression
status: New-Proposed
definition: The ratio of the dimensions of an image or three-dimensional form contained or embodied in a resource to the dimensions of the entity it represents.

Title proper of series
type: Property
has subproperty: Title proper of series (Manifestation)
name: titleProperOfSeries
status: New-Proposed
definition: The chief name of a series (i.e., the title normally used when citing the series).

Series statement
type: Property
has subproperty: Parallel statement of responsibility relating to subseries
has subproperty: Series statement (Manifestation)
name: seriesStatement
status: New-Proposed
definition: A statement identifying a series to which a resource belongs and the numbering of the resource within the series. A series statement may also include information identifying one or more subseries to which the resource being described belongs.
scope note: Definition Source: 2.11.0.1.1

Extent of text (Manifestation)
type: Property
domain: Manifestation
sub property of: Extent (Manifestation)
sub property of: Extent of text
name: extentOfTextManifestation
status: New-Proposed
definition: The number and type of units and/or subunits making up a resource consisting of text, with or without accompanying illustrations.

Contact information
type: Property
has subproperty: Contact information (Manifestation)
name: contactInformation
status: New-Proposed
definition: Information relating to an organization, etc., from which a resource may be obtained.

Numbering of serials
type: Property
has subproperty: Chronological designation of last issue or part of sequence
has subproperty: Alternative Numeric and/or Alphabetic Designation of Last Issue or Part of Sequence
has subproperty: Numeric and/or alphabetic designation of first issue or part of sequence
has subproperty: Numeric and/or alphabetic designation of last issue or part of sequence
has subproperty: Numbering of serials (Manifestation)
has subproperty: Alternative Chronological Designation of First Issue or Part of Sequence
has subproperty: Alternative Chronological Designation of Last Issue or Part of Sequence
has subproperty: Chronological designation of first issue or part of sequence
has subproperty: Alternative Numeric and/or Alphabetic Designation of First Issue or Part of Sequence
name: numberingOfSerials
status: New-Proposed
definition: The identification of each of the issues or parts of a serial. Numbering of serials may include a numeral, a letter, any other character, or the combination of these with or without an accompanying caption (volume, number, etc.) and/or a chronological designation.
scope note: Definition from: 2.6.0.1.1

Note on changes in content characteristics
type: Property
sub property of: Note
has subproperty: Note on changes in content characteristics (Expression)
name: noteonChangesinContentCharacteristics
status: New-Proposed
definition: A note on changes in content characteristics that occur in subsequent issues or parts of a resource issued in successive parts or between iterations of an integrating resource.

Colour of three-dimensional form (Expression)
type: Property
domain: Expression
sub property of: Colour content (Expression)
sub property of: Colour of three-dimensional form
name: colourOfThree-dimensionalFormExpression
status: New-Proposed
definition: The presence of colour, tone, etc., in a three-dimensional form or forms contained in a resource. Colour of three-dimensional form is also the specific colours, tones, etc., (including black and white) present in a three-dimensional form or forms contained in a resource.

Alternative Chronological Designation of First Issue or Part of Sequence
type: Property
sub property of: Numbering of serials
has subproperty: Alternative Chronological Designation of First Issue or Part of Sequence (Manifestation)
name: alternativeChronologicalDesignationOfFirstIssueOrPartOfSequence
status: New-Proposed
definition: A second or subsequent system of numbering presented in the form of a date (e.g., a year; year and month; month, day, and year) on the first issue or part of a sequence of numbering for a serial.

System of organization
type: Property
has subproperty: System of organization (Work)
name: systemOfOrganization
status: New-Proposed
definition: A system of arranging materials in an archival resource or a collection.
scope note: Definition source: RDA 7.7.0.1.1

Preferred title for the work
type: Property
domain: Work
sub property of: Title of the work
name: preferredTitleForTheWork
status: New-Proposed
definition: The title or form of title chosen as the basis for the suthorized access point representing that work.
scope note: Definition source: RDA 6.2.0.1.1

Mount (Manifestation)
type: Property
domain: Manifestation
sub property of: Mount
name: mountManifestation
status: New-Proposed
definition: The physical material used for the support or backing to which the base material of a resource has been attached.

Form of notated movement (Expression)
type: Property
domain: Expression
sub property of: Form of notation (Expression)
sub property of: Form of notation
name: formOfNotatedMovementExpression
status: New-Proposed
definition: A set of characters and/or symbols used to express the movement content of a resource.

Carrier type (Manifestation)
type: Property
domain: Manifestation
sub property of: Carrier type
name: carrierTypeManifestation
status: New-Proposed
definition: A categorization reflecting the format of the storage medium and housing of a carrier in combination with the type of intermediation device required to view, play, run, etc., the content of a resource.

Year degree granted (Work)
type: Property
domain: Work
range: Dissertation Or Thesis Information Encoding Scheme
sub property of: Year degree granted
name: yearDegreeGrantedWork
status: New-Proposed
definition: The calendar year in which a granting institution or faculty conferred an academic degree on a candidate.

Mode of issuance (Manifestation)
type: Property
domain: Manifestation
sub property of: Mode of issuance
name: modeOfIssuanceManifestation
status: New-Proposed
definition: A categorization reflecting whether a resource is issued in one or more parts, the way it is updated, and its intended termination.

Contact information (Item)
type: Property
domain: Item
sub property of: Content type
name: contactInformationItem
status: New-Proposed
definition: Information relating to an organization, etc., from which a resource may be obtained.

Longitude and latitude
type: Property
sub property of: Coordinates of cartographic content
has subproperty: Longitude and latitude (Work)
name: longitudeAndLatitude
status: New-Proposed
definition: A system for identifying the area covered by the cartographic content of a resource using longitude of the westernmost and easternmost boundaries and latitude of the northernmost and southernmost boundaries.

Extent of three-dimensional form (Manifestation)
type: Property
domain: Manifestation
sub property of: Extent (Manifestation)
sub property of: Extent of three-dimensional form
name: extentOfThreeDimensionalFormManifestation
status: New-Proposed
definition: The number and type of units and/or subunits making up a resource consisting of one or more three-dimensional forms.

Title proper of subseries
type: Property
has subproperty: Title proper of subseries (Manifestation)
name: titleProperOfSubseries
status: New-Proposed
definition: The chief name of a subseries (i.e., the title normally used when citing the subseries).

Title proper of subseries (Manifestation)
type: Property
domain: Manifestation
sub property of: Title proper of subseries
name: titleProperOfSubseriesManifestation
status: New-Proposed
definition: The chief name of a subseries (i.e., the title normally used when citing the subseries).

ISSN of subseries (Manifestation)
type: Property
domain: Manifestation
sub property of: ISSN of subseries
name: issnOfSubseriesManifestation
status: New-Proposed
definition: The identifier assigned to a subseries by an ISSN registration agency.

RDA Syntax Encoding Scheme
type: Class
subclass of: Datatype
has sub class: Place And Date of Capture Encoding Scheme
has sub class: Edition Statement Encoding Scheme
has sub class: Distribution Statement Encoding Scheme
has sub class: Manufacture Statement Encoding Scheme
has sub class: Series Statement Encoding Scheme
has sub class: Production Statement Encoding Scheme
has sub class: Dissertation Or Thesis Information Encoding Scheme
has sub class: Publication Statement Encoding Scheme
name: RDASyntaxEncodingScheme
status: New-Proposed
definition: This subclass has been created to gather the Syntax Encoding Schemes used in RDA.

Restrictions on access (Manifestation)
type: Property
domain: Manifestation
sub property of: Restrictions on access
name: restrictionsOnAccessManifestation
status: New-Proposed
definition: Limitations placed on access to a resource.

Regional encoding
type: Property
has subproperty: Regional encoding (Manifestation)
name: regionalEncoding
status: New-Proposed
definition: A code identifying the region of the world for which a videodisc has been encoded and preventing the disc from being played on a player sold in a different region.

Note on series statement (Manifestation)
type: Property
domain: Manifestation
sub property of: Note on manifestation or item (Manifestation)
sub property of: Note on series statement
name: noteOnSeriesStatementManifestation
status: New-Proposed
definition: A note providing information on complex series statements, incorrect numbering within series, or changes in series statements.

Colour of moving images (Expression)
type: Property
domain: Expression
sub property of: Colour content (Expression)
sub property of: Colour of moving images
name: colourOfMovingImagesExpressions
status: New-Proposed
definition: The presence of colour, tone, etc., in a moving image or images contained in a resource. Colour of moving image is also the specific colours, tones, etc., (including black and white) present in a moving image or images contained in a resource.

Encoding format
type: Property
sub property of: Digital file characteristic
has subproperty: Encoding format (Manifestation)
name: encodingFormat
status: New-Proposed
definition: A schema, standard, etc., used to encode the digital content of a resource.

Parallel designation of edition (Manifestation)
type: Property
domain: Manifestation
sub property of: Parallel designation of edition
name: parallelDesignationOfEditionManifestation
status: New-Proposed
definition: A designation of edition in a language and/or script that differs from that recorded in the designation of edition element.

Video format
type: Property
sub property of: Video characteristic
has subproperty: Video format (Manifestation)
name: videoFormat
status: New-Proposed
definition: A standard, etc., used to encode the analog video content of a resource.

Extent (Manifestation)
type: Property
domain: Manifestation
sub property of: Extent
has subproperty: Extent of three-dimensional form (Manifestation)
has subproperty: Extent of cartographic resource (Manifestation)
has subproperty: Extent of text (Manifestation)
has subproperty: Extent of notated music (Manifestation)
has subproperty: Extent of still image (Manifestation)
name: extentManifestation
status: New-Proposed
definition: The number and type of units and/or subunits making up a resource.

Parallel statement of responsibility relating to subseries
type: Property
sub property of: Series statement
has subproperty: Parallel statement of responsibility relating to subseries (Manifestation)
name: parallelStatementOfResponsibilityRelatingToSubseries
status: New-Proposed
definition: A statement relating to subseries in a language and/or script that differs from that recorded in the statement of responsibility relating to subseries element.

Script
type: Property
sub property of: Form of notation
has subproperty: Script (Expression)
name: script
status: New-Proposed
definition: A set of characters and/or symbols used to express the written language content of a resource.

Font size (Manifestation)
type: Property
domain: Manifestation
sub property of: Font size
name: fontSizeManifestation
status: New-Proposed
definition: The size of the type used to represent the characters and symbols in a resource.

Variant title
type: Property
sub property of: Title
has subproperty: Variant title (Manifestation)
name: variantTitle
status: New-Proposed
definition: A title associated with a resource that differs from a title recorded as the title proper, a parallel title proper, other title information, parallel other title information, earlier title proper, later title proper, key title, or abbreviated title.

Title proper
type: Property
sub property of: Title
has subproperty: Title proper (Manifestation)
name: titleProper
status: New-Proposed
definition: The chief name of a resource (i.e., the title normally used when citing the resource).

Tape configuration
type: Property
sub property of: Sound characteristic
has subproperty: Tape configuration (Manifestation)
name: tapeConfiguration
status: New-Proposed
definition: The number of tracks on an audiotape.

Designation of a named revision of an edition
type: Property
has subproperty: Designation of a named revision of an edition (Manifestation)
name: designationOfANamedRevisionOfAnEdition
status: New-Proposed
definition: A word, character, or group of words and/or characters, identifying a particular revision of a named edition.

Restrictions on access
type: Property
has subproperty: Restrictions on use (Item)
has subproperty: Restrictions on access (Item)
has subproperty: Restrictions on access (Manifestation)
name: restrictionsOnAccess
status: New-Proposed
definition: Limitations placed on access to a resource.

Dimensions of still image (Manifestation)
type: Property
domain: Manifestation
sub property of: Dimensions (Manifestation)
sub property of: Dimensions of still image
name: dimensionsOfStillImageManifestation
status: New-Proposed
definition: The measurements of the pictorial area of a still image.

Polarity
type: Property
comment: Associated with the FRBR Manifestation entity.
has subproperty: Polarity (Manifestation)
name: polarity
status: New-Proposed
definition: The relationship of the colours and tones in an image to the colours and tones of the object filmed (e.g., positive, negative).
scope note: Definition source: RDA 3.15.0.1.1

Layout of tactile text
type: Property
sub property of: Layout
has subproperty: Layout of tactile text (Manifestation)
name: layoutOfTactileText
status: New-Proposed

Chronological designation of first issue or part of sequence
type: Property
sub property of: Numbering of serials
has subproperty: Chronological designation of first issue or part of sequence (Manifestation)
name: chronologicalDesignationOfFirstIssueOrPartOfSequence
status: New-Proposed
definition: Numbering presented in the form of a date (e.g., a year; year and month; month, day, and year) on the first issue or part of a sequence of numbering for a serial.

Track configuration (Manifestation)
type: Property
domain: Manifestation
sub property of: Sound characteristic (Manifestation)
sub property of: Track configuration
name: trackConfigurationManifestation
status: New-Proposed
definition: The configuration of the audio track on a sound-track film (e.g., centre track).

Key (Work)
type: Property
domain: Work
sub property of: Key
name: keyWork
status: New-Proposed
definition: The set of pitch relationships that establishes the tonal centre, or principal tonal centre, for a musical work. Key is designated by its pitch name and its mode, when it is major or minor.

Frequency (Manifestation)
type: Property
domain: Manifestation
sub property of: Frequency
name: frequencyManifestation
status: New-Proposed
definition: The intervals at which the issues or parts of a serial or the updates to an integrating resource are issued.

Parallel statement of responsibility relating to a named revision of an edition (Manifestation)
type: Property
domain: Manifestation
sub property of: Parallel statement of responsibility relating to a named revision of an edition
name: parallelStatementOfResponsibilityRelatingToANamedRevisionOfAnEditionManifestation
status: New-Proposed
definition: A statement of responsibility relating to a named revision of an edition in a language and/or script that differs from that recorded in the statement of responsibility relating to a named revision of an edition element.

Parallel distributor's name (Manifestation)
type: Property
domain: Manifestation
sub property of: Parallel distributor's name
name: parallelDistributorsNameManifestation
status: New-Proposed
definition: A distributor’s name in a language and/or script that differs from that recorded in the distributor’s name element.

Award (Expression)
type: Property
domain: Expression
sub property of: Award
name: awardExpression
status: New-Proposed
definition: A formal recognition of excellence, etc., for the content of a resource by an award- or prize-granting body.

Applied material (Manifestation)
type: Property
domain: Manifestation
sub property of: Applied material
has subproperty: Emulsion on microfilm and microfiche (Manifestation)
name: appliedMaterialManifestation
status: New-Proposed
definition: A physical or chemical substance applied to a base material of a resource.

Dissertation Or Thesis Information Encoding Scheme
type: Class
subclass of: RDA Syntax Encoding Scheme
name: DissertationOrThesisInformationEncodingScheme
status: New-Proposed
definition: This subclass has been created to define the Syntax Encoding Scheme for the RDA Dissertation or thesis information composite string. Dissertation or theses information is composed of an ordered, concatenated list of properties: - Academic degree - Granting institution or faculty - Year degree granted.

Language of the content (Expression)
type: Property
domain: Expression
sub property of: Language of the content
name: languageOfTheContentExpression
status: New-Proposed
definition: A language used to express the content of a resource.

Colour content of resource designed for persons with visual impairments
type: Property
sub property of: Colour content
has subproperty: Colour content of resource designed for persons with visual impairments (Expression)
name: colourContentOfResourceDesignedForPersonsWithVisualImpairments
status: New-Proposed
definition: The presence of colour, tone, etc., in a resource designed for persons with visual impairments. Colour content of a resource designed for persons with visual impairments is also the specific colours, tones, etc., (excluding black and white) present in a resource designed for persons with visual impairments.

Representation of Cartographic Images Class
type: Class
name: RepresentationOfCartographicImagesClass
status: New-Proposed
definition: This class has been created to define the Syntax Encoding Scheme for the RDA Representation of Cartographic Images composite string. The Representation of Cartographic Images is composed of an ordered, concatenated list of properties: - Data type - Number of objects - Object type

Publisher's number for music (Manifestation)
type: Property
domain: Manifestation
sub property of: Identifier for the manifestation
sub property of: Publisher's number for music
name: publishersNumberForMusicManifestation
status: New-Proposed
definition: A numbering designation assigned to a resource by a music publisher, appearing normally only on the title page, the cover, and/or the first page of music.

Production method for manuscript (Manifestation)
type: Property
domain: Manifestation
sub property of: Production method (Manifestation)
sub property of: Production method for manuscript
name: productionMethodForManuscriptManifestation
status: New-Proposed
definition: The process used to produce an original manuscript or a copy.

Content type
type: Property
has subproperty: Contact information (Item)
has subproperty: Content type (Expression)
name: contentType
status: New-Proposed
scope note: Definition source: RDA 7.2.0.1.1

Immediate source of acquisition of item
type: Property
domain: Item
name: immediateSourceOfAcquisitionOfItem
status: New-Proposed
definition: The source from which the agency directly acquired an item and the circumstances under which it was received.

Horizontal scale of cartographic content
type: Property
sub property of: Scale
has subproperty: Horizontal scale of cartographic content (Expression)
name: horizontalScaleOfCartographicContent
status: New-Proposed
definition: The ratio of horizontal distances in the cartographic content of a resource to the actual distances they represent.

Manufacturer's name (Manifestation)
type: Property
domain: Manifestation
sub property of: Manufacturer's name
name: manufacturersNameManifestation
status: New-Proposed
definition: The name of a person, family, or corporate body responsible for printing, duplicating, casting, etc., a resource in a published form.

Title proper (Manifestation)
type: Property
domain: Manifestation
sub property of: Title (Manifestation)
sub property of: Title proper
name: titleProperManifestation
status: New-Proposed
definition: The chief name of a resource (i.e., the title normally used when citing the resource).

Production method (Manifestation)
type: Property
domain: Manifestation
sub property of: Production method
has subproperty: Production method for tactile resource (Manifestation)
has subproperty: Production method for manuscript (Manifestation)
name: productionMethodManifestation
status: New-Proposed
definition: The process used to produce a resource.

Projection characteristic of motion picture film (Manifestation)
type: Property
domain: Manifestation
sub property of: projectionCharacteristicsOfMotionPictureFilm
has subproperty: Projection speed (Manifestation)
has subproperty: Presentation format (Manifestation)
name: projectionCharacteristicOfMotionPictureFilmManifestation
status: New-Proposed

Parallel producer's name (Manifestation)
type: Property
domain: Manifestation
sub property of: Parallel producer's name
name: parallelProducersNameManifestation
status: New-Proposed
definition: A producer’s name in a language and/or script that differs from that recorded in the producer’s name element.

Generation of videotape (Manifestation)
type: Property
domain: Manifestation
sub property of: Generation (Manifestation)
sub property of: Generation of videotape
name: generationOfVideotapeManifestation
status: New-Proposed
definition: The relationship between an original carrier of a videotape resource and the carrier of a reproduction made from the original (e.g., a show copy).

Parallel other title information of series
type: Property
has subproperty: Parallel other title information of series (Manifestation)
name: parallelOtherTitleInformationOfSeries
status: New-Proposed
definition: Other title information of a series in a language and/or script that differs from that recorded in the other title information of series element.

Parallel other title information (Manifestation)
type: Property
domain: Manifestation
sub property of: Title (Manifestation)
sub property of: Parallel other title information
name: parallelOtherTitleInformationManifestation
status: New-Proposed
definition: Other title information in a language and/or script different from that recorded in the other title information element.

Contact information (Manifestation)
type: Property
domain: Manifestation
sub property of: Contact information
name: contactInformationManifestation
status: New-Proposed
definition: Information relating to an organization, etc., from which a resource may be obtained.

Restrictions on use (Item)
type: Property
domain: Item
sub property of: Restrictions on access
name: restrictionsOnUseItem
status: New-Proposed
definition: Limitations placed on uses such as reproduction, publication, exhibition, etc.

Identifier for the manifestation
type: Property
domain: Manifestation
has subproperty: Plate number for music (Manifestation)
has subproperty: Publisher's number for music
has subproperty: Plate number for music
has subproperty: Publisher's number for music (Manifestation)
name: identifierForTheManifestation
status: New-Proposed
definition: A character string associated with a manifestation that serves to differentiate that manifestation from other manifestations.
scope note: Definition source: RDA 2.14.0.1.1

ISSN of series (Manifestation)
type: Property
domain: Manifestation
sub property of: ISSN of series
name: issnOfSeriesManifestation
status: New-Proposed
definition: The identifier assigned to a series by an ISSN registration agency.

Emulsion on microfilm and microfiche
type: Property
sub property of: Applied material
has subproperty: Emulsion on microfilm and microfiche (Manifestation)
name: emulsionOnMicrofilmAndMicrofiche
status: New-Proposed
definition: A suspension of light-sensitive chemicals used as a coating on a microfilm or microfiche (e.g., silver halide).

Dimensions (Manifestation)
type: Property
domain: Manifestation
sub property of: Dimensions
has subproperty: Dimensions of map, etc. (Manifestation)
has subproperty: Dimensions of still image (Manifestation)
name: dimensionsManifestation
status: New-Proposed
definition: The measurements of the carrier or carriers and/or the container of a resource.

Medium of performance of musical content
type: Property
has subproperty: Medium of performance of musical content (Expression)
name: mediumOfPerformanceOfMusicalContent
status: New-Proposed
definition: The instrument, instruments, voice, voices, etc., used (or intended to be used) for performance of musical content.
scope note: Definition source: 6.20.0.1.1

Designation of edition (Manifestation)
type: Property
domain: Manifestation
sub property of: Designation of edition
name: designationOfEditionManifestation
status: New-Proposed
definition: A word, character, or group of words and/or characters, identifying the edition to which a resource belongs.

Reduction ratio
type: Property
has subproperty: Reduction ration (Manifestation)
name: reductionRatio
status: New-Proposed
definition: The size of a micro-image in relation to the original from which it was produced.
scope note: Definition source: RDA 3.16.0.1.1

Parallel place of publication
type: Property
has subproperty: Parallel place of publication (Manifestation)
name: parallelPlaceOfPublication
status: New-Proposed
definition: A place of publication in a language and/or script that differs from that recorded in the place of publication element.

Scale
type: Property
has subproperty: Additional scale information
has subproperty: Vertical scale of cartographic content
has subproperty: Horizontal scale of cartographic content
has subproperty: Scale (Expression)
has subproperty: Scale of still image or three-dimensional form
name: scale
status: New-Proposed
definition: The ratio of the dimensions of an image or three-dimensional form contained or embodied in a resource to the dimensions of the entity it represents.

Coverage of the content
type: Property
has subproperty: Coverage of the content (Work)
name: coverageOfTheContent
status: New-Proposed
definition: The chronological or geographic coverage of the content of a resource.
scope note: Definition source: RDA 7.4.0.1.1

Distributor's name (Manifestation)
type: Property
domain: Manifestation
sub property of: Distributor's name
name: distributorsNameManifestation
status: New-Proposed
definition: The name of a person, family, or corporate body responsible for distributing a resource.

Form of musical notation
type: Property
sub property of: Form of notation
has subproperty: Form of musical notation (Expression)
name: formOfMusicalNotation
status: New-Proposed
definition: A set of characters and/or symbols used to express the musical content of a resource.

Manufacture statement (Manifestation)
type: Property
domain: Manifestation
range: Manufacture Statement Encoding Scheme
sub property of: Manufacture statement
name: manufactureStatementManifestation
status: New-Proposed
definition: A statement identifying the place or places of manufacture, manufacturer or manufacturers, and date or dates of manufacture of a resource.

Place of manufacture (Manifestation)
type: Property
domain: Manifestation
sub property of: Place of manufacture
name: placeOfManufactureManifestation
status: New-Proposed
definition: A place associated with the printing, duplicating, casting, etc., of a resource in a published form.

Place and date of capture (Expression)
type: Property
domain: Expression
range: Place And Date of Capture Encoding Scheme
sub property of: Place and date of capture
name: placeAndDateOfCaptureExpression
status: New-Proposed
definition: The place and date associated with the capture (i.e., recording, filming, etc.) of the content of a resource.

Numbering of serials (Manifestation)
type: Property
domain: Manifestation
sub property of: Numbering of serials
has subproperty: Numeric and/or alphabetic designation of first issue or part of sequence (Manifestation)
has subproperty: Numeric and/or alphabetic designation of last issue or part of sequence (Manifestation)
has subproperty: Alternative Numeric and/or Alphabetic Designation of Last Issue or Part of Sequence (Manifestation)
has subproperty: Alternative Chronological Designation of First Issue or Part of Sequence (Manifestation)
has subproperty: Chronological designation of first issue or part of sequence (Manifestation)
has subproperty: Alternative Numeric and/or Alphabetic Designation of First Issue or Part of Sequence (Manifestation)
has subproperty: Chronological designation of last issue or part of sequence (Manifestation)
has subproperty: Alternative Chronological Designation of Last Issue or Part of Sequence (Manifestation)
name: numberingOfSerialsManifestation
status: New-Proposed
definition: The identification of each of the issues or parts of a serial. Numbering of serials may include a numeral, a letter, any other character, or the combination of these with or without an accompanying caption (volume, number, etc.) and/or a chronological designation.

Place of distribution (Manifestation)
type: Property
domain: Manifestation
sub property of: Place of distribution
name: placeOfDistributionManifestation
status: New-Proposed
definition: A place associated with the distribution of a resource.

Plate number for music (Manifestation)
type: Property
domain: Manifestation
sub property of: Identifier for the manifestation
sub property of: Plate number for music
name: plateNumberForMusicManifestation
status: New-Proposed
definition: A numbering designation assigned to a resource by a music publisher, usually printed at the bottom of each page, and sometimes appearing also on the title page.

Place of production (Manifestation)
type: Property
domain: Manifestation
sub property of: Place of production
name: placeOfProductionManifestation
status: New-Proposed
definition: A place associated with the inscription, fabrication, construction, etc., of a resource in an unpublished form.

Numeric and/or alphabetic designation of first issue or part of sequence (Manifestation)
type: Property
domain: Manifestation
sub property of: Numbering of serials (Manifestation)
sub property of: Numeric and/or alphabetic designation of first issue or part of sequence
name: numericAndOrAlphabeticDesignationOfFirstIssueOrPartOfSequenceManifestation
status: New-Proposed
definition: Numbering presented in numeric and/or alphabetic form on the first issue or part of a sequence of numbering for a serial.

Type of recording (Manifestation)
type: Property
domain: Manifestation
sub property of: Sound characteristic (Manifestation)
sub property of: Type of recording
name: typeOfRecordingManifestation
status: New-Proposed
definition: The method used to encode audio content for playback (i.e., analog or digital).

Numeric and/or alphabetic designation of last issue or part of sequence (Manifestation)
type: Property
domain: Manifestation
sub property of: Numbering of serials (Manifestation)
sub property of: Numeric and/or alphabetic designation of last issue or part of sequence
name: numericAndOrAlphabeticDesignationOfLastIssueOrPartOfSequenceManifestation
status: New-Proposed
definition: Numbering presented in numeric and/or alphabetic form on the last issue or part of a sequence of numbering for a serial.

Other title information of series
type: Property
has subproperty: Other title information of series (Manifestation)
name: otherTitleInformationOfSeries
status: New-Proposed
definition: Information that appears in conjunction with, and is subordinate to, the title proper of a series.

Numeric and/or alphabetic designation of last issue or part of sequence
type: Property
sub property of: Numbering of serials
has subproperty: Numeric and/or alphabetic designation of last issue or part of sequence (Manifestation)
name: numericAndOrAlphabeticDesignationOfLastIssueOrPartOfSequence
status: New-Proposed
definition: Numbering presented in numeric and/or alphabetic form on the last issue or part of a sequence of numbering for a serial.

Longitude and latitude (Work)
type: Property
domain: Work
sub property of: Coordinates of cartographic content (Work)
sub property of: Longitude and latitude
name: longitudeAndLatitudeWork
status: New-Proposed
definition: A system for identifying the area covered by the cartographic content of a resource using longitude of the westernmost and easternmost boundaries and latitude of the northernmost and southernmost boundaries.

Note on numbering of serials (Manifestation)
type: Property
domain: Manifestation
sub property of: Note on manifestation or item (Manifestation)
sub property of: Note on numbering of serials
name: noteOnNumberingOfSerialsManifestation
status: New-Proposed
definition: A note providing information on the numbering of the first and/or last issue or part, on complex or irregular numbering (including numbering errors), or on the period covered by a volume, issue, part, etc.

Distribution Statement Encoding Scheme
type: Class
subclass of: RDA Syntax Encoding Scheme
name: DistributionStatementEncodingScheme
status: New-Proposed
definition: This subclass has been created to define the Syntax Encoding Scheme for the RDA Distribution Statement composite string. The Distribution Statement is composed of an ordered, concatenated list of properties: - Place of distribution - Parallel place of distribution - Distributor's name - Parallel distributor's name - Date of distribution

History of the work
type: Property
domain: Work
name: historyOfTheWork
status: New-Proposed
definition: Information pertaining to the history of a work.
scope note: Definition source: RDA 6.9.0.1.1

Extent of cartographic resource
type: Property
sub property of: Extent
has subproperty: Extent of cartographic resource (Item)
has subproperty: Extent of cartographic resource (Manifestation)
name: extentOfCartographicResource
status: New-Proposed
definition: The number and type of units and/or subunits making up a cartographic resource.

Note on changes in carrier characteristics
type: Property
sub property of: Note
has subproperty: Note on changes in carrier characteristics (Manifestation)
name: noteOnChangesInCarrierCharacteristics
status: New-Proposed
definition: A note on changes in carrier characteristics that occur in subsequent issues or parts of a resource issued in successive parts or between iterations of an integrating resource.

Key title (Manifestation)
type: Property
domain: Manifestation
sub property of: Title (Manifestation)
sub property of: Key title
name: keyTitleManifestation
status: New-Proposed
definition: The unique name assigned to a resource by an ISSN registration agency.

Generation of microform (Manifestation)
type: Property
domain: Manifestation
sub property of: Generation (Manifestation)
sub property of: Generation of microform
name: generationOfMicroformManifestation
status: New-Proposed
definition: The relationship between an original carrier of a microform resource and the carrier of a reproduction made from the original (e.g., a printing master).

Mode of issuance
type: Property
has subproperty: Mode of issuance (Manifestation)
name: modeOfIssuance
status: New-Proposed
definition: A categorization reflecting whether a resource is issued in one or more parts, the way it is updated, and its intended termination.

Colour of three-dimensional form
type: Property
sub property of: Colour content
has subproperty: Colour of three-dimensional form (Expression)
name: colourOfThree-dimensionalForm
status: New-Proposed
definition: The presence of colour, tone, etc., in a three-dimensional form or forms contained in a resource. Colour of three-dimensional form is also the specific colours, tones, etc., (including black and white) present in a three-dimensional form or forms contained in a resource.

Extent of still image
type: Property
sub property of: Extent
has subproperty: Extent of still image (Item)
has subproperty: Extent of still image (Manifestation)
name: extentOfStillImage
status: New-Proposed
definition: The number and type of units and/or subunits making up a resource consisting of one or more still images.

Language of the content
type: Property
has subproperty: Language of the content (Expression)
name: languageOfTheContent
status: New-Proposed
definition: A language used to express the content of a resource.
scope note: Definition source: RDA 7.10.0.1.1

Note on edition statement (Manifestation)
type: Property
domain: Manifestation
sub property of: Note on manifestation or item (Manifestation)
sub property of: Note on edition statement
name: noteOnEditionStatementManifestation
status: New-Proposed
definition: A note providing information on the source of an edition statement, on edition statements relating to issues, parts, etc., on changes in edition statements, or other information relating to an edition statement.

Coordinates of cartographic content
type: Property
has subproperty: Right ascension and declination
has subproperty: Longitude and latitude
has subproperty: Coordinates of cartographic content (Work)
has subproperty: Strings of coordinate pairs
name: coordinatesOfCartographicContent
status: New-Proposed
definition: A mathematical system for identifying the area covered by the cartographic content of a resource. Coordinates may be expressed by means of longitude and latitude on the surface of planets or by the angles of right ascension and declination for celestial charts.

Form of notation (Expression)
type: Property
domain: Expression
sub property of: Form of notation
has subproperty: Form of notated movement (Expression)
has subproperty: Form of tactile notation (Expression)
has subproperty: Script (Expression)
name: formOfNotationExpression
status: New-Proposed
definition: A set of characters and/or symbols used to express the content of a resource.

Equipment or system requirement
type: Property
name: equipmentOrSystemRequirement
status: New-Proposed
definition: The equipment or system required for use, playback, etc., of an analog, digital, etc., resource.

Parallel distributor's name
type: Property
has subproperty: Parallel distributor's name (Manifestation)
name: parallelDistributorsName
status: New-Proposed
definition: A distributor’s name in a language and/or script that differs from that recorded in the distributor’s name element.

Note on manufacture statement (Manifestation)
type: Property
domain: Manifestation
sub property of: Note on manifestation or item (Manifestation)
sub property of: Note on manufacture statement
name: noteOnManufactureStatementManifestation
status: New-Proposed
definition: A note providing details on place of manufacture, manufacturer, or date of manufacture, or information on changes in the place of manufacture, manufacturer, or manufacturer’s name.

Base material for microfilm, microfiche, photographic film, and motion picture film
type: Property
sub property of: Base material
has subproperty: Base material for microfilm, microfiche, photographic film, and motion picture film (Manifestation)
name: baseMaterialforMicrofilmMicrofichePhotographicFilmAndMotionPictureFilm
status: New-Proposed
definition: The underlying physical material of a microfilm, microfiche, photographic film, or motion picture film resource.

Accessibility content
type: Property
has subproperty: Accessibility content (Expression)
name: accessibilityContent
status: New-Proposed
definition: Content that assists those with a sensory impairment in the greater understanding of content which their impairment prevents them fully seeing or hearing.

Copyright date (Manifestation)
type: Property
domain: Manifestation
sub property of: Copyright date
name: copyrightDateManifestation
status: New-Proposed
definition: A date associated with a claim of protection under copyright or a similar regime.

Place and date of capture
type: Property
has subproperty: Place and date of capture (Expression)
name: placeAndDateOfCapture
status: New-Proposed
definition: The place and date associated with the capture (i.e., recording, filming, etc.) of the content of a resource.
scope note: Definition source: RDA 7.9.0.1.1.

Parallel producer's name
type: Property
has subproperty: Parallel producer's name (Manifestation)
name: parallelProducersName
status: New-Proposed
definition: A producer’s name in a language and/or script that differs from that recorded in the producer’s name element.

Parallel title proper (Manifestation)
type: Property
domain: Manifestation
sub property of: Title (Manifestation)
sub property of: Parallel title proper
name: parallelTitleProperManifestation
status: New-Proposed
definition: The title proper in another language and/or script.

Place of capture
type: Property
has subproperty: Place of capture (Expression)
name: placeOfCapture
status: New-Proposed
definition: The place associated with the capture (i.e., recording, filming, etc.) of the content of a resource.

Right ascension and declination (Work)
type: Property
domain: Work
sub property of: Coordinates of cartographic content (Work)
sub property of: Right ascension and declination
name: rightAscensionAndDeclinationWork
status: New-Proposed
definition: A system for identifying the location of a celestial object in the sky covered by the cartographic content of a resource using the angles of right ascension and declination.

Playing speed
type: Property
sub property of: Sound characteristic
has subproperty: Playing speed (Manifestation)
name: playingSpeed
status: New-Proposed
definition: The speed at which an audio carrier must be operated to produce the sound intended.

Place of origin of the work
type: Property
domain: Work
name: placeOfOriginOfTheWork
status: New-Proposed
definition: The country or other territorial jurisdiction from which a work originated.
scope note: Definition source: RDA 6.6.0.1.1

Parallel statement of responsibility relating to title proper (Manifestation)
type: Property
domain: Manifestation
sub property of: Statement of responsibility (Manifestation)
sub property of: Parallel statement of responsibility relating to title proper
name: parallelStatementOfResponsibilityRelatingToTitleProperManifestation
status: New-Proposed
definition: A statement of responsibility relating to title proper in a language and/or script that differs from that recorded in the statement of responsibility relating to title proper element.

Distributor's name
type: Property
has subproperty: Distributor's name (Manifestation)
name: distributorsName
status: New-Proposed
definition: The name of a person, family, or corporate body responsible for distributing a resource.

Generation of digital resource
type: Property
sub property of: Generation
has subproperty: Generation of digital resource (Manifestation)
name: generationOfDigitalResource
status: New-Proposed
definition: The relationship between an original carrier of a digital resource and the carrier of a reproduction made from the original (e.g., a derivative master).

Publisher's name (Manifestation)
type: Property
domain: Manifestation
sub property of: Publisher's name
name: publishersNameManifestation
status: New-Proposed
definition: The name of a person, family, or corporate body responsible for publishing, releasing, or issuing a resource.

Later title proper
type: Property
sub property of: Title
name: laterTitleProper
status: New-Proposed
definition: A title proper appearing on a later issue or part of a multipart monograph or serial that differs from that on the first or earliest issue or part.

Groove characteristic (Manifestation)
type: Property
domain: Manifestation
sub property of: Sound characteristic (Manifestation)
sub property of: Groove characteristic
name: grooveCharacteristicManifestation
status: New-Proposed
definition: The groove width of an analog disc or the groove pitch of an analog cylinder.

Uniform resource locator
type: Property
has subproperty: Uniform resource locator (Item)
has subproperty: Uniform resource locator (Manifestation)
name: uniformResourceLocator
status: New-Proposed
definition: The address of a remote access resource.

Parallel statement of responsibility relating to the edition (Manifestation)
type: Property
domain: Manifestation
sub property of: Parallel statement of responsibility relating to the edition
name: parallelStatementOfResponsibilityRelatingToTheEditionManifestation
status: New-Proposed
definition: A statement of responsibility relating to the edition in a language and/or script that differs from that recorded in the statement of responsibility relating to the edition element.

Illustrative content (Expression)
type: Property
domain: Expression
sub property of: Illustrative content
name: illustrativeContentExpression
status: New-Proposed
definition: Content designed to illustrate the primary content of a resource.

Note on extent of item
type: Property
domain: Item
sub property of: Note on manifestation or item (Item)
sub property of: Note
name: noteOnExtentOfItem
status: New-Proposed
definition: A note providing information on the extent of the specific item being described that is not recorded formally as part of the extent element.

Identifier for the expression
type: Property
domain: Expression
name: identifierForTheExpression
status: New-Proposed
definition: A character string uniquely associated with an expression, or with a surrogate for an expression (e.g., an authority record), that serves to differentiate that expression from other expressions.
scope note: Definition source: RDA 6.16.0.1.1

Plate number for music
type: Property
comment: See also Publisher's number for music.
sub property of: Identifier for the manifestation
has subproperty: Plate number for music (Manifestation)
name: plateNumberForMusic
status: New-Proposed
definition: A numbering designation assigned to a resource by a music publisher, usually printed at the bottom of each page, and sometimes appearing also on the title page.
scope note: Definition source: RDA 2.14.2.1.2

Artistic and/or technical credit (Expression)
type: Property
domain: Expression
sub property of: Artistic and/or technical credit
name: artisticAndOrTechnicalCreditExpression
status: New-Proposed
definition: A listing of persons, families, or corporate bodies making contributions to the artistic and/or technical production of a resource.

Form of tactile notation
type: Property
sub property of: Form of notation
has subproperty: Form of tactile notation (Expression)
name: formOfTactileNotation
status: New-Proposed
definition: A set of characters and/or symbols used to express the content of a resource in a form that can be perceived through touch.

Date of manufacture
type: Property
has subproperty: Date of manufacture (Manifestation)
name: dateOfManufacture
status: New-Proposed
definition: A date associated with the printing, duplicating, casting, etc., of a resource in a published form.

Signatory to a treaty, etc.
type: Property
has subproperty: Signatory to a treaty, etc. (Work)
name: signatoryToATreatyEtc
status: New-Proposed
definition: A government or other party that has formally signed a treaty, etc., as an adherent to its terms and conditions.
scope note: Definition from: 6.27.0.1.1

Date of expression
type: Property
domain: Expression
name: dateOfExpression
status: New-Proposed
definition: The earliest date associated with an expression.
scope note: Definition source: RDA 6.32.0.1.1

Duration (Expression)
type: Property
domain: Expression
sub property of: Duration
name: durationExpression
status: New-Proposed
definition: The playing time, running time, etc., of the content of a resource. Duration also includes performance time for a resource containing notated music or notated movement.

Distribution statement
type: Property
has subproperty: Distribution statement (Manifestation)
name: distributionStatement
status: New-Proposed
definition: A statement identifying the place or places of distribution, distributor or distributors, and date or dates of distribution of a resource.

Statement of responsibility relating to series (Manifestation)
type: Property
domain: Manifestation
sub property of: Statement of responsibility relating to series
name: statementOfResponsibilityRelatingToSeriesManifestation
status: New-Proposed
definition: A statement relating to the identification of any persons, families, or corporate bodies responsible for a series.

Extent of text (Item)
type: Property
domain: Item
sub property of: Extent (Item)
sub property of: Extent of text
name: extentOfTextItem
status: New-Proposed
definition: The number and type of units and/or subunits making up a resource consisting of text, with or without accompanying illustrations

Chronological designation of last issue or part of sequence (Manifestation)
type: Property
domain: Manifestation
sub property of: Numbering of serials (Manifestation)
sub property of: Chronological designation of last issue or part of sequence
name: chronologicalDesignationOfLastIssueOrPartOfSequenceManifestation
status: New-Proposed
definition: Numbering presented in the form of a date (e.g., a year; year and month; month, day, and year) on the last issue or part of a sequence of numbering for a serial.

Projection speed (Manifestation)
type: Property
domain: Manifestation
sub property of: Projection characteristic of motion picture film (Manifestation)
sub property of: Projection speed
name: projectionSpeedManifestation
status: New-Proposed
definition: The speed at which a projected carrier must be operated to produce the moving image intended.

Edition Statement Encoding Scheme
type: Class
subclass of: RDA Syntax Encoding Scheme
name: EditionStatementEncodingScheme
status: New-Proposed
definition: This subclass has been created to define the Syntax Encoding Scheme for the RDA Edition Statement composite string. The Edition Statement is composed of an ordered, concatenated list of properties: - Designation of edition - Parallel designation of edition - Statement of responsibility relating to the edition - Parallel statement of responsibility relating to the edition - Designation of a named revision of an edition - Parallel designation of a named revision of an edition - Statement of responsibility relating to a named revision of an edition - Parallel statement of responsibility relating to a named revision of an edition.

Generation of videotape
type: Property
sub property of: Generation
has subproperty: Generation of videotape (Manifestation)
name: generationOfVideotape
status: New-Proposed
definition: The relationship between an original carrier of a videotape resource and the carrier of a reproduction made from the original (e.g., a show copy).

Title (Manifestation)
type: Property
domain: Manifestation
sub property of: Title
has subproperty: Title proper (Manifestation)
has subproperty: Parallel title proper (Manifestation)
has subproperty: Earlier title proper (Manifestation)
has subproperty: Other title information (Manifestation)
has subproperty: Later title proper (Manifestation)
has subproperty: Abbreviated title (Manifestatiion)
has subproperty: Key title (Manifestation)
has subproperty: Parallel other title information (Manifestation)
has subproperty: Variant title (Manifestation)
name: titleManifestation
status: New-Proposed
definition: A word, character, or group of words and/or characters that names a resource or a work contained in it.

Strings of coordinate pairs (Work)
type: Property
domain: Work
sub property of: Coordinates of cartographic content (Work)
sub property of: Strings of coordinate pairs
name: stringsOfCoordinatePairsWork
status: New-Proposed
definition: A system for identifying the precise area covered by the cartographic content of a resource using coordinates for each vertex of a polygon.

Colour of still image (Expression)
type: Property
domain: Expression
sub property of: Colour content (Expression)
sub property of: Colour of still image
name: colourOfStillImageExpression
status: New-Proposed
definition: The presence of colour, tone, etc., in a still image or images contained in a resource. Colour of still image is also the specific colours, tones, etc., (including black and white) present in a still image or images contained in a resource.

Colour content of resource designed for persons with visual impairments (Expression)
type: Property
domain: Expression
sub property of: Colour content (Expression)
sub property of: Colour content of resource designed for persons with visual impairments
name: colourContentOfResourceDesignedForPersonsWithVisualImpairmentsExpression
status: New-Proposed
definition: The presence of colour, tone, etc., in a resource designed for persons with visual impairments. Colour content of a resource designed for persons with visual impairments is also the specific colours, tones, etc., (excluding black and white) present in a resource designed for persons with visual impairments.

Aspect ratio
type: Property
has subproperty: Aspect ratio (Expression)
name: aspectRatio
status: New-Proposed
definition: The ratio of the width to the height of a moving image.

Note on publication statement
type: Property
sub property of: Note
has subproperty: Note on publication statement (Manifestation)
name: noteOnPublicationStatement
status: New-Proposed
definition: A note providing details on place of publication, publisher, or date of publication, information on changes in the place of publication, publisher, or publisher’s name, or on suspension of publication.

Duration
type: Property
has subproperty: Duration (Expression)
name: duration
status: New-Proposed
definition: The playing time, running time, etc., of the content of a resource. Duration also includes performance time for a resource containing notated music or notated movement.

Statement of responsibility relating to a named revision of an edition (Manifestation)
type: Property
domain: Manifestation
sub property of: Statement of responsibility relating to a named revision of an edition
name: statementOfResponsibilityRelatingToANamedRevisionOfAnEditionManifestatiion
status: New-Proposed
definition: A statement relating to the identification of any persons, families, or corporate bodies responsible for a named revision of an edition.

Parallel other title information
type: Property
sub property of: Title
has subproperty: Parallel other title information (Manifestation)
name: parallelOtherTitleInformation
status: New-Proposed
definition: Other title information in a language and/or script different from that recorded in the other title information element.

Numbering within subseries (Manifestation)
type: Property
domain: Manifestation
sub property of: Numbering within subseries
name: numberingWithinSubseriesManifestation
status: New-Proposed
definition: A designation of the sequencing of a part or parts within a subseries. Numbering within series may include a numeral, a letter, any other character, or the combination of these with or without an accompanying caption (volume, number, etc.) and/or a chronological designation.

Supplementary content (Expression)
type: Property
domain: Expression
sub property of: Supplementary content
name: supplementaryContentExpression
status: New-Proposed
definition: Content (e.g., an index, bibliography, or appendix) designed to supplement the primary content of a resource.

Generation
type: Property
has subproperty: Generation (Manifestation)
has subproperty: Generation of videotape
has subproperty: Generation of audio recording
has subproperty: Generation of motion picture film
has subproperty: Generation of microform
has subproperty: Generation of digital resource
name: generation
status: New-Proposed
definition: The relationship between an original carrier and the carrier of a reproduction made from the original (e.g., a first generation camera master, a second generation printing master).
scope note: Definition source: RDA 3.9.0.1.1

Encoding format (Manifestation)
type: Property
domain: Manifestation
sub property of: Digital file characteristic (Manifestation)
sub property of: Encoding format
name: encodingFormatManifestation
status: New-Proposed
definition: A schema, standard, etc., used to encode the digital content of a resource.

Medium of performance of musical content (Expression)
type: Property
domain: Expression
sub property of: Medium of performance of musical content
name: mediumOfPerformanceOfMusicalContentExpression
status: New-Proposed
definition: The instrument, instruments, voice, voices, etc., used (or intended to be used) for performance of musical content.

Layout of tactile musical notation
type: Property
sub property of: Layout
has subproperty: Layout of tactile musical notation (Manifestation)
name: layoutOfTactileMusicalNotation
status: New-Proposed
definition: The arrangement of tactile musical notation in a resource (e.g., bar by bar, line by line).

Statement of responsibility (Manifestation)
type: Property
domain: Manifestation
sub property of: Statement of responsibility
has subproperty: Parallel statement of responsibility relating to title proper (Manifestation)
name: statementOfResponsibilityManifestation
status: New-Proposed
definition: A statement relating to the identification and/or function of any persons, families, or corporate bodies responsible for the creation of, or contributing to the realization of, the intellectual or artistic content of a resource.

Date of work
type: Property
domain: Work
name: dateOfWork
status: New-Proposed
definition: The earliest date associated with a work.
scope note: Definition source: RDA 6.5.0.1.1