Published
type: Concept

RDA Expression properties
note: Properties derived from RDA elements and relationship designators with the domain of RDA Expression.

has content type
name: contentType
status: Published
type: Property
domain: C10006
sub property of: P60049
definition: Relates an expression to a categorization reflecting the fundamental form of communication in which the content is expressed and the human sense through which it is intended to be perceived.
scope note: For content expressed in the form of an image or images, content type also reflects the number of spatial dimensions in which the content is intended to be perceived and the perceived presence or absence of movement.

has identifier for the expression
name: identifierForTheExpression
status: Published
type: Property
domain: C10006
sub property of: P60052
definition: Relates an expression to a character string uniquely associated with an expression, or with a surrogate for an expression (e.g., an authority record).
scope note: The identifier serves to differentiate that expression from other expressions.

has other distinguishing characteristic of the expression
name: otherDistinguishingCharacteristicOfTheExpression
status: Published
type: Property
domain: C10006
sub property of: P60054
definition: Relates an expression to a characteristic other than content type, language of expression, or date of expression.
scope note: It serves to differentiate an expression from another expression of the same work.

has date of capture
name: dateOfCapture
status: Published
type: Property
domain: C10006
sub property of: P60074
definition: Relates an expression to a date or range of dates associated with the capture (i.e., recording, filming, etc.) of the content of a resource.

has award
name: award
status: Published
type: Property
domain: C10006
sub property of: P60090
definition: Relates an expression to a formal recognition of excellence, etc., given by an award- or prize-granting body, for the content of a resource.

has language of expression
name: languageOfExpression
status: Published
type: Property
domain: C10006
sub property of: P60099
definition: Relates an expression to a language in which a work is expressed.

has language of the content
name: languageOfTheContent
status: Published
type: Property
domain: C10006
sub property of: P60099
definition: Relates an expression to a language used to express the content of a resource.

has artistic and/or technical credit
name: artisticAndOrTechnicalCredit
status: Published
type: Property
domain: C10006
sub property of: P60105
definition: Relates an expression to a listing of persons, families, or corporate bodies making contributions to the artistic and/or technical production of a resource.

is adapted as motion picture (expression)
name: adaptedAsAMotionPictureExpression
status: Published
type: Property
domain: C10006
range: C10006
sub property of: is adapted as (expression)
sub property of: P60110
inverse of: is motion picture adaptation of (expression)
definition: Relates an expression to a motion picture based on the source expression.

has note on changes in content characteristics
name: noteOnChangesInContentCharacteristics
status: Published
type: Property
domain: C10006
sub property of: has note on expression
sub property of: P60123
definition: Relates an expression to a note on changes in content characteristics that occur in subsequent issues or parts of a resource issued in successive parts or between iterations of an integrating resource.

has conductor
name: conductor
status: Published
type: Property
domain: C10006
range: C10002
sub property of: has performer
sub property of: P60141
inverse of: P50070
definition: Relates an expression to a performer contributing to an expression of a musical work by leading a performing group (orchestra, chorus, opera, etc.) in a musical or dramatic presentation, etc.

has actor
has subproperty: has voice actor
name: actor
status: Published
type: Property
domain: C10006
range: C10002
sub property of: has performer
sub property of: P60142
inverse of: P50071
definition: Relates an expression to a performer contributing to an expression of a work by acting as a cast member or player in a musical or dramatic presentation, etc.

has on-screen presenter
name: onScreenPresenter
status: Published
type: Property
domain: C10006
range: C10002
sub property of: has performer
sub property of: P60143
inverse of: P50072
definition: Relates an expression to a performer contributing to an expression of a work by appearing on screen to provide contextual or background information.
scope note: An on-screen presenter may appear in nonfiction moving image materials or in introductions to fiction moving image materials.

has dancer
name: dancer
status: Published
type: Property
domain: C10006
range: C10002
sub property of: has performer
sub property of: P60144
inverse of: P50073
definition: Relates an expression to a performer contributing to an expression of a work by dancing in a musical, dramatic, etc., presentation.

has teacher
name: teacher
status: Published
type: Property
domain: C10006
range: C10002
sub property of: has performer
sub property of: P60145
inverse of: P50074
definition: Relates an expression to a performer contributing to an expression of a work by giving instruction or providing a demonstration.

has host
name: host
status: Published
type: Property
domain: C10006
range: C10002
sub property of: has performer
sub property of: P60146
inverse of: P50075
definition: Relates an expression to a performer contributing to an expression of a work by leading a program (often broadcast) that includes other guests, performers, etc. (e.g., talk show host).

has moderator
name: moderator
status: Published
type: Property
domain: C10006
range: C10002
sub property of: has performer
sub property of: P60147
inverse of: P50076
definition: Relates an expression to a performer contributing to an expression of a work by leading a program (often broadcast) where topics are discussed, usually with participation of experts in fields related to the discussion.

has puppeteer
name: puppeteer
status: Published
type: Property
domain: C10006
range: C10002
sub property of: has performer
sub property of: P60148
inverse of: P50077
definition: Relates an expression to a performer contributing to an expression of a work by manipulating, controlling, or directing puppets or marionettes in a moving image production or a musical or dramatic presentation or entertainment.

has panelist
name: panelist
status: Published
type: Property
domain: C10006
range: C10002
sub property of: has performer
sub property of: P60149
inverse of: P50078
definition: Relates an expression to a performer contributing to an expression of a work by participating in a program (often broadcast) where topics are discussed, usually with participation of experts in fields related to the discussion.

has instrumentalist
name: instrumentalist
status: Published
type: Property
domain: C10006
range: C10002
sub property of: has performer
sub property of: P60150
inverse of: P50079
definition: Relates an expression to a performer contributing to an expression of a work by playing a musical instrument.

has commentator
name: commentator
status: Published
type: Property
domain: C10006
range: C10002
sub property of: has performer
sub property of: P60151
inverse of: P50080
definition: Relates an expression to a performer contributing to an expression of a work by providing interpretation, analysis, or a discussion of the subject matter on a recording, film, or other audiovisual medium.

has narrator
name: narrator
status: Published
type: Property
domain: C10006
range: C10002
sub property of: has performer
sub property of: P60153
inverse of: P50081
definition: Relates an expression to a performer contributing to an expression of a work by reading or speaking in order to give an account of an act, occurrence, course of events, etc.

has storyteller
name: storyteller
status: Published
type: Property
domain: C10006
range: C10002
sub property of: has performer
sub property of: P60154
inverse of: P50082
definition: Relates an expression to a performer contributing to an expression of a work by relaying a creator’s original story with dramatic or theatrical interpretation.

has speaker
name: speaker
status: Published
type: Property
domain: C10006
range: C10002
sub property of: has performer
sub property of: P60155
inverse of: P50083
definition: Relates an expression to a performer contributing to an expression of a work by speaking words, such as a lecture, speech, etc.

has singer
name: singer
status: Published
type: Property
domain: C10006
range: C10002
sub property of: has performer
sub property of: P60156
inverse of: P50084
definition: Relates an expression to a performer contributing to an expression of a work by using his/her/their voice, with or without instrumental accompaniment, to produce music.
scope note: A singer’s performance may or may not include actual words.

has composer (expression)
name: composerExpression
status: Published
type: Property
domain: C10006
range: C10002
sub property of: has contributor
sub property of: P60426
inverse of: P50134
definition: Relates an expression to a person, family, or corporate body contributing to an expression by adding music to a work that originally lacked it, by composing new music to substitute for the original music, or by composing new music to supplement the existing music.

has surveyor
name: surveyor
status: Published
type: Property
domain: C10006
range: C10002
sub property of: has contributor
sub property of: P60377
inverse of: P50135
definition: Relates an expression to a person, family, or corporate body contributing to an expression of a cartographic work by providing measurements or dimensional relationships for the geographic area represented.

has animator
name: animator
status: Published
type: Property
domain: C10006
range: C10002
sub property of: has contributor
sub property of: P60378
inverse of: P50136
definition: Relates an expression to a person, family, or corporate body contributing to an expression of a moving image work or computer program by giving apparent movement to inanimate objects or drawings.

has arranger of music
name: arrangerOfMusic
status: Published
type: Property
domain: C10006
range: C10002
sub property of: has contributor
sub property of: P60379
inverse of: P50137
definition: Relates an expression to a person, family, or corporate body contributing to an expression of a musical work by rewriting the composition for a medium of performance different from that for which the work was originally intended.
scope note: An arranger of music may also modify the work for the same medium of performance, etc., keeping the musical substance of the original composition essentially unchanged.

has writer of added text
has subproperty: has writer of added lyrics
name: writerOfAddedText
status: Published
type: Property
domain: C10006
range: C10002
sub property of: has writer of supplementary textual content
sub property of: P60380
inverse of: P50138
definition: Relates an expression to a person, family, or corporate body contributing to an expression of a primarily non-textual work by providing text for the non-textual work (e.g., writing captions for photographs, descriptions of maps).

has stage director
name: stageDirector
status: Published
type: Property
domain: C10006
range: C10002
sub property of: has contributor
sub property of: P60399
inverse of: P50139
definition: Relates an expression to a person, family, or corporate body contributing to an expression of a stage work through the general management and supervision of a performance.

has interviewer (expression)
name: interviewerExpression
status: Published
type: Property
domain: C10006
range: C10002
sub property of: has contributor
sub property of: P60430
inverse of: P50140
definition: Relates an expression to a person, family, or corporate body contributing to an expression of a work by acting as an interviewer, reporter, pollster, or some other information gathering agent.

has draftsman
name: draftsman
status: Published
type: Property
domain: C10006
range: C10002
sub property of: has contributor
sub property of: P60381
inverse of: P50141
definition: Relates an expression to a person, family, or corporate body contributing to an expression of a work by an architect, inventor, etc., by making detailed plans or drawings for buildings, ships, aircraft, machines, objects, etc.

has transcriber
name: transcriber
status: Published
type: Property
domain: C10006
range: C10002
sub property of: has contributor
sub property of: P60382
inverse of: P50142
definition: Relates an expression to a person, family, or corporate body contributing to an expression of a work by changing it from one system of notation to another.

has musical director
name: musicalDirector
status: Published
type: Property
domain: C10006
range: C10002
sub property of: has contributor
sub property of: P60383
inverse of: P50143
definition: Relates an expression to a person, family, or corporate body contributing to an expression of a work by coordinating the activities of the composer, the sound editor, and sound mixers for a moving image production or for a musical or dramatic presentation or entertainment.

has costume designer
name: costumeDesigner
status: Published
type: Property
domain: C10006
range: C10002
sub property of: has contributor
sub property of: P60384
inverse of: P50144
definition: Relates an expression to a person, family, or corporate body contributing to an expression of a work by designing the costumes for a moving image production or for a musical or dramatic presentation or entertainment.

has translator
name: translator
status: Published
type: Property
domain: C10006
range: C10002
sub property of: has contributor
sub property of: P60385
inverse of: P50145
definition: Relates an expression to a person, family, or corporate body contributing to an expression of a work by expressing the original text of the work in a language different from that of the original work.
scope note: A translator may also translate a text from an older form of a language into the modern form.

has art director
name: artDirector
status: Published
type: Property
domain: C10006
range: C10002
sub property of: has contributor
sub property of: P60386
inverse of: P50146
definition: Relates an expression to a person, family, or corporate body contributing to an expression of a work by overseeing the artists and craftspeople who build the sets for moving image productions.

has performer
has subproperty: has conductor
has subproperty: has actor
has subproperty: has on-screen presenter
has subproperty: has dancer
has subproperty: has teacher
has subproperty: has host
has subproperty: has moderator
has subproperty: has puppeteer
has subproperty: has panelist
has subproperty: has instrumentalist
has subproperty: has commentator
has subproperty: has narrator
has subproperty: has storyteller
has subproperty: has speaker
has subproperty: has singer
name: performer
status: Published
type: Property
domain: C10006
range: C10002
sub property of: has contributor
sub property of: P60387
inverse of: P50147
definition: Relates an expression to a person, family, or corporate body contributing to an expression of a work by performing music, acting, dancing, speaking, etc., often in a musical or dramatic presentation, etc.

has court reporter
name: courtReporter
status: Published
type: Property
domain: C10006
range: C10002
sub property of: P60388
inverse of: P50148
definition: Relates an expression to a person, family, or corporate body contributing to an expression of a work by preparing a court's opinions for publication.

has writer of preface
name: writerOfPreface
status: Published
type: Property
domain: C10006
range: C10002
sub property of: has writer of supplementary textual content
sub property of: P60389
inverse of: P50149
definition: Relates an expression to a person, family, or corporate body contributing to an expression of a work by providing a preface to the original work.

has cartographer (expression)
name: cartographerExpression
status: Published
type: Property
domain: C10006
range: C10002
sub property of: has contributor
sub property of: P60425
inverse of: P50150
definition: Relates an expression to a person, family, or corporate body contributing to an expression of a work by providing additional cartography, or by modifying the previous cartography.

has choreographer (expression)
name: choreographerExpression
status: Published
type: Property
domain: C10006
range: C10002
sub property of: has contributor
sub property of: P60433
inverse of: P50151
definition: Relates an expression to a person, family, or corporate body contributing to an expression of a work by providing additional choreography, or by modifying the previous choreography.

has writer of added commentary
name: writerOfAddedCommentary
status: Published
type: Property
domain: C10006
range: C10002
sub property of: has writer of supplementary textual content
sub property of: P60390
inverse of: P50152
definition: Relates an expression to a person, family, or corporate body contributing to an expression of a work by providing an interpretation or critical explanation of the original work.

has writer of introduction
name: writerOfIntroduction
status: Published
type: Property
domain: C10006
range: C10002
sub property of: has writer of supplementary textual content
sub property of: P60391
inverse of: P50153
definition: Relates an expression to a person, family, or corporate body contributing to an expression of a work by providing an introduction to the original work.

has writer of supplementary textual content
has subproperty: has writer of added text
has subproperty: has writer of preface
has subproperty: has writer of added commentary
has subproperty: has writer of introduction
name: writerOfSupplementaryTextualContent
status: Published
type: Property
domain: C10006
range: C10002
sub property of: has contributor
sub property of: P60392
inverse of: P50154
definition: Relates an expression to a person, family, or corporate body contributing to an expression of a work by providing supplementary textual content (e.g., an appendix, an introduction, a preface) to the original work.

has interviewee (expression)
name: intervieweeExpression
status: Published
type: Property
domain: C10006
range: C10002
sub property of: has contributor
sub property of: P60432
inverse of: P50155
definition: Relates an expression to a person, family, or corporate body contributing to an expression of a work by responding to an interviewer, usually a reporter, pollster, or some other information gathering agent.

has editor
name: editor
status: Published
type: Property
domain: C10006
range: C10002
sub property of: has contributor
sub property of: P60393
inverse of: P50156
definition: Relates an expression to a person, family, or corporate body contributing to an expression of a work by revising or clarifying the content, e.g., adding an introduction, notes, or other critical matter.
scope note: An editor may also prepare an expression of a work for production, publication, or distribution.

has abridger
name: abridger
status: Published
type: Property
domain: C10006
range: C10002
sub property of: has contributor
sub property of: P60394
inverse of: P50157
definition: Relates an expression to a person, family, or corporate body contributing to an expression of a work by shortening or condensing the original work but leaving the nature and content of the original work substantially unchanged.

has recording engineer
name: recordingEngineer
status: Published
type: Property
domain: C10006
range: C10002
sub property of: has contributor
sub property of: P60395
inverse of: P50158
definition: Relates an expression to a person, family, or corporate body contributing to an expression of a work by supervising the technical aspects of a sound or video recording session.

has illustrator
name: illustrator
status: Published
type: Property
domain: C10006
range: C10002
sub property of: has contributor
sub property of: P60396
inverse of: P50159
definition: Relates an expression to a person, family, or corporate body contributing to an expression of a work by supplementing the primary content with drawings, diagrams, photographs, etc.

has recordist
name: recordist
status: Published
type: Property
domain: C10006
range: C10002
sub property of: has contributor
sub property of: P60397
inverse of: P50160
definition: Relates an expression to a person, family, or corporate body contributing to an expression of a work by using a recording device to capture sound and/or video during a recording session, including field recordings of natural sounds, folkloric events, music, etc.

has contributor
has subproperty: has composer (expression)
has subproperty: has surveyor
has subproperty: has animator
has subproperty: has arranger of music
has subproperty: has stage director
has subproperty: has interviewer (expression)
has subproperty: has draftsman
has subproperty: has transcriber
has subproperty: has musical director
has subproperty: has costume designer
has subproperty: has translator
has subproperty: has art director
has subproperty: has performer
has subproperty: has cartographer (expression)
has subproperty: has choreographer (expression)
has subproperty: has writer of supplementary textual content
has subproperty: has interviewee (expression)
has subproperty: has editor
has subproperty: has abridger
has subproperty: has recording engineer
has subproperty: has illustrator
has subproperty: has recordist
has subproperty: has editor of moving image work
has subproperty: has production designer
has subproperty: has minute taker
name: contributor
status: Published
type: Property
domain: C10006
range: C10002
sub property of: P60398
inverse of: P50161
definition: Relates an expression to a person, family, or corporate body contributing to an expression.
scope note: Contributors include editors, translators, arrangers of music, performers, etc.

has presenter
name: presenter
status: Published
type: Property
domain: C10006
range: C10002
sub property of: P60419
inverse of: P50180
definition: Relates an expression to a person, family, or corporate body mentioned in an "X presents" credit for moving image materials and who is probably associated with production, finance, or distribution in some way.

has editor of moving image work
name: editorOfMovingImageWork
status: Published
type: Property
domain: C10006
range: C10002
sub property of: has contributor
sub property of: P60422
inverse of: P50183
definition: Relates an expression to a person, family, or corporate body responsible for assembling, arranging, and trimming film, video, or other moving image formats, including both visual and audio aspects.

has production designer
name: productionDesigner
status: Published
type: Property
domain: C10006
range: C10002
sub property of: has contributor
sub property of: P60437
inverse of: P50198
definition: Relates an expression to a person, family, or corporate body responsible for designing the overall visual appearance of a moving image production.

has performer, narrator, and/or presenter
name: performerNarratorAndOrPresenter
status: Published
type: Property
domain: C10006
sub property of: P60442
definition: Relates an expression to a person, family, or corporate body responsible for performing, narrating, and/or presenting a work.

has minute taker
name: minuteTaker
status: Published
type: Property
domain: C10006
range: C10002
sub property of: has contributor
sub property of: P60446
inverse of: P50212
definition: Relates an expression to a person, family, or corporate body, responsible for recording the minutes of a meeting.

has manifestation of expression
name: manifestationOfExpression
status: Published
type: Property
domain: C10006
range: C10007
inverse of: P30139
definition: Relates an expression to a physical embodiment of an expression.

is adapted as radio program (expression)
name: adaptedAsARadioProgramExpression
status: Published
type: Property
domain: C10006
range: C10006
sub property of: is adapted as (expression)
sub property of: P60174
inverse of: is radio adaptation of (expression)
definition: Relates an expression to a radio program based on the source expression.

has form of tactile notation
name: formOfTactileNotation
status: Published
type: Property
domain: C10006
sub property of: has form of notation
sub property of: P60318
definition: Relates an expression to a set of characters and/or symbols used to express the content of a resource in a form that can be perceived through touch.

has form of notation
has subproperty: has form of tactile notation
has subproperty: has form of notated movement
has subproperty: has form of musical notation
has subproperty: has script
name: formOfNotation
status: Published
type: Property
domain: C10006
sub property of: P60319
definition: Relates an expression to a set of characters and/or symbols used to express the content of a resource.

has form of notated movement
name: formOfNotatedMovement
status: Published
type: Property
domain: C10006
sub property of: has form of notation
sub property of: P60320
definition: Relates an expression to a set of characters and/or symbols used to express the movement content of a resource.

has form of musical notation
name: formOfMusicalNotation
status: Published
type: Property
domain: C10006
sub property of: has form of notation
sub property of: P60321
definition: Relates an expression to a set of characters and/or symbols used to express the musical content of a resource.

has script
name: script
status: Published
type: Property
domain: C10006
sub property of: has form of notation
sub property of: P60322
definition: Relates an expression to a set of characters and/or symbols used to express the written language content of a resource.

is adapted as television program (expression)
name: adaptedAsATelevisionProgramExpression
status: Published
type: Property
domain: C10006
range: C10006
sub property of: is adapted as (expression)
sub property of: P60354
inverse of: is television adaptation of (expression)
definition: Relates an expression to a television program based on the source expression.

is adapted as video (expression)
name: adaptedAsAVideoProgramExpression
status: Published
type: Property
domain: C10006
range: C10006
sub property of: is adapted as (expression)
sub property of: P60361
inverse of: is video adaptation of (expression)
definition: Relates an expression to a video based on the source expression.

has writer of added lyrics
name: writerOfAddedLyrics
status: Published
type: Property
domain: C10006
range: C10002
sub property of: has writer of added text
sub property of: P60371
inverse of: P50216
definition: Relates an expression to a writer of words added to an expression of a musical work.

has summarization of the content
name: summarizationOfTheContent
status: Published
type: Property
domain: C10006
sub property of: P60372
definition: Relates an expression to an abstract, summary, synopsis, etc., of the content of a resource.

has voice actor
name: voiceActor
status: Published
type: Property
domain: C10006
range: C10002
sub property of: has actor
sub property of: P60152
inverse of: P50217
definition: Relates an expression to an actor contributing to an expression of a work by providing the voice for characters in radio and audio productions and for animated characters in moving image works, as well as by providing voice-overs in radio and television commercials, dubbed resources, etc.

has note on expression
has subproperty: has note on changes in content characteristics
name: noteOnExpression
status: Published
type: Property
domain: C10006
sub property of: P60470
definition: Relates an expression to an annotation providing additional information about content recorded as an expression attribute.

is description of (expression)
has subproperty: is analysis of (expression)
has subproperty: is evaluation of (expression)
has subproperty: is review of (expression)
has subproperty: is critique of (expression)
has subproperty: is commentary on (expression)
name: descriptionOfExpression
status: Published
type: Property
domain: C10006
range: C10006
sub property of: has descriptive expression relationship with
sub property of: P60190
inverse of: is described in (expression)
definition: Relates an expression to an expression described by an expression of a describing work.

is dramatized as (expression)
name: dramatizedAsExpression
status: Published
type: Property
domain: C10006
range: C10006
sub property of: is adapted as (expression)
sub property of: P60088
inverse of: is dramatization of (expression)
definition: Relates an expression to an expression of a dramatic work adapted from the source expression.

is contained in (expression)
name: containedInExpression
status: Published
type: Property
domain: C10006
range: C10006
sub property of: has whole-part expression relationship with
sub property of: P60101
inverse of: is container of (expression)
definition: Relates an expression to an expression of a larger work of which the expression is a discrete component.

is replaced in part by (expression)
name: replacedInPartByExpression
status: Published
type: Property
domain: C10006
range: C10006
sub property of: P60103
inverse of: is replacement in part of (expression)
definition: Relates an expression to an expression of a later work used in part in place of the earlier expression, usually because the later work contains updated or new information that makes part of the earlier expression obsolete.

is replaced by (expression)
name: replacedByExpression
status: Published
type: Property
domain: C10006
range: C10006
sub property of: is succeeded by (expression)
sub property of: P60104
inverse of: is replacement of (expression)
definition: Relates an expression to an expression of a later work used in place of the earlier expression, usually because the later work contains updated or new information that makes the earlier expression obsolete.

is verse adaptation (expression)
name: verseAdaptationExpression
status: Published
type: Property
domain: C10006
range: C10006
sub property of: is adapted as (expression)
sub property of: P60106
inverse of: is verse adaptation of (expression)
definition: Relates an expression to an expression of a literary composition in verse form adapted from the source expression.

is dubbed version of
name: dubbedVersionOf
status: Published
type: Property
domain: C10006
range: C10006
sub property of: is translation of
sub property of: P60111
inverse of: is dubbed version
definition: Relates an expression to an expression of a moving image work in which the spoken dialogue has been translated into a language different from that of the original work.

is dubbed version
name: dubbedVersion
status: Published
type: Property
domain: C10006
range: C10006
sub property of: is translated as
sub property of: P60112
inverse of: is dubbed version of
definition: Relates an expression to an expression of a moving image work that translates the spoken dialogue of the original work into a different language.

is cadenza (expression)
name: cadenzaExpression
status: Published
type: Property
domain: C10006
range: C10006
sub property of: is augmented by (expression)
sub property of: P60113
inverse of: is cadenza composed for (expression)
definition: Relates an expression to an expression of a musical work consisting of an ornamental passage for a soloist, added to a musical work such as a concerto, either by the same or a different composer.

is musical variations based on (expression)
name: musicalVariationsBasedOnExpression
status: Published
type: Property
domain: C10006
range: C10006
sub property of: is based on (expression)
sub property of: P60114
inverse of: is musical variations (expression)
definition: Relates an expression to an expression of a musical work from which melodic, thematic, or harmonic material is taken to form a discrete theme, which is repeated one or more times with subsequent modifications.

is musical variations (expression)
name: musicalVariationsExpression
status: Published
type: Property
domain: C10006
range: C10006
sub property of: is derivative (expression)
sub property of: P60115
inverse of: is musical variations based on (expression)
definition: Relates an expression to an expression of a musical work in which melodic, thematic, or harmonic material is taken from the source work to form a discrete theme, which is repeated one or more times with subsequent modifications.

is cadenza composed for (expression)
name: cadenzaComposedForExpression
status: Published
type: Property
domain: C10006
range: C10006
sub property of: is augmentation of (expression)
sub property of: P60116
inverse of: is cadenza (expression)
definition: Relates an expression to an expression of a musical work such as a concerto for which an ornamental passage for a soloist has been composed, either by the same or a different composer.

is libretto for (expression)
name: librettoForExpression
status: Published
type: Property
domain: C10006
range: C10006
sub property of: is complemented by (expression)
sub property of: P60117
inverse of: is libretto (expression)
definition: Relates an expression to an expression of a musical work such as an opera or other work for the musical stage, or an oratorio, that uses the text of the related work.

is incidental music (expression)
name: incidentalMusicExpression
status: Published
type: Property
domain: C10006
range: C10006
sub property of: is music (expression)
sub property of: P60118
inverse of: is incidental music for (expression)
definition: Relates an expression to an expression of a musical work that that provides the incidental music for a play or other spoken work for the stage.

is remade as (expression)
name: remadeAsExpression
status: Published
type: Property
domain: C10006
range: C10006
sub property of: is derivative (expression)
sub property of: P60120
inverse of: is remake of (expression)
definition: Relates an expression to an expression of a new motion picture, radio program, television program, or video based on an earlier work.

is musical setting (expression)
name: musicalSettingExpression
status: Published
type: Property
domain: C10006
range: C10006
sub property of: is derivative (expression)
sub property of: P60121
inverse of: is musical setting of (expression)
definition: Relates an expression to an expression of a non-dramatic musical work, other than an oratorio, that uses the text of the source work.

is novelization (expression)
name: novelizationExpression
status: Published
type: Property
domain: C10006
range: C10006
sub property of: is adapted as (expression)
sub property of: P60138
inverse of: is novelization of (expression)
definition: Relates an expression to an expression of a novel adapted from the source expression.

is appendix to (expression)
name: appendixToExpression
status: Published
type: Property
domain: C10006
range: C10006
sub property of: is augmentation of (expression)
sub property of: P60253
inverse of: is appendix (expression)
definition: Relates an expression to an expression of a predominant work that is augmented by another work that consists of material that is not essential to the completeness of the content, such as a list of references, statistical tables, and explanatory matter; the augmenting work can either come at the end of the content, or be issued separately.

is abstracted in (expression)
name: abstractedInExpression
status: Published
type: Property
domain: C10006
range: C10006
sub property of: is derivative (expression)
sub property of: P60177
inverse of: is abstracts for (expression)
definition: Relates an expression to an expression of a work (an abstracting and indexing service) that abstracts the contents of a source expression.

is indexed in (expression)
name: indexedInExpression
status: Published
type: Property
domain: C10006
range: C10006
sub property of: is derivative (expression)
sub property of: P60178
inverse of: is indexing for (expression)
definition: Relates an expression to an expression of a work (an abstracting and indexing service) that indexes the contents of a source expression.

is choreography (expression)
name: choreographyExpression
status: Published
type: Property
domain: C10006
range: C10006
sub property of: is derivative (expression)
sub property of: P60180
inverse of: is choreography for (expression)
definition: Relates an expression to an expression of a work consisting of dance based on the source work.

is errata (expression)
name: errataExpression
status: Published
type: Property
domain: C10006
range: C10006
sub property of: is augmented by (expression)
sub property of: P60181
inverse of: is errata to (expression)
definition: Relates an expression to an expression of a work consisting of errors discovered after the publication of the predominant work, with their corrections.

is illustrations (expression)
name: illustrationsExpression
status: Published
type: Property
domain: C10006
range: C10006
sub property of: is augmented by (expression)
sub property of: P60182
inverse of: is illustrations for (expression)
definition: Relates an expression to an expression of a work consisting of pictorial content designed to explain or decorate the augmented expression.

is adapted as motion picture screenplay (expression)
name: adaptedAsAMotionPictureScreenplayExpression
status: Published
type: Property
domain: C10006
range: C10006
sub property of: is adapted as screenplay (expression)
sub property of: P60184
inverse of: is motion picture screenplay based on (expression)
definition: Relates an expression to an expression of a work consisting of the screenplay for a motion picture, based on the source work.

is adapted as screenplay (expression)
has subproperty: is adapted as motion picture screenplay (expression)
has subproperty: is adapted as television screenplay (expression)
has subproperty: is adapted as video screenplay (expression)
name: adaptedAsAScreenplayExpression
status: Published
type: Property
domain: C10006
range: C10006
sub property of: is adapted as (expression)
sub property of: P60185
inverse of: is screenplay based on (expression)
definition: Relates an expression to an expression of a work consisting of the screenplay for a motion picture, television program, or video, based on the source work.

is adapted as television screenplay (expression)
name: adaptedAsATelevisionScreenplayExpression
status: Published
type: Property
domain: C10006
range: C10006
sub property of: is adapted as screenplay (expression)
sub property of: P60186
inverse of: is television screenplay based on (expression)
definition: Relates an expression to an expression of a work consisting of the screenplay for a television program, based on the source work.

is adapted as video screenplay (expression)
name: adaptedAsAVideoScreenplayExpression
status: Published
type: Property
domain: C10006
range: C10006
sub property of: is adapted as screenplay (expression)
sub property of: P60187
inverse of: is video screenplay based on (expression)
definition: Relates an expression to an expression of a work consisting of the screenplay for a video, based on the source work.

is adapted as radio script (expression)
name: adaptedAsARadioScriptExpression
status: Published
type: Property
domain: C10006
range: C10006
sub property of: is adapted as (expression)
sub property of: P60188
inverse of: is radio script based on (expression)
definition: Relates an expression to an expression of a work consisting of the script for a radio program, based on the source work.

is complemented by (expression)
has subproperty: is libretto for (expression)
has subproperty: is screenplay for (expression)
has subproperty: is screenplay (expression)
has subproperty: is radio script (expression)
has subproperty: is libretto (expression)
has subproperty: is script for radio program (expression)
name: complementedByExpression
status: Published
type: Property
domain: C10006
range: C10006
sub property of: has accompanying expression relationship with
sub property of: P60198
definition: Relates an expression to an expression of a work paired with another expression without either expression being considered to predominate.

is continued in part by (expression)
name: continuedInPartByExpression
status: Published
type: Property
domain: C10006
range: C10006
sub property of: is succeeded by (expression)
sub property of: P60199
inverse of: is separated from (expression)
definition: Relates an expression to an expression of a work part of whose content separated from an earlier expression to form a new expression.

is screenplay for (expression)
has subproperty: is screenplay for motion picture (expression)
has subproperty: is screenplay for television program (expression)
has subproperty: is screenplay for video (expression)
name: screenplayForExpression
status: Published
type: Property
domain: C10006
range: C10006
sub property of: is complemented by (expression)
sub property of: P60201
inverse of: is screenplay (expression)
definition: Relates an expression to an expression of a work such as a motion picture, television program, or video, that uses the text of the work as a screenplay.

is incidental music for (expression)
name: incidentalMusicForExpression
status: Published
type: Property
domain: C10006
range: C10006
sub property of: is music for (expression)
sub property of: P60202
inverse of: is incidental music (expression)
definition: Relates an expression to an expression of a work such as a play or other spoken work for the stage that uses the musical work as incidental music.

is abstract (expression)
name: abstractExpression
status: Published
type: Property
domain: C10006
range: C10006
sub property of: is derivative (expression)
sub property of: P60203
inverse of: is abstract of (expression)
definition: Relates an expression to an expression of a work that abbreviates the source expression in a brief, objective manner.

is augmented by (expression)
has subproperty: is cadenza (expression)
has subproperty: is errata (expression)
has subproperty: is illustrations (expression)
has subproperty: is catalogue (expression)
has subproperty: is concordance (expression)
has subproperty: is addenda (expression)
has subproperty: is appendix (expression)
has subproperty: is guide (expression)
has subproperty: is finding aid (expression)
has subproperty: is index (expression)
has subproperty: is supplement (expression)
name: augmentedByExpression
status: Published
type: Property
domain: C10006
range: C10006
sub property of: has accompanying expression relationship with
sub property of: P60204
inverse of: is augmentation of (expression)
definition: Relates an expression to an expression of a work that adds to the content of a predominant expression.

is summary (expression)
name: summaryExpression
status: Published
type: Property
domain: C10006
range: C10006
sub property of: is derivative (expression)
sub property of: P60205
inverse of: is summary of (expression)
definition: Relates an expression to an expression of a work that consists of a brief recapitulation of the content of the source expression.

is catalogue (expression)
name: catalogueExpression
status: Published
type: Property
domain: C10006
range: C10006
sub property of: is augmented by (expression)
sub property of: P60206
inverse of: is catalogue of (expression)
definition: Relates an expression to an expression of a work that consists of a complete enumeration of items arranged systematically.

is concordance (expression)
name: concordanceExpression
status: Published
type: Property
domain: C10006
range: C10006
sub property of: is augmented by (expression)
sub property of: P60208
inverse of: is concordance to (expression)
definition: Relates an expression to an expression of a work that consists of an index of all the words in the predominant expression.

is addenda (expression)
name: addendaExpression
status: Published
type: Property
domain: C10006
range: C10006
sub property of: is augmented by (expression)
sub property of: P60209
inverse of: is addenda to (expression)
definition: Relates an expression to an expression of a work that consists of brief additional material, less extensive than a supplement, but essential to the completeness of the text of the predominant work; it is usually added at the end of the content, but is sometimes issued separately.

is basis for libretto (expression)
name: basisForLibrettoExpression
status: Published
type: Property
domain: C10006
range: C10006
sub property of: is derivative (expression)
sub property of: P60210
inverse of: is libretto based on (expression)
definition: Relates an expression to an expression of a work that consists of the text of an opera or other work for the musical stage, or an oratorio, based on the source work.

is reviewed in (expression)
name: reviewedInExpression
status: Published
type: Property
domain: C10006
range: C10006
sub property of: is described in (expression)
sub property of: P60211
inverse of: is review of (expression)
definition: Relates an expression to an expression of a work that contains a brief evaluation of the described expression.

is critiqued in (expression)
name: critiquedInExpression
status: Published
type: Property
domain: C10006
range: C10006
sub property of: is described in (expression)
sub property of: P60212
inverse of: is critique of (expression)
definition: Relates an expression to an expression of a work that contains a critical evaluation of the described expression.

is commentary in (expression)
name: commentaryInExpression
status: Published
type: Property
domain: C10006
range: C10006
sub property of: is described in (expression)
sub property of: P60213
inverse of: is commentary on (expression)
definition: Relates an expression to an expression of a work that contains a set of explanatory or critical notes on the described expression.

is imitated as (expression)
has subproperty: is parodied as (expression)
name: imitatedAsExpression
status: Published
type: Property
domain: C10006
range: C10006
sub property of: is derivative (expression)
sub property of: P60214
inverse of: is imitation of (expression)
definition: Relates an expression to an expression of a work that copies the style or content of the source work.

is expanded as (expression)
name: expandedAsExpression
status: Published
type: Property
domain: C10006
range: C10006
sub property of: is derivative (expression)
sub property of: P60216
inverse of: is expanded version of (expression)
definition: Relates an expression to an expression of a work that enlarges upon the content of the source work.

is evaluated in (expression)
name: evaluatedInExpression
status: Published
type: Property
domain: C10006
range: C10006
sub property of: is described in (expression)
sub property of: P60218
inverse of: is evaluation of (expression)
definition: Relates an expression to an expression of a work that examines or judges the described expression.

is analysed in (expression)
name: analysedInExpression
status: Published
type: Property
domain: C10006
range: C10006
sub property of: is described in (expression)
sub property of: P60219
inverse of: is analysis of (expression)
definition: Relates an expression to an expression of a work that examines the source expression to identify its components and their relations.

is appendix (expression)
name: appendixExpression
status: Published
type: Property
domain: C10006
range: C10006
sub property of: is augmented by (expression)
sub property of: P60221
inverse of: is appendix to (expression)
definition: Relates an expression to an expression of a work that forms an augmenting part of another work which is not essential to the completeness of the content, such as a list of references, statistical tables, and explanatory matter; it can be material which either comes at the end of the content of the predominant work, or is issued separately.

is freely translated as (expression)
name: freelyTranslatedAsExpression
status: Published
type: Property
domain: C10006
range: C10006
sub property of: is derivative (expression)
sub property of: P60189
inverse of: is free translation of (expression)
definition: Relates an expression to an expression of a work that freely translates the text into another language, preserving the spirit of the original, but not its linguistic details.

is guide (expression)
name: guideExpression
status: Published
type: Property
domain: C10006
range: C10006
sub property of: is augmented by (expression)
sub property of: P60222
inverse of: is guide to (expression)
definition: Relates an expression to an expression of a work that guides a user through the use of the predominant work, using notes, learning and study aids, exercises, problems, questions and answers, instructor or student materials, etc.

is abridgement of (expression)
name: abridgementOfExpression
status: Published
type: Property
domain: C10006
range: C10006
sub property of: is based on (expression)
sub property of: P60223
inverse of: is abridged as (expression)
definition: Relates an expression to an expression of a work that has been abridged, i.e., shortened without changing the general meaning or manner of presentation of the source work.

is abstract of (expression)
name: abstractOfExpression
status: Published
type: Property
domain: C10006
range: C10006
sub property of: is based on (expression)
sub property of: P60224
inverse of: is abstract (expression)
definition: Relates an expression to an expression of a work that has been abstracted, i.e., abbreviated in a brief, objective manner.

is dramatization of (expression)
name: dramatizationOfExpression
status: Published
type: Property
domain: C10006
range: C10006
sub property of: is adaptation of (expression)
sub property of: P60225
inverse of: is dramatized as (expression)
definition: Relates an expression to an expression of a work that has been adapted as a drama.

is verse adaptation of (expression)
name: verseAdaptationOfExpression
status: Published
type: Property
domain: C10006
range: C10006
sub property of: is adaptation of (expression)
sub property of: P60226
inverse of: is verse adaptation (expression)
definition: Relates an expression to an expression of a work that has been adapted as a literary composition in verse form.

is motion picture adaptation of (expression)
name: motionPictureAdaptationOfExpression
status: Published
type: Property
domain: C10006
range: C10006
sub property of: is adaptation of (expression)
sub property of: P60227
inverse of: is adapted as motion picture (expression)
definition: Relates an expression to an expression of a work that has been adapted as a motion picture.

is novelization of (expression)
name: novelizationOfExpression
status: Published
type: Property
domain: C10006
range: C10006
sub property of: is adaptation of (expression)
sub property of: P60228
inverse of: is novelization (expression)
definition: Relates an expression to an expression of a work that has been adapted as a novel.

is radio adaptation of (expression)
name: radioAdaptationOfExpression
status: Published
type: Property
domain: C10006
range: C10006
sub property of: is adaptation of (expression)
sub property of: P60229
inverse of: is adapted as radio program (expression)
definition: Relates an expression to an expression of a work that has been adapted as a radio program.

is television adaptation of (expression)
name: televisionAdaptationOfExpression
status: Published
type: Property
domain: C10006
range: C10006
sub property of: is adaptation of (expression)
sub property of: P60230
inverse of: is adapted as television program (expression)
definition: Relates an expression to an expression of a work that has been adapted as a television program.

is screenplay based on (expression)
has subproperty: is motion picture screenplay based on (expression)
has subproperty: is television screenplay based on (expression)
has subproperty: is video screenplay based on (expression)
name: screenplayBasedOnExpression
status: Published
type: Property
domain: C10006
range: C10006
sub property of: is adaptation of (expression)
sub property of: P60231
inverse of: is adapted as screenplay (expression)
definition: Relates an expression to an expression of a work that has been adapted as the screenplay for a motion picture, television program, or video.

is motion picture screenplay based on (expression)
name: motionPictureScreenplayBasedOnExpression
status: Published
type: Property
domain: C10006
range: C10006
sub property of: is screenplay based on (expression)
sub property of: P60232
inverse of: is adapted as motion picture screenplay (expression)
definition: Relates an expression to an expression of a work that has been adapted as the screenplay for a motion picture.

is television screenplay based on (expression)
name: televisionScreenplayBasedOnExpression
status: Published
type: Property
domain: C10006
range: C10006
sub property of: is screenplay based on (expression)
sub property of: P60233
inverse of: is adapted as television screenplay (expression)
definition: Relates an expression to an expression of a work that has been adapted as the screenplay for a television program.

is video screenplay based on (expression)
name: videoScreenplayBasedOnExpression
status: Published
type: Property
domain: C10006
range: C10006
sub property of: is screenplay based on (expression)
sub property of: P60234
inverse of: is adapted as video screenplay (expression)
definition: Relates an expression to an expression of a work that has been adapted as the screenplay for a video.

is radio script based on (expression)
name: radioScriptBasedOnExpression
status: Published
type: Property
domain: C10006
range: C10006
sub property of: is adaptation of (expression)
sub property of: P60235
inverse of: is adapted as radio script (expression)
definition: Relates an expression to an expression of a work that has been adapted as the script for a radio program.

is video adaptation of (expression)
name: videoAdaptationOfExpression
status: Published
type: Property
domain: C10006
range: C10006
sub property of: is adaptation of (expression)
sub property of: P60236
inverse of: is adapted as video (expression)
definition: Relates an expression to an expression of a work that has been adapted for video.

is digest of (expression)
name: digestOfExpression
status: Published
type: Property
domain: C10006
range: C10006
sub property of: is based on (expression)
sub property of: P60238
inverse of: is digest (expression)
definition: Relates an expression to an expression of a work that has been digested, i.e., systematically and comprehensively condensed.

is analysis of (expression)
name: analysisOfExpression
status: Published
type: Property
domain: C10006
range: C10006
sub property of: is description of (expression)
sub property of: P60239
inverse of: is analysed in (expression)
definition: Relates an expression to an expression of a work that has been examined to identify its components and their relations.

is absorption of (expression)
name: absorptionOfExpression
status: Published
type: Property
domain: C10006
range: C10006
sub property of: is preceded by (expression)
sub property of: P60574
inverse of: is absorbed by (expression)
definition: Relates an expression to an expression of a work that has been incorporated into another expression.

is absorption in part of (expression)
name: absorptionInPartOfExpression
status: Published
type: Property
domain: C10006
range: C10006
sub property of: is preceded by (expression)
sub property of: P60575
inverse of: is absorbed in part by (expression)
definition: Relates an expression to an expression of a work that has been partially incorporated into another expression.

is musical arrangement of
name: musicalArrangementOf
status: Published
type: Property
domain: C10006
range: C10006
sub property of: is based on (expression)
sub property of: P60242
inverse of: is musical arrangement
definition: Relates an expression to an expression of a work that has been rewritten for a medium of performance different from that for which the work was originally intended.

is free translation of (expression)
name: freeTranslationOfExpression
status: Published
type: Property
domain: C10006
range: C10006
sub property of: is based on (expression)
sub property of: P60243
inverse of: is freely translated as (expression)
definition: Relates an expression to an expression of a work that has been translated freely, preserving the spirit of the original, but not its linguistic details.

is translation of
has subproperty: is dubbed version of
name: translationOf
status: Published
type: Property
domain: C10006
range: C10006
sub property of: is based on (expression)
sub property of: P60244
inverse of: is translated as
definition: Relates an expression to an expression of a work that has been translated, i.e., the text expressed in a language different from that of the original work.

is parodied as (expression)
name: parodiedAsExpression
status: Published
type: Property
domain: C10006
range: C10006
sub property of: is imitated as (expression)
sub property of: P60246
inverse of: is parody of (expression)
definition: Relates an expression to an expression of a work that imitates the style or content of the source work for comic effect.

is absorbed by (expression)
name: absorbedByExpression
status: Published
type: Property
domain: C10006
range: C10006
sub property of: is succeeded by (expression)
sub property of: P60247
inverse of: is absorption of (expression)
definition: Relates an expression to an expression of a work that incorporates another expression.

is absorbed in part by (expression)
name: absorbedInPartByExpression
status: Published
type: Property
domain: C10006
range: C10006
sub property of: is succeeded by (expression)
sub property of: P60248
inverse of: is absorption in part of (expression)
definition: Relates an expression to an expression of a work that incorporates part of the content of another expression.

is container of (expression)
name: containerOfExpression
status: Published
type: Property
domain: C10006
range: C10006
sub property of: has whole-part expression relationship with
sub property of: P60249
inverse of: is contained in (expression)
definition: Relates an expression to an expression of a work that is a discrete component of a larger expression.

is errata to (expression)
name: errataToExpression
status: Published
type: Property
domain: C10006
range: C10006
sub property of: is augmentation of (expression)
sub property of: P60251
inverse of: is errata (expression)
definition: Relates an expression to an expression of a work that is augmented by a list of errors in the predominant work, discovered after publication, with their corrections.

is guide to (expression)
name: guideToExpression
status: Published
type: Property
domain: C10006
range: C10006
sub property of: is augmentation of (expression)
sub property of: P60252
inverse of: is guide (expression)
definition: Relates an expression to an expression of a work that is augmented by another work consisting of material to help the user of the predominant work, such as notes, learning and study aids, exercises, problems, questions and answers, instructor or student materials, etc.

is illustrations for (expression)
name: illustrationsForExpression
status: Published
type: Property
domain: C10006
range: C10006
sub property of: is augmentation of (expression)
sub property of: P60254
inverse of: is illustrations (expression)
definition: Relates an expression to an expression of a work that is augmented by pictorial content designed to explain or decorate it.

is continuation of (expression)
name: continuationOfExpression
status: Published
type: Property
domain: C10006
range: C10006
sub property of: is preceded by (expression)
sub property of: P60576
inverse of: is continued by (expression)
definition: Relates an expression to an expression of a work that is continued by the content of an expression of a later work.

is evaluation of (expression)
name: evaluationOfExpression
status: Published
type: Property
domain: C10006
range: C10006
sub property of: is description of (expression)
sub property of: P60255
inverse of: is evaluated in (expression)
definition: Relates an expression to an expression of a work that is examined or judged.

is supplement to (expression)
name: supplementToExpression
status: Published
type: Property
domain: C10006
range: C10006
sub property of: is augmentation of (expression)
sub property of: P60259
inverse of: is supplement (expression)
definition: Relates an expression to an expression of a work that is updated or otherwise complemented by the augmenting expression.

is adaptation of (expression)
has subproperty: is dramatization of (expression)
has subproperty: is verse adaptation of (expression)
has subproperty: is motion picture adaptation of (expression)
has subproperty: is novelization of (expression)
has subproperty: is radio adaptation of (expression)
has subproperty: is television adaptation of (expression)
has subproperty: is screenplay based on (expression)
has subproperty: is radio script based on (expression)
has subproperty: is video adaptation of (expression)
name: adaptationOfExpression
status: Published
type: Property
domain: C10006
range: C10006
sub property of: is based on (expression)
sub property of: P60241
inverse of: is adapted as (expression)
definition: Relates an expression to an expression of a work that modifies the source expression for a purpose, use, or medium other than that for which it was originally intended.

is adapted as (expression)
has subproperty: is adapted as motion picture (expression)
has subproperty: is adapted as radio program (expression)
has subproperty: is adapted as television program (expression)
has subproperty: is adapted as video (expression)
has subproperty: is dramatized as (expression)
has subproperty: is verse adaptation (expression)
has subproperty: is novelization (expression)
has subproperty: is adapted as screenplay (expression)
has subproperty: is adapted as radio script (expression)
name: adaptedAsExpression
status: Published
type: Property
domain: C10006
range: C10006
sub property of: P60260
inverse of: is adaptation of (expression)
definition: Relates an expression to an expression of a work based on the source expression.

is preceded by (expression)
has subproperty: is absorption of (expression)
has subproperty: is absorption in part of (expression)
has subproperty: is continuation of (expression)
has subproperty: is continuation in part of (expression)
has subproperty: is separated from (expression)
has subproperty: is replacement in part of (expression)
has subproperty: is replacement of (expression)
has subproperty: is merger of (expression)
name: precededByExpression
status: Published
type: Property
domain: C10006
range: C10006
sub property of: has sequential expression relationship with
sub property of: P60261
inverse of: is succeeded by (expression)
definition: Relates an expression to an expression of a work that precedes (e.g., is earlier in time or before in narrative) the succeeding expression.

is finding aid (expression)
name: findingAidExpression
status: Published
type: Property
domain: C10006
range: C10006
sub property of: is augmented by (expression)
sub property of: P60262
inverse of: is finding aid for (expression)
definition: Relates an expression to an expression of a work that provides a guide to the organization, arrangement, and contents of an archival collection.

is index (expression)
name: indexExpression
status: Published
type: Property
domain: C10006
range: C10006
sub property of: is augmented by (expression)
sub property of: P60263
inverse of: is index to (expression)
definition: Relates an expression to an expression of a work that provides a systematic, alphabetical guide to the contents of the predominant expression, usually keyed to page numbers or other reference codes.

is screenplay (expression)
has subproperty: is motion picture screenplay (expression)
has subproperty: is television screenplay (expression)
has subproperty: is video screenplay (expression)
name: screenplayExpression
status: Published
type: Property
domain: C10006
range: C10006
sub property of: is complemented by (expression)
sub property of: P60264
inverse of: is screenplay for (expression)
definition: Relates an expression to an expression of a work that provides the text for a motion picture, television program or video.

is motion picture screenplay (expression)
name: motionPictureScreenplayExpression
status: Published
type: Property
domain: C10006
range: C10006
sub property of: is screenplay (expression)
sub property of: P60265
inverse of: is screenplay for motion picture (expression)
definition: Relates an expression to an expression of a work that provides the text for a motion picture.

is musical setting of (expression)
name: musicalSettingOfExpression
status: Published
type: Property
domain: C10006
range: C10006
sub property of: is based on (expression)
sub property of: P60266
inverse of: is musical setting (expression)
definition: Relates an expression to an expression of a work that provides the text for a non-dramatic musical work, other than an oratorio.

is radio script (expression)
name: radioScriptExpression
status: Published
type: Property
domain: C10006
range: C10006
sub property of: is complemented by (expression)
sub property of: P60267
inverse of: is script for radio program (expression)
definition: Relates an expression to an expression of a work that provides the text for a radio program.

is television screenplay (expression)
name: televisionScreenplayExpression
status: Published
type: Property
domain: C10006
range: C10006
sub property of: is screenplay (expression)
sub property of: P60268
inverse of: is screenplay for television program (expression)
definition: Relates an expression to an expression of a work that provides the text for a television program.

is video screenplay (expression)
name: videoScreenplayExpression
status: Published
type: Property
domain: C10006
range: C10006
sub property of: is screenplay (expression)
sub property of: P60269
inverse of: is screenplay for video (expression)
definition: Relates an expression to an expression of a work that provides the text for a video.

is libretto (expression)
name: librettoExpression
status: Published
type: Property
domain: C10006
range: C10006
sub property of: is complemented by (expression)
sub property of: P60270
inverse of: is libretto for (expression)
definition: Relates an expression to an expression of a work that provides the text of an opera or other work for the musical stage, or an oratorio.

is paraphrased as (expression)
name: paraphrasedAsExpression
status: Published
type: Property
domain: C10006
range: C10006
sub property of: is derivative (expression)
sub property of: P60273
inverse of: is paraphrase of (expression)
definition: Relates an expression to an expression of a work that restates the content of the source work in a different form.

is musical arrangement
name: musicalArrangement
status: Published
type: Property
domain: C10006
range: C10006
sub property of: is derivative (expression)
sub property of: P60274
inverse of: is musical arrangement of
definition: Relates an expression to an expression of a work that rewrites the source expression for a medium of performance different from that for which the work was originally intended.

is abridged as (expression)
name: abridgedAsExpression
status: Published
type: Property
domain: C10006
range: C10006
sub property of: is derivative (expression)
sub property of: P60275
inverse of: is abridgement of (expression)
definition: Relates an expression to an expression of a work that shortens the source expression without changing the general meaning or manner of presentation.

is continuation in part of (expression)
name: continuationInPartOfExpression
status: Published
type: Property
domain: C10006
range: C10006
sub property of: is preceded by (expression)
sub property of: P60276
inverse of: is split into (expression)
definition: Relates an expression to an expression of a work that split into two or more separate expressions with new titles.

is separated from (expression)
name: separatedFromExpression
status: Published
type: Property
domain: C10006
range: C10006
sub property of: is preceded by (expression)
sub property of: P60277
inverse of: is continued in part by (expression)
definition: Relates an expression to an expression of a work that spun off a part of its content to form a new expression.

is succeeded by (expression)
has subproperty: is replaced by (expression)
has subproperty: is continued in part by (expression)
has subproperty: is absorbed by (expression)
has subproperty: is absorbed in part by (expression)
has subproperty: is continued by (expression)
has subproperty: is split into (expression)
name: succeededByExpression
status: Published
type: Property
domain: C10006
range: C10006
sub property of: has sequential expression relationship with
sub property of: P60278
inverse of: is preceded by (expression)
definition: Relates an expression to an expression of a work that succeeds (e.g., later in time or after in a narrative) the preceding expression.

is digest (expression)
name: digestExpression
status: Published
type: Property
domain: C10006
range: C10006
sub property of: is derivative (expression)
sub property of: P60279
inverse of: is digest of (expression)
definition: Relates an expression to an expression of a work that systematically and comprehensively condenses the source expression.

is translated as
has subproperty: is dubbed version
name: translatedAs
status: Published
type: Property
domain: C10006
range: C10006
sub property of: is derivative (expression)
sub property of: P60280
inverse of: is translation of
definition: Relates an expression to an expression of a work that translates the text of the source expression into a language different from that of the original work.

is supplement (expression)
name: supplementExpression
status: Published
type: Property
domain: C10006
range: C10006
sub property of: is augmented by (expression)
sub property of: P60281
inverse of: is supplement to (expression)
definition: Relates an expression to an expression of a work that updates or otherwise complements the predominant expression.

is screenplay for motion picture (expression)
name: screenplayForTheMotionPictureExpression
status: Published
type: Property
domain: C10006
range: C10006
sub property of: is screenplay for (expression)
sub property of: P60282
inverse of: is motion picture screenplay (expression)
definition: Relates an expression to an expression of a work that uses the text as a screenplay for a motion picture.

is screenplay for television program (expression)
name: screenplayForTheTelevisionProgramExpression
status: Published
type: Property
domain: C10006
range: C10006
sub property of: is screenplay for (expression)
sub property of: P60283
inverse of: is television screenplay (expression)
definition: Relates an expression to an expression of a work that uses the text as a screenplay for a television program.

is screenplay for video (expression)
name: screenplayForTheVideoExpression
status: Published
type: Property
domain: C10006
range: C10006
sub property of: is screenplay for (expression)
sub property of: P60284
inverse of: is video screenplay (expression)
definition: Relates an expression to an expression of a work that uses the text as a screenplay for a video.

is script for radio program (expression)
name: scriptForTheRadioProgramExpression
status: Published
type: Property
domain: C10006
range: C10006
sub property of: is complemented by (expression)
sub property of: P60285
inverse of: is radio script (expression)
definition: Relates an expression to an expression of a work that uses the text of the source work as the script for a radio program.

is addenda to (expression)
name: addendaToExpression
status: Published
type: Property
domain: C10006
range: C10006
sub property of: is augmentation of (expression)
sub property of: P60286
inverse of: is addenda (expression)
definition: Relates an expression to an expression of a work to which is added brief additional material, less extensive than a supplement, but essential to the completeness of the content of the work; it is usually added at the end of the content but is sometimes issued separately from it.

is review of (expression)
name: reviewOfExpression
status: Published
type: Property
domain: C10006
range: C10006
sub property of: is description of (expression)
sub property of: P60288
inverse of: is reviewed in (expression)
definition: Relates an expression to an expression of a work used as the basis for a brief evaluation.

is summary of (expression)
name: summaryOfExpression
status: Published
type: Property
domain: C10006
range: C10006
sub property of: is based on (expression)
sub property of: P60289
inverse of: is summary (expression)
definition: Relates an expression to an expression of a work used as the basis for a brief recapitulation of its content.

is catalogue of (expression)
name: catalogueOfExpression
status: Published
type: Property
domain: C10006
range: C10006
sub property of: is augmentation of (expression)
sub property of: P60290
inverse of: is catalogue (expression)
definition: Relates an expression to an expression of a work used as the basis for a catalogue, i.e., a complete enumeration of items arranged systematically.

is concordance to (expression)
name: concordanceToExpression
status: Published
type: Property
domain: C10006
range: C10006
sub property of: is augmentation of (expression)
sub property of: P60291
inverse of: is concordance (expression)
definition: Relates an expression to an expression of a work used as the basis for a concordance, i.e., an index of all the words in the predominant expression.

is critique of (expression)
name: critiqueOfExpression
status: Published
type: Property
domain: C10006
range: C10006
sub property of: is description of (expression)
sub property of: P60292
inverse of: is critiqued in (expression)
definition: Relates an expression to an expression of a work used as the basis for a critical evaluation.

is choreography for (expression)
name: choreographyForExpression
status: Published
type: Property
domain: C10006
range: C10006
sub property of: is based on (expression)
sub property of: P60293
inverse of: is choreography (expression)
definition: Relates an expression to an expression of a work used as the basis for a derivative work consisting of dance.

is expanded version of (expression)
name: expandedVersionOfExpression
status: Published
type: Property
domain: C10006
range: C10006
sub property of: is based on (expression)
sub property of: P60294
inverse of: is expanded as (expression)
definition: Relates an expression to an expression of a work used as the basis for a derivative work that enlarges upon the content of the source work.

is remake of (expression)
name: remakeOfExpression
status: Published
type: Property
domain: C10006
range: C10006
sub property of: is based on (expression)
sub property of: P60295
inverse of: is remade as (expression)
definition: Relates an expression to an expression of a work used as the basis for a new motion picture, radio program, television program, or video.

is paraphrase of (expression)
name: paraphraseOfExpression
status: Published
type: Property
domain: C10006
range: C10006
sub property of: is based on (expression)
sub property of: P60296
inverse of: is paraphrased as (expression)
definition: Relates an expression to an expression of a work used as the basis for a paraphrase, i.e., a restating of the content of the source work in a different form.

is commentary on (expression)
name: commentaryOnExpression
status: Published
type: Property
domain: C10006
range: C10006
sub property of: is description of (expression)
sub property of: P60298
inverse of: is commentary in (expression)
definition: Relates an expression to an expression of a work used as the basis for a set of explanatory or critical notes.

is index to (expression)
name: indexToExpression
status: Published
type: Property
domain: C10006
range: C10006
sub property of: is augmentation of (expression)
sub property of: P60302
inverse of: is index (expression)
definition: Relates an expression to an expression of a work used as the basis for an index, i.e., a systematic, alphabetical guide to the contents of the predominant expression, usually keyed to page numbers or other reference codes.

is revision of
name: revisionOf
status: Published
type: Property
domain: C10006
range: C10006
sub property of: is based on (expression)
sub property of: P60303
inverse of: is revised as
definition: Relates an expression to an expression of a work used as the basis for an updated, corrected, or expanded version.

is libretto based on (expression)
name: librettoBasedOnExpression
status: Published
type: Property
domain: C10006
range: C10006
sub property of: is based on (expression)
sub property of: P60304
inverse of: is basis for libretto (expression)
definition: Relates an expression to an expression of a work used as the basis for the text of an opera or other work for the musical stage, or an oratorio.

is continued by (expression)
name: continuedByExpression
status: Published
type: Property
domain: C10006
range: C10006
sub property of: is succeeded by (expression)
sub property of: P60306
inverse of: is continuation of (expression)
definition: Relates an expression to an expression of a work whose content continues an expression of an earlier work.

is augmentation of (expression)
has subproperty: is cadenza composed for (expression)
has subproperty: is appendix to (expression)
has subproperty: is errata to (expression)
has subproperty: is guide to (expression)
has subproperty: is illustrations for (expression)
has subproperty: is supplement to (expression)
has subproperty: is addenda to (expression)
has subproperty: is catalogue of (expression)
has subproperty: is concordance to (expression)
has subproperty: is index to (expression)
has subproperty: is finding aid for (expression)
name: augmentationOfExpression
status: Published
type: Property
domain: C10006
range: C10006
sub property of: has accompanying expression relationship with
sub property of: P60307
inverse of: is augmented by (expression)
definition: Relates an expression to an expression of a work whose content is added to by another expression.

is abstracts for (expression)
name: abstractsForExpression
status: Published
type: Property
domain: C10006
range: C10006
sub property of: is based on (expression)
sub property of: P60308
inverse of: is abstracted in (expression)
definition: Relates an expression to an expression of a work whose contents have been abstracted by an abstracting and indexing service.

is indexing for (expression)
name: indexingForExpression
status: Published
type: Property
domain: C10006
range: C10006
sub property of: is based on (expression)
sub property of: P60309
inverse of: is indexed in (expression)
definition: Relates an expression to an expression of a work whose contents have been indexed by an abstracting and indexing service.

is imitation of (expression)
has subproperty: is parody of (expression)
name: imitationOfExpression
status: Published
type: Property
domain: C10006
range: C10006
sub property of: is based on (expression)
sub property of: P60311
inverse of: is imitated as (expression)
definition: Relates an expression to an expression of a work whose style or content is copied in a derivative work.

is parody of (expression)
name: parodyOfExpression
status: Published
type: Property
domain: C10006
range: C10006
sub property of: is imitation of (expression)
sub property of: P60312
inverse of: is parodied as (expression)
definition: Relates an expression to an expression of a work whose style or content is imitated for comic effect.

is finding aid for (expression)
name: findingAidForExpression
status: Published
type: Property
domain: C10006
range: C10006
sub property of: is augmentation of (expression)
sub property of: P60474
inverse of: is finding aid (expression)
definition: Relates an expression to an expression of an archival collection that is described in a finding aid, i.e., a guide to the organization, arrangement, and contents of the collection.

is replacement in part of (expression)
name: replacementInPartOfExpression
status: Published
type: Property
domain: C10006
range: C10006
sub property of: is preceded by (expression)
sub property of: P60479
inverse of: is replaced in part by (expression)
definition: Relates an expression to an expression of an earlier work whose content has been partially replaced by a later expression, usually because the later work contains updated or new information that makes the earlier expression obsolete.

is replacement of (expression)
name: replacementOfExpression
status: Published
type: Property
domain: C10006
range: C10006
sub property of: is preceded by (expression)
sub property of: P60480
inverse of: is replaced by (expression)
definition: Relates an expression to an expression of an earlier work whose content has been replaced by a later expression, usually because the later work contains updated or new information that makes the earlier expression obsolete.

is split into (expression)
name: splitIntoExpression
status: Published
type: Property
domain: C10006
range: C10006
sub property of: is succeeded by (expression)
sub property of: P60503
inverse of: is continuation in part of (expression)
definition: Relates an expression to an expression of one of two or more works resulting from the division of an earlier expression into separate expressions.

is merger of (expression)
name: mergerOfExpression
status: Published
type: Property
domain: C10006
range: C10006
sub property of: is preceded by (expression)
sub property of: P60505
inverse of: is merged to form (expression)
definition: Relates an expression to one of the expressions which come together to form the expression.

is described in (expression)
has subproperty: is reviewed in (expression)
has subproperty: is critiqued in (expression)
has subproperty: is commentary in (expression)
has subproperty: is evaluated in (expression)
has subproperty: is analysed in (expression)
name: describedInExpression
status: Published
type: Property
domain: C10006
range: C10006
sub property of: has descriptive expression relationship with
sub property of: P60215
inverse of: is description of (expression)
definition: Relates an expression to an expression of a work that describes an expression.

is derivative (expression)
has subproperty: is musical variations (expression)
has subproperty: is remade as (expression)
has subproperty: is musical setting (expression)
has subproperty: is abstracted in (expression)
has subproperty: is indexed in (expression)
has subproperty: is choreography (expression)
has subproperty: is abstract (expression)
has subproperty: is summary (expression)
has subproperty: is basis for libretto (expression)
has subproperty: is imitated as (expression)
has subproperty: is expanded as (expression)
has subproperty: is freely translated as (expression)
has subproperty: is paraphrased as (expression)
has subproperty: is musical arrangement
has subproperty: is abridged as (expression)
has subproperty: is digest (expression)
has subproperty: is translated as
has subproperty: is based on (expression)
has subproperty: is revised as
name: derivativeExpression
status: Published
type: Property
domain: C10006
range: C10006
sub property of: has derivative expression relationship with
sub property of: P60250
inverse of: is based on (expression)
definition: Relates an expression to an expression that is a modification of a source expression.

is based on (expression)
has subproperty: is musical variations based on (expression)
has subproperty: is abridgement of (expression)
has subproperty: is abstract of (expression)
has subproperty: is digest of (expression)
has subproperty: is musical arrangement of
has subproperty: is free translation of (expression)
has subproperty: is translation of
has subproperty: is adaptation of (expression)
has subproperty: is musical setting of (expression)
has subproperty: is summary of (expression)
has subproperty: is choreography for (expression)
has subproperty: is expanded version of (expression)
has subproperty: is remake of (expression)
has subproperty: is paraphrase of (expression)
has subproperty: is revision of
has subproperty: is libretto based on (expression)
has subproperty: is abstracts for (expression)
has subproperty: is indexing for (expression)
has subproperty: is imitation of (expression)
name: basedOnExpression
status: Published
type: Property
domain: C10006
range: C10006
sub property of: is derivative (expression)
sub property of: P60305
inverse of: is derivative (expression)
definition: Relates an expression to an expression used as the basis for a derivative expression.

has related expression
has subproperty: has derivative expression relationship with
has subproperty: has descriptive expression relationship with
has subproperty: has sequential expression relationship with
has subproperty: has whole-part expression relationship with
name: relatedExpression
status: Published
type: Property
domain: C10006
range: C10006
sub property of: P60313
definition: Relates an expression to an expression, represented by an identifier, an authorized access point, or a description, that is related to the expression being described (e.g., a revised version, a translation).

has supplementary content
name: supplementaryContent
status: Published
type: Property
domain: C10006
sub property of: P60485
definition: Relates an expression to content (e.g., an index, a bibliography, an appendix) designed to supplement the primary content of a resource.

has illustrative content
name: illustrativeContent
status: Published
type: Property
domain: C10006
sub property of: P60486
definition: Relates an expression to content designed to illustrate the primary content of a resource.

has accessibility content
name: accessibilityContent
status: Published
type: Property
domain: C10006
sub property of: P60487
definition: Relates an expression to content that assists those with a sensory impairment in the greater understanding of content which their impairment prevents them fully seeing or hearing.

has format of notated music
name: formatOfNotatedMusic
status: Published
type: Property
domain: C10006
sub property of: P60488
definition: Relates an expression to format of notated music is the musical or physical layout of the content of a resource that is presented in the form of musical notation.

has other details of cartographic content
name: otherDetailsOfCartographicContent
status: Published
type: Property
domain: C10006
sub property of: P60498
definition: Relates an expression to mathematical data and other features of the cartographic content of a resource not recorded in statements of scale, projection, and coordinates.

is revised as
name: revisedAs
status: Published
type: Property
domain: C10006
range: C10006
sub property of: is derivative (expression)
sub property of: P60245
inverse of: is revision of
definition: Relates an expression to an expression of a work that has been updated, corrected, or expanded.

is merged to form (expression)
name: mergedToFormExpression
status: Published
type: Property
domain: C10006
range: C10006
sub property of: P60504
inverse of: is merger of (expression)
definition: Relates an expression to an expression of a work which brings the expression together with another expression.

has additional scale information
name: additionalScaleInformation
status: Published
type: Property
domain: C10006
sub property of: has scale
sub property of: P60510
definition: Relates an expression to supplemental information about scale such as a statement of comparative measurements or limitation of the scale to particular parts of the content of a resource.

has date of expression
name: dateOfExpression
status: Published
type: Property
domain: C10006
sub property of: P60527
definition: Relates an expression to the earliest date associated with an expression.

has medium of performance of musical content
name: mediumOfPerformanceOfMusicalContent
status: Published
type: Property
domain: C10006
sub property of: P60537
definition: Relates an expression to the instrument, instruments, voice, voices, etc., used (or intended to be used) for performance of musical content.

has projection of cartographic content
name: projectionOfCartographicContent
status: Published
type: Property
domain: C10006
sub property of: P60542
definition: Relates an expression to the method or system used to represent the surface of the earth or of a celestial sphere on a plane.

has place and date of capture
name: placeAndDateOfCapture
status: Published
type: Property
domain: C10006
sub property of: P60555
definition: Relates an expression to the place and date associated with the capture (i.e., recording, filming, etc.) of the content of a resource.

has place of capture
name: placeOfCapture
status: Published
type: Property
domain: C10006
sub property of: P60556
definition: Relates an expression to the place associated with the capture (i.e., recording, filming, etc.) of the content of a resource.

has duration
name: duration
status: Published
type: Property
domain: C10006
sub property of: P60557
definition: Relates an expression to the playing time, running time, etc., of the content of a resource.
scope note: Duration also includes performance time for a resource containing notated music or notated movement.

has colour of moving image
name: colourOfMovingImage
status: Published
type: Property
domain: C10006
sub property of: has colour content
sub property of: P60558
definition: Relates an expression to the presence of colour, tone, etc., in a moving image or images contained in a resource. colour of moving image is also the specific colours, tones, etc., (including black and white) present in a moving image or images contained in a resource.

has colour content of resource designed for persons with visual impairments
name: colourContentOfResourceDesignedForPersonsWithVisualImpairments
status: Published
type: Property
domain: C10006
sub property of: has colour content
sub property of: P60558
definition: Relates an expression to the presence of colour, tone, etc., in a resource designed for persons with visual impairments. colour content of resources designed for persons with visual impairments is also the specific colours, tones, etc., (excluding black and white) present in a resource designed for persons with visual impairments.

has colour of still image
name: colourOfStillImage
status: Published
type: Property
domain: C10006
sub property of: has colour content
sub property of: P60558
definition: Relates an expression to the presence of colour, tone, etc., in a still image or images contained in a resource. colour of still image is also the specific colours, tones, etc., (including black and white) present in a still image or images contained in a resource.

has colour of three-dimensional form
name: colourOfThreeDimensionalForm
status: Published
type: Property
domain: C10006
sub property of: has colour content
sub property of: P60558
definition: Relates an expression to the presence of colour, tone, etc., in a three-dimensional form or forms contained in a resource. colour of three-dimensional form is also the specific colours, tones, etc., (including black and white) present in a three-dimensional form or forms contained in a resource.

has colour content
has subproperty: has colour of moving image
has subproperty: has colour content of resource designed for persons with visual impairments
has subproperty: has colour of still image
has subproperty: has colour of three-dimensional form
name: colourContent
status: Published
type: Property
domain: C10006
sub property of: P60558
definition: Relates an expression to the presence of colour, tone, etc., in the content of a resource. colour content is also the specific colours, tones, etc., (including black and white) present in the content of a resource.

has sound content
name: soundContent
status: Published
type: Property
domain: C10006
sub property of: P60559
definition: Relates an expression to the presence of sound in a resource other than one that consists primarily of recorded sound.

has horizontal scale of cartographic content
name: horizontalScaleOfCartographicContent
status: Published
type: Property
domain: C10006
sub property of: has scale
sub property of: P60563
definition: Relates an expression to the ratio of horizontal distances in the cartographic content of a resource to the actual distances they represent.

has scale of still image or three-dimensional form
name: scaleOfStillImageOrThreeDimensionalForm
status: Published
type: Property
domain: C10006
sub property of: has scale
sub property of: P60564
definition: Relates an expression to the ratio of the dimensions of a still image or three-dimensional form contained or embodied in a resource to the dimensions of the entity it represents.

has scale
has subproperty: has additional scale information
has subproperty: has horizontal scale of cartographic content
has subproperty: has scale of still image or three-dimensional form
has subproperty: has vertical scale of cartographic content
name: scale
status: Published
type: Property
domain: C10006
sub property of: P60565
definition: Relates an expression to the ratio of the dimensions of an image or three-dimensional form contained or embodied in a resource to the dimensions of the entity it represents.

has aspect ratio
name: aspectRatio
status: Published
type: Property
domain: C10006
sub property of: P60566
definition: Relates an expression to the ratio of the width to the height of a moving image.

has vertical scale of cartographic content
name: verticalScaleOfCartographicContent
status: Published
type: Property
domain: C10006
sub property of: has scale
sub property of: P60579
definition: Relates an expression to the scale of elevation or vertical dimension of the cartographic content of a resource.

has work expressed
name: workExpressed
status: Published
type: Property
domain: C10006
range: C10001
inverse of: P10078
definition: Relates an expression to the work realized through an expression.

has accompanying expression relationship with
has subproperty: is complemented by (expression)
has subproperty: is augmented by (expression)
has subproperty: is augmentation of (expression)
name: accompanyingExpressionRelationship
status: Published
type: Property
domain: C10006
range: C10006
sub property of: P60709
definition: Relates an expression to an expression of a work that is an augmentation of, or is augmented by, or is complemented by the expression.

has derivative expression relationship with
has subproperty: is derivative (expression)
name: derivativeExpressionRelationship
status: Published
type: Property
domain: C10006
range: C10006
sub property of: has related expression
sub property of: P60710
definition: Relates an expression to an expression of a work that is based on or is a derivative of the expression.

has descriptive expression relationship with
has subproperty: is description of (expression)
has subproperty: is described in (expression)
name: descriptiveExpressionRelationship
status: Published
type: Property
domain: C10006
range: C10006
sub property of: has related expression
sub property of: P60711
definition: Relates an expression to an expression of a work that is described in or is a description of the expression.

has sequential expression relationship with
has subproperty: is preceded by (expression)
has subproperty: is succeeded by (expression)
name: sequentialExpressionRelationship
status: Published
type: Property
domain: C10006
range: C10006
sub property of: has related expression
sub property of: P60713
definition: Relates an expression to an expression of a work that is preceded by or succeeded by the expression.

has whole-part expression relationship with
has subproperty: is contained in (expression)
has subproperty: is container of (expression)
name: wholePartExpressionRelationship
status: Published
type: Property
domain: C10006
range: C10006
sub property of: has related expression
sub property of: P60714
definition: Relates an expression to an expression that is contained in or contains the expression.

has writer of afterword
name: writerOfAfterword
status: Published
type: Property
domain: C10006
range: C10002
sub property of: has writer of supplementary textual content
sub property of: P60715
inverse of: P50227
definition: Relates an expression to a person, family, or corporate body contributing to an expression of a work by providing an afterword to the original work.

has writer of postface
name: writerOfPostface
status: Published
type: Property
domain: C10006
range: C10002
sub property of: has writer of supplementary textual content
sub property of: P60716
inverse of: P50228
definition: Relates an expression to a person, family, or corporate body contributing to an expression of a work by providing a postface to the original work.

is musical theatre adaptation of (expression)
name: musicalTheatreAdaptationOfExpression
status: Published
type: Property
domain: C10006
range: C10006
sub property of: is adaptation of (expression)
sub property of: P60719
inverse of: is adapted as musical theatre (expression)
definition: Relates an expression to an expression of a work that has been adapted as a musical theatre work.

is opera adaptation of (expression)
name: operaAdaptationOfExpression
status: Published
type: Property
domain: C10006
range: C10006
sub property of: is adaptation of (expression)
sub property of: P60720
inverse of: is adapted as opera (expression)
definition: Relates an expression to an expression of a work that has been adapted as an opera.

is adapted as musical theatre (expression)
name: adaptedAsMusicalTheatreExpression
status: Published
type: Property
domain: C10006
range: C10006
sub property of: is adapted as (expression)
sub property of: P60721
inverse of: is musical theatre adaptation of (expression)
definition: Relates an expression to an expression of a musical theatre work based on the source expression.

is adapted as opera (expression)
name: adaptedAsOperaExpression
status: Published
type: Property
domain: C10006
range: C10006
sub property of: is adapted as (expression)
sub property of: P60722
inverse of: is opera adaptation of (expression)
definition: Relates an expression to an expression of an opera based on the source expression.

is music (expression)
name: musicExpression
status: Published
type: Property
domain: C10006
range: C10006
sub property of: is complemented by (expression)
sub property of: P60723
inverse of: is music for (expression)
definition: Relates an expression to an expression of a musical work that is used in a motion picture, play, television program, etc.

is music for (expression)
name: musicForExpression
status: Published
type: Property
domain: C10006
range: C10006
sub property of: is complemented by (expression)
sub property of: P60724
inverse of: is music (expression)
definition: Relates an expression to an expression of a work such as a motion picture, play, television program, etc. that uses the musical work.

is video music (expression)
name: videoMusicExpression
status: Published
type: Property
domain: C10006
range: C10006
sub property of: is music (expression)
sub property of: P60725
inverse of: is music for video (expression)
definition: Relates an expression to an expression of a musical work that is used in a video.

is music for video (expression)
name: musicForVideoExpression
status: Published
type: Property
domain: C10006
range: C10006
sub property of: is music for (expression)
sub property of: P60726
inverse of: is video music (expression)
definition: Relates an expression to an expression of a work that uses the musical work in a video.

is television program music (expression)
name: televisionProgramMusicExpression
status: Published
type: Property
domain: C10006
range: C10006
sub property of: is music (expression)
sub property of: P60727
inverse of: is music for television program (expression)
definition: Relates an expression to an expression of a musical work that is used in a television program.

is music for television program (expression)
name: musicForTelevisionProgramExpression
status: Published
type: Property
domain: C10006
range: C10006
sub property of: is music for (expression)
sub property of: P60728
inverse of: is television program music (expression)
definition: Relates an expression to an expression of a work that uses the musical work in a television program.

is radio program music (expression)
name: radioProgramMusicExpression
status: Published
type: Property
domain: C10006
range: C10006
sub property of: is music (expression)
sub property of: P60729
inverse of: is music for radio program (expression)
definition: Relates an expression to an expression of a musical work that is used in a radio program.

is music for radio program (expression)
name: musicForRadioProgramExpression
status: Published
type: Property
domain: C10006
range: C10006
sub property of: is music for (expression)
sub property of: P60730
inverse of: is radio program music (expression)
definition: Relates an expression to an expression of a work that uses the musical work in a radio program.

is motion picture music (expression)
name: motionPictureMusicExpression
status: Published
type: Property
domain: C10006
range: C10006
sub property of: is music (expression)
sub property of: P60731
inverse of: is music for motion picture (expression)
definition: Relates an expression to an expression of a musical work that is used in a motion picture.

is music for motion picture (expression)
name: musicForMotionPictureExpression
status: Published
type: Property
domain: C10006
range: C10006
sub property of: is music for (expression)
sub property of: P60732
inverse of: is motion picture music (expression)
definition: Relates an expression to an expression of a work that uses the musical work in a motion picture.