Published
type: Concept

Deprecated
type: Concept

RDA Agent properties
note: Properties derived from RDA elements and relationship designators with the domain of RDA Agent.

is respondent of
has unconstrained: P60001
lexical alias: respondentOf.en
name: respondentOf
status: Published
type: Property
domain: C10004
range: C10001
sub property of: is creator of
inverse of: P10001
definition: Relates a candidate for a degree who defends or opposes a thesis provided by the praeses in an academic disputation to the work.

is appellee corporate body of
has unconstrained: P60601
lexical alias: appelleeCorporateBodyOf.en
name: appelleeCorporateBodyOf
status: Published
type: Property
domain: C10005
range: C10001
sub property of: is appellee of
inverse of: P10005
definition: Relates a corporate body against whom an appeal is taken on the decision of a lower court recorded in a legal work of a higher court to the work.

is degree granting institution of
has unconstrained: P60002
lexical alias: degreeGrantingInstitutionOf.en
name: degreeGrantingInstitutionOf
status: Published
type: Property
domain: C10005
range: C10001
sub property of: is other person, family, or corporate body associated with a work of
inverse of: P10006
definition: Relates a corporate body granting an academic degree to the work.

is host institution of
has unconstrained: P60003
lexical alias: hostInstitutionOf.en
name: hostInstitutionOf
status: Published
type: Property
domain: C10005
range: C10001
sub property of: is other person, family, or corporate body associated with a work of
inverse of: P10007
definition: Relates a corporate body hosting the event, exhibit, conference, etc to the work.

is production company of
has unconstrained: P60004
lexical alias: productionCompanyOf.en
name: productionCompanyOf
status: Published
type: Property
domain: C10005
range: C10001
sub property of: is other person, family, or corporate body associated with a work of
inverse of: P10008
definition: Relates a corporate body that is responsible for financial, technical, and organizational management of a production for stage, screen, sound recording, television, webcast, etc to the work.

has identifier for the corporate body
has unconstrained: P60053
lexical alias: identifierForTheCorporateBody.en
name: identifierForTheCorporateBody
status: Published
instruction number: 11.12
toolkit definition: A character string uniquely associated with a corporate body, or with a surrogate for a corporate body (e.g., an authority record).
toolkit label: identifier for the corporate body
type: Property
domain: C10005
definition: Relates a corporate body to a character string uniquely associated with a corporate body, or with a surrogate for a corporate body (e.g., an authority record).
scope note: The identifier serves to differentiate that corporate body from other corporate bodies.

has founding corporate body
has unconstrained: P60694
lexical alias: foundingCorporateBody.en
name: foundingCorporateBody
status: Published
toolkit definition: A corporate body that founded the other corporate body.
toolkit label: founding corporate body
type: Property
domain: C10005
range: C10005
inverse of: has founded corporate body of corporate body
definition: Relates a corporate body to a corporate body that founded the other corporate body.

has hierarchical superior
has unconstrained: P60680
lexical alias: hierarchicalSuperior.en
name: hierarchicalSuperior
status: Published
toolkit definition: A corporate body that is hierarchically superior to the other corporate body.
toolkit label: hierarchical superior
type: Property
domain: C10005
range: C10005
inverse of: has hierarchical subordinate
definition: Relates a corporate body to a corporate body that is hierarchically superior to the other corporate body.

has sponsored corporate body of corporate body
has unconstrained: P60688
lexical alias: sponsoredCorporateBodyOfCorporateBody.en
name: sponsoredCorporateBodyOfCorporateBody
status: Published
toolkit definition: A corporate body that is sponsored by the other corporate body.
toolkit label: sponsored corporate body of corporate body
type: Property
domain: C10005
range: C10005
inverse of: has sponsoring corporate body
definition: Relates a corporate body to a corporate body that is sponsored by the other corporate body.

has hierarchical subordinate
has unconstrained: P60681
lexical alias: hierarchicalSubordinate.en
name: hierarchicalSubordinate
status: Published
toolkit definition: A corporate body that is subordinate to the other corporate body.
toolkit label: hierarchical subordinate
type: Property
domain: C10005
range: C10005
inverse of: has hierarchical superior
definition: Relates a corporate body to a corporate body that is subordinate to the other corporate body.

has mergee
has unconstrained: P60682
lexical alias: mergee.en
name: mergee
status: Published
toolkit definition: A corporate body that merged with the other corporate body to form a third.
toolkit label: mergee
type: Property
domain: C10005
range: C10005
definition: Relates a corporate body to a corporate body that merged with the other corporate body to form a third.

has predecessor
has unconstrained: P60683
lexical alias: predecessor.en
name: predecessor
status: Published
toolkit definition: A corporate body that precedes the other corporate body.
toolkit label: predecessor
type: Property
domain: C10005
range: C10005
inverse of: has successor
definition: Relates a corporate body to a corporate body that precedes the other corporate body.

has product of merger
has unconstrained: P60684
lexical alias: productOfAMerger.en
name: productOfAMerger
status: Published
toolkit definition: A corporate body that resulted from a merger of two or more other corporate bodies.
toolkit label: product of merger
type: Property
domain: C10005
range: C10005
inverse of: has component of merger
definition: Relates a corporate body to a corporate body that resulted from a merger of two or more other corporate bodies.

has product of split
has unconstrained: P60685
lexical alias: productOfASplit.en
name: productOfASplit
status: Published
toolkit definition: A corporate body that resulted from a split or division of the other corporate body.
toolkit label: product of split
type: Property
domain: C10005
range: C10005
inverse of: has predecessor of split
definition: Relates a corporate body to a corporate body that resulted from a split or division of the other corporate body.

has sponsoring corporate body
has unconstrained: P60676
lexical alias: sponsoringCorporateBody.en
name: sponsoringCorporateBody
status: Published
toolkit definition: A corporate body that sponsors the other corporate body.
toolkit label: sponsoring corporate body
type: Property
domain: C10005
range: C10005
inverse of: has sponsored corporate body of corporate body
definition: Relates a corporate body to a corporate body that sponsors the other corporate body.

has successor
has unconstrained: P60686
lexical alias: successor.en
name: successor
status: Published
toolkit definition: A corporate body that succeeds or follows the other corporate body.
toolkit label: successor
type: Property
domain: C10005
range: C10005
inverse of: has predecessor
definition: Relates a corporate body to a corporate body that succeeds or follows the other corporate body.

has founded corporate body of corporate body
has unconstrained: P60687
lexical alias: foundedCorporateBodyOfCorporateBody.en
name: foundedCorporateBodyOfCorporateBody
status: Published
toolkit definition: A corporate body that the other corporate body founded.
toolkit label: founded corporate body of corporate body
type: Property
domain: C10005
range: C10005
inverse of: has founding corporate body
definition: Relates a corporate body to a corporate body that the other corporate body founded.

has number of a conference, etc.
has unconstrained: P60079
lexical alias: numberOfAConferenceEtc.en
name: numberOfAConferenceEtc
status: Published
instruction number: 11.6
toolkit definition: A designation of the sequencing of a conference, etc., within a series of conferences, etc.
toolkit label: number of a conference, etc.
type: Property
domain: C10005
definition: Relates a corporate body to a designation of the sequencing of a conference, etc., within a series of conferences, etc.

has founding family
has unconstrained: P60694
lexical alias: foundingFamily.en
name: foundingFamily
status: Published
toolkit definition: A family that founded the corporate body.
toolkit label: founding family
type: Property
domain: C10005
range: C10008
inverse of: has founded corporate body of family
definition: Relates a corporate body to a family that founded the corporate body.

has sponsoring family
has unconstrained: P60676
lexical alias: sponsoringFamily.en
name: sponsoringFamily
status: Published
toolkit definition: A family that sponsors the corporate body.
toolkit label: sponsoring family
type: Property
domain: C10005
range: C10008
inverse of: has sponsored corporate body of family
definition: Relates a corporate body to a family that sponsors the corporate body.

has field of activity of the corporate body
has unconstrained: P60089
lexical alias: fieldOfActivityOfTheCorporateBody.en
name: fieldOfActivityOfTheCorporateBody
status: Published
instruction number: 11.1
toolkit definition: A field of business in which a corporate body is engaged and/or the body's area of competence, responsibility, jurisdiction, etc.
toolkit label: field of activity of the corporate body
type: Property
domain: C10005
definition: Relates a corporate body to a field of business in which a corporate body is engaged and/or the body's area of competence, responsibility, jurisdiction, etc.

has language of the corporate body
has unconstrained: P60098
lexical alias: languageOfTheCorporateBody.en
name: languageOfTheCorporateBody
status: Published
instruction number: 11.8
toolkit definition: A language a corporate body uses in its communications.
toolkit label: language of the corporate body
type: Property
domain: C10005
definition: Relates a corporate body to a language a corporate body uses in its communications.

has location of conference, etc.
has unconstrained: P60107
lexical alias: locationOfConferenceEtc.en
name: locationOfConferenceEtc
status: Published
instruction number: 11.3.2
toolkit definition: A local place in which a conference, congress, meeting, exhibition, fair, festival, etc., was held.
toolkit label: location of conference, etc.
type: Property
domain: C10005
sub property of: has place associated with the corporate body
definition: Relates a corporate body to a local place in which a conference, congress, meeting, exhibition, fair, festival, etc., was held.

has variant name for the corporate body
has unconstrained: P60119
lexical alias: variantNameForTheCorporateBody.en
name: variantNameForTheCorporateBody
status: Published
instruction number: 11.2.3
toolkit definition: A name or form of name by which a corporate body is known that differs from the name or form of name chosen as the preferred name.
toolkit label: variant name for the corporate body
type: Property
domain: C10005
sub property of: has name of the corporate body
definition: Relates a corporate body to a name or form of name by which a corporate body is known that differs from the name or form of name chosen as the preferred name.

has employee
has unconstrained: P60629
lexical alias: employee.en
name: employee
status: Published
toolkit definition: A person employed by the corporate body.
toolkit label: employee
type: Property
domain: C10005
range: C10004
inverse of: has employer
definition: Relates a corporate body to a person employed by the corporate body.

has incumbent
has unconstrained: P60633
lexical alias: incumbent.en
name: incumbent
status: Published
toolkit definition: A person holding an office in the corporate body.
toolkit label: incumbent
type: Property
domain: C10005
range: C10004
inverse of: has officiated corporate body
definition: Relates a corporate body to a person holding an office in the corporate body.

has sponsor
has unconstrained: P60676
lexical alias: sponsor.en
name: sponsor
status: Published
toolkit definition: A person sponsoring the corporate body.
toolkit label: sponsor
type: Property
domain: C10005
range: C10004
definition: Relates a corporate body to a person sponsoring the corporate body.

has founder
has unconstrained: P60694
lexical alias: founder.en
name: founder
status: Published
toolkit definition: A person who founded the corporate body.
toolkit label: founder
type: Property
domain: C10005
range: C10004
inverse of: has founded corporate body of person
definition: Relates a corporate body to a person who founded the corporate body.

has group member
has unconstrained: P60697
lexical alias: groupMember.en
name: groupMember
status: Published
toolkit definition: A person who is a member of the performing group, expedition, etc.
toolkit label: group member
type: Property
domain: C10005
range: C10004
inverse of: has group member of
definition: Relates a corporate body to a person who is a member of the performing group, expedition, etc.

has place associated with the corporate body
has unconstrained: P60325
lexical alias: placeAssociatedWithTheCorporateBody.en
name: placeAssociatedWithTheCorporateBody
status: Published
instruction number: 11.3
toolkit definition: A significant location associated with a corporate body.
toolkit label: place associated with the corporate body
type: Property
domain: C10005
definition: Relates a corporate body to a significant location associated with a corporate body.

has name of the corporate body
has subproperty: has preferred name for the corporate body
has unconstrained: P60368
lexical alias: nameOfTheCorporateBody.en
name: nameOfTheCorporateBody
status: Published
instruction number: 11.2
toolkit definition: A word, character, or group of words and/or characters by which a corporate body is known.
toolkit label: name of the corporate body
type: Property
domain: C10005
definition: Relates a corporate body to a word, character, or group of words and/or characters by which a corporate body is known.

has other designation associated with the corporate body
has unconstrained: P60370
lexical alias: otherDesignationAssociatedWithTheCorporateBody.en
name: otherDesignationAssociatedWithTheCorporateBody
status: Published
instruction number: 11.7
toolkit definition: A word, phrase, or abbreviation indicating incorporation or legal status of a corporate body, or any term serving to differentiate the body from other corporate bodies, persons, etc.
toolkit label: other designation associated with the corporate body
type: Property
domain: C10005
definition: Relates a corporate body to a word, phrase, or abbreviation indicating incorporation or legal status of a corporate body, or any term serving to differentiate the body from other corporate bodies, persons, etc.

has associated institution
has unconstrained: P60482
lexical alias: associatedInstitution.en
name: associatedInstitution
status: Published
instruction number: 11.5
toolkit definition: An institution commonly associated with a corporate body.
toolkit label: associated institution
type: Property
domain: C10005
definition: Relates a corporate body to an institution commonly associated with a corporate body.

has corporate history
has unconstrained: P60484
lexical alias: corporateHistory.en
name: corporateHistory
status: Published
instruction number: 11.11
toolkit definition: Historical information about the corporate body.
toolkit label: corporate history
type: Property
domain: C10005
definition: Relates a corporate body to historical information about the corporate body.

has address of the corporate body
has unconstrained: P60512
lexical alias: addressOfTheCorporateBody.en
name: addressOfTheCorporateBody
status: Published
instruction number: 11.9
toolkit definition: The address of a corporate body
toolkit label: address of the corporate body
type: Property
domain: C10005
definition: Relates a corporate body to the address of a corporate body's headquarters or offices, or an e-mail or internet address for the body.

has date of establishment
has unconstrained: P60524
lexical alias: dateOfEstablishment.en
name: dateOfEstablishment
status: Published
instruction number: 11.4.3
toolkit definition: The date on which a corporate body was established or founded.
toolkit label: date of establishment
type: Property
domain: C10005
sub property of: has date associated with the corporate body
definition: Relates a corporate body to the date on which a corporate body was established or founded.

has date of termination
has unconstrained: P60525
lexical alias: dateOfTermination.en
name: dateOfTermination
status: Published
instruction number: 11.4.4
toolkit definition: The date on which a corporate body was terminated or dissolved.
toolkit label: date of termination
type: Property
domain: C10005
sub property of: has date associated with the corporate body
definition: Relates a corporate body to the date on which a corporate body was terminated or dissolved.

has date of conference, etc.
has unconstrained: P60526
lexical alias: dateOfConferenceEtc.en
name: dateOfConferenceEtc
status: Published
instruction number: 11.4.2
toolkit definition: The date or range of dates on which a conference, congress, meeting, exhibition, fair, festival, etc., was held.
toolkit label: date of conference, etc.
type: Property
domain: C10005
sub property of: has date associated with the corporate body
definition: Relates a corporate body to the date or range of dates on which a conference, congress, meeting, exhibition, fair, festival, etc., was held.

has date associated with the corporate body
has subproperty: has date of establishment
has subproperty: has date of termination
has subproperty: has date of conference, etc.
has subproperty: has period of activity of the corporate body
has unconstrained: P60324
lexical alias: dateAssociatedWithTheCorporateBody.en
name: dateAssociatedWithTheCorporateBody
status: Published
instruction number: 11.4
toolkit definition: A significant date associated with the history of a corporate body, including date of conference, date of establishment, date of termination, and period of activity.
toolkit label: date associated with the corporate body
type: Property
domain: C10005
definition: Relates a corporate body to a significant date associated with the history of a corporate body, including date of conference, date of establishment, date of termination, and period of activity.

has preferred name for the corporate body
has unconstrained: P60549
lexical alias: preferredNameForTheCorporateBody.en
name: preferredNameForTheCorporateBody
status: Published
instruction number: 11.2.2
toolkit definition: The name or form of name chosen to identify the corporate body.
toolkit label: preferred name for the corporate body
type: Property
domain: C10005
sub property of: has name of the corporate body
definition: Relates a corporate body to the name or form of name chosen to identify the corporate body.

is appellant corporate body of
has unconstrained: P60691
lexical alias: appellantCorporateBodyOf.en
name: appellantCorporateBodyOf
status: Published
type: Property
domain: C10005
range: C10001
sub property of: is appellant of
inverse of: P10009
definition: Relates a corporate body who appeals the decision of a lower court recorded in a legal work of a higher court to the work.

is plaintiff corporate body of
has unconstrained: P60693
lexical alias: plaintiffCorporateBodyOf.en
name: plaintiffCorporateBodyOf
status: Published
type: Property
domain: C10005
range: C10001
sub property of: is plaintiff of
inverse of: P10010
definition: Relates a corporate body who brings a suit in a civil proceeding to the work.

is court governed of
has unconstrained: P60005
lexical alias: courtGovernedOf.en
name: courtGovernedOf
status: Published
type: Property
domain: C10005
range: C10001
sub property of: is other person, family, or corporate body associated with a work of
inverse of: P10011
definition: Relates a court governed by court rules, regardless of their official nature (e.g., laws, administrative regulations) to the work.

is collector of
has unconstrained: P60006
lexical alias: collectorOf.en
name: collectorOf
status: Published
type: Property
domain: C10002
range: C10003
sub property of: is curator of
inverse of: P40004
definition: Relates a curator who brings together items from various sources that are then arranged, described, and cataloged as a collection to the item.

is collection registrar of
has unconstrained: P60007
lexical alias: collectionRegistrarOf.en
name: collectionRegistrarOf
status: Published
type: Property
domain: C10002
range: C10003
sub property of: is curator of
inverse of: P40005
definition: Relates a curator who lists or inventories the items in an aggregate work such as a collection of items or works to the item.

is depositor of
has unconstrained: P60008
lexical alias: depositorOf.en
name: depositorOf
status: Published
type: Property
domain: C10002
range: C10003
sub property of: is current owner of
inverse of: P40006
definition: Relates a current owner of an item who deposited the item into the custody of another person, family, or corporate body, while still retaining ownership to the item.

is film director of
has unconstrained: P60009
lexical alias: filmDirectorOf.en
name: filmDirectorOf
status: Published
type: Property
domain: C10002
range: C10001
sub property of: is director of
inverse of: P10013
definition: Relates a director responsible for the general management and supervision of a filmed performance to the work.

is radio director of
has unconstrained: P60010
lexical alias: radioDirectorOf.en
name: radioDirectorOf
status: Published
type: Property
domain: C10002
range: C10001
sub property of: is director of
inverse of: P10014
definition: Relates a director responsible for the general management and supervision of a radio program to the work.

is television director of
has unconstrained: P60011
lexical alias: televisionDirectorOf.en
name: televisionDirectorOf
status: Published
type: Property
domain: C10002
range: C10001
sub property of: is director of
inverse of: P10015
definition: Relates a director responsible for the general management and supervision of a television program to the work.

has type of family
has unconstrained: P60047
lexical alias: typeOfFamily.en
name: typeOfFamily
status: Published
instruction number: 10.3
toolkit definition: A categorization or generic descriptor for the type of family.
toolkit label: type of family
type: Property
domain: C10008
definition: Relates a family to a categorization or generic descriptor for the type of family.

has identifier for the family
has unconstrained: P60053
lexical alias: identifierForTheFamily.en
name: identifierForTheFamily
status: Published
instruction number: 10.1
toolkit definition: A character string uniquely associated with a family, or with a surrogate for a family (e.g., an authority record).
toolkit label: identifier for the family
type: Property
domain: C10008
definition: Relates a family to a character string uniquely associated with a family, or with a surrogate for a family (e.g., an authority record).
scope note: The identifier serves to differentiate that family from other families.

has descendant family
has unconstrained: P60686
lexical alias: descendantFamily.en
name: descendantFamily
status: Published
toolkit definition: A family descended from the other family.
toolkit label: descendant family
type: Property
domain: C10008
range: C10008
definition: Relates a family to a family descended from the other family.

has variant name for the family
has unconstrained: P60119
lexical alias: variantNameForTheFamily.en
name: variantNameForTheFamily
status: Published
instruction number: 10.2.3
toolkit definition: A name or form of name by which a family is known that differs from the name or form of name chosen as the preferred name.
toolkit label: variant name for the family
type: Property
domain: C10008
sub property of: has name of the family
definition: Relates a family to a name or form of name by which a family is known that differs from the name or form of name chosen as the preferred name.

has progenitor
has unconstrained: P60683
lexical alias: progenitor.en
name: progenitor
status: Published
toolkit definition: A person from whom the family is descended.
toolkit label: progenitor
type: Property
domain: C10008
range: C10004
sub property of: has family member
inverse of: has descendants
definition: Relates a family to a person from whom the family is descended.

has family member
has subproperty: has progenitor
has unconstrained: P60648
lexical alias: familyMember.en
name: familyMember
status: Published
toolkit definition: A person who is a member of the family.
toolkit label: family member
type: Property
domain: C10008
range: C10004
inverse of: has family
definition: Relates a family to a person who is a member of the family.

has place associated with the family
has unconstrained: P60325
lexical alias: placeAssociatedWithTheFamily.en
name: placeAssociatedWithTheFamily
status: Published
instruction number: 10.5
toolkit definition: A place where a family resides or has resided or has some connection.
toolkit label: place associated with the family
type: Property
domain: C10008
definition: Relates a family to a place where a family resides or has resided or has some connection.

has date associated with the family
has unconstrained: P60324
lexical alias: dateAssociatedWithTheFamily.en
name: dateAssociatedWithTheFamily
status: Published
instruction number: 10.4
toolkit definition: A significant date associated with a family.
toolkit label: date associated with the family
type: Property
domain: C10008
definition: Relates a family to a significant date associated with a family.

has hereditary title
has unconstrained: P60356
lexical alias: hereditaryTitle.en
name: hereditaryTitle
status: Published
instruction number: 10.7
toolkit definition: A title of nobility, etc., associated with a family.
toolkit label: hereditary title
type: Property
domain: C10008
definition: Relates a family to a title of nobility, etc., associated with a family.

has prominent member of the family
has unconstrained: P60362
lexical alias: prominentMemberOfTheFamily.en
name: prominentMemberOfTheFamily
status: Published
instruction number: 10.6
toolkit definition: A well-known individual who is a member of a family.
toolkit label: prominent member of the family
type: Property
domain: C10008
definition: Relates a family to a well-known individual who is a member of a family.

has name of the family
has subproperty: has variant name for the family
has subproperty: has preferred name for the family
has unconstrained: P60368
lexical alias: nameOfTheFamily.en
name: nameOfTheFamily
status: Published
instruction number: 10.2
toolkit definition: A word, character, or group of words and/or characters by which a family is known.
toolkit label: name of the family
type: Property
domain: C10008
definition: Relates a family to a word, character, or group of words and/or characters by which a family is known.

has founded corporate body of family
has unconstrained: P60687
lexical alias: foundedCorporateBodyOfFamily.en
name: foundedCorporateBodyOfFamily
status: Published
toolkit definition: An organization that the family founded.
toolkit label: founded corporate body of family
type: Property
domain: C10008
range: C10005
inverse of: has founding family
definition: Relates a family to an organization that the family founded.

has sponsored corporate body of family
has unconstrained: P60688
lexical alias: sponsoredCorporateBodyOfFamily.en
name: sponsoredCorporateBodyOfFamily
status: Published
toolkit definition: An organization that the family sponsors.
toolkit label: sponsored corporate body of family
type: Property
domain: C10008
range: C10005
inverse of: has sponsoring family
definition: Relates a family to an organization that the family sponsors.

has family history
has unconstrained: P60484
lexical alias: familyHistory.en
name: familyHistory
status: Published
instruction number: 10.9
toolkit definition: Biographical information about the family and/or its members.
toolkit label: family history
type: Property
domain: C10008
definition: Relates a family to biographical information about the family and/or its members.

has preferred name for the family
has unconstrained: P60549
lexical alias: preferredNameForTheFamily.en
name: preferredNameForTheFamily
status: Published
instruction number: 10.2.2
toolkit definition: The name or form of name chosen to identify the family.
toolkit label: preferred name for the family
type: Property
domain: C10008
sub property of: has name of the family
definition: Relates a family to the name or form of name chosen to identify the family.

is donor of
has unconstrained: P60012
lexical alias: donorOf.en
name: donorOf
status: Published
type: Property
domain: C10002
range: C10003
sub property of: is former owner of
inverse of: P40007
definition: Relates a former owner of an item who donated that item to another owner to the item.

is seller of
has unconstrained: P60013
lexical alias: sellerOf.en
name: sellerOf
status: Published
type: Property
domain: C10002
range: C10003
sub property of: is former owner of
inverse of: P40008
definition: Relates a former owner of an item who sold that item to another owner to the item.

is enacting jurisdiction of
has unconstrained: P60014
lexical alias: enactingJurisdictionOf.en
name: enactingJurisdictionOf
status: Published
type: Property
domain: C10005
range: C10001
sub property of: is creator of
inverse of: P10017
definition: Relates a jurisdiction enacting a law, regulation, constitution, court rule, etc. to the work.

is jurisdiction governed of
has unconstrained: P60015
lexical alias: jurisdictionGovernedOf.en
name: jurisdictionGovernedOf
status: Published
type: Property
domain: C10005
range: C10001
sub property of: is other person, family, or corporate body associated with a work of
inverse of: P10018
definition: Relates a jurisdiction governed by a law, regulation, etc., that was enacted by another jurisdiction to the work.

is conductor of
has subproperty: is choral conductor of
has subproperty: is instrumental conductor of
has unconstrained: P60016
lexical alias: conductorOf.en
name: conductorOf
status: Published
type: Property
domain: C10002
range: C10006
sub property of: is performer of
inverse of: P20011
definition: Relates a performer contributing to an expression of a musical work by leading a performing group (orchestra, chorus, opera, etc.) in a musical or dramatic presentation, etc. to the expression.

is actor of
has subproperty: is voice actor of
has unconstrained: P60017
lexical alias: actorOf.en
name: actorOf
status: Published
type: Property
domain: C10002
range: C10006
sub property of: is performer of
inverse of: P20012
definition: Relates a performer contributing to an expression of a work by acting as a cast member or player in a musical or dramatic presentation, etc to the expression.

is on-screen presenter of
has unconstrained: P60018
lexical alias: onScreenPresenterOf.en
name: onScreenPresenterOf
status: Published
type: Property
domain: C10002
range: C10006
sub property of: is performer of
inverse of: P20013
definition: Relates a performer contributing to an expression of a work by appearing on screen to provide contextual or background information to the expression.
scope note: An on-screen presenter may appear in nonfiction moving image materials or in introductions to fiction moving image materials.

is dancer of
has unconstrained: P60019
lexical alias: dancerOf.en
name: dancerOf
status: Published
type: Property
domain: C10002
range: C10006
sub property of: is performer of
inverse of: P20014
definition: Relates a performer contributing to an expression of a work by dancing in a musical, dramatic, etc., presentation to the expression.

is teacher of
has unconstrained: P60020
lexical alias: teacherOf.en
name: teacherOf
status: Published
type: Property
domain: C10002
range: C10006
sub property of: is performer of
inverse of: P20015
definition: Relates a performer contributing to an expression of a work by giving instruction or providing a demonstration to the expression.

is host of
has unconstrained: P60021
lexical alias: hostOf.en
name: hostOf
status: Published
type: Property
domain: C10002
range: C10006
sub property of: is performer of
inverse of: P20016
definition: Relates a performer contributing to an expression of a work by leading a program (often broadcast) that includes other guests, performers, etc. (e.g., talk show host) to the expression.

is moderator of
has unconstrained: P60022
lexical alias: moderatorOf.en
name: moderatorOf
status: Published
type: Property
domain: C10002
range: C10006
sub property of: is performer of
inverse of: P20017
definition: Relates a performer contributing to an expression of a work by leading a program (often broadcast) where topics are discussed, usually with participation of experts in fields related to the discussion to the expression.

is puppeteer of
has unconstrained: P60023
lexical alias: puppeteerOf.en
name: puppeteerOf
status: Published
type: Property
domain: C10002
range: C10006
sub property of: is performer of
inverse of: P20018
definition: Relates a performer contributing to an expression of a work by manipulating, controlling, or directing puppets or marionettes in a moving image production or a musical or dramatic presentation or entertainment to the expression.

is panelist of
has unconstrained: P60024
lexical alias: panelistOf.en
name: panelistOf
status: Published
type: Property
domain: C10002
range: C10006
sub property of: is performer of
inverse of: P20019
definition: Relates a performer contributing to an expression of a work by participating in a program (often broadcast) where topics are discussed, usually with participation of experts in fields related to the discussion to the expression.

is instrumentalist of
has unconstrained: P60025
lexical alias: instrumentalistOf.en
name: instrumentalistOf
status: Published
type: Property
domain: C10002
range: C10006
sub property of: is performer of
inverse of: P20020
definition: Relates a performer contributing to an expression of a work by playing a musical instrument to the expression.

is commentator of
has unconstrained: P60026
lexical alias: commentatorOf.en
name: commentatorOf
status: Published
type: Property
domain: C10002
range: C10006
sub property of: is performer of
inverse of: P20021
definition: Relates a performer contributing to an expression of a work by providing interpretation, analysis, or a discussion of the subject matter on a recording, film, or other audiovisual medium to the expression.

is narrator of
has unconstrained: P60028
lexical alias: narratorOf.en
name: narratorOf
status: Published
type: Property
domain: C10002
range: C10006
sub property of: is performer of
inverse of: P20022
definition: Relates a performer contributing to an expression of a work by reading aloud or giving an account of an act, occurrence, course of events, etc to the expression.

is storyteller of
has unconstrained: P60029
lexical alias: storytellerOf.en
name: storytellerOf
status: Published
type: Property
domain: C10002
range: C10006
sub property of: is performer of
inverse of: P20023
definition: Relates a performer contributing to an expression of a work by relaying a creator's original story with dramatic or theatrical interpretation to the expression.

is speaker of
has unconstrained: P60030
lexical alias: speakerOf.en
name: speakerOf
status: Published
type: Property
domain: C10002
range: C10006
sub property of: is performer of
inverse of: P20024
definition: Relates a performer contributing to an expression of a work by speaking words, such as a lecture, speech, etc to the expression.

is singer of
has unconstrained: P60031
lexical alias: singerOf.en
name: singerOf
status: Published
type: Property
domain: C10002
range: C10006
sub property of: is performer of
inverse of: P20025
definition: Relates a performer contributing to an expression of a work by using his/her/their voice, with or without instrumental accompaniment, to produce music to the expression.
scope note: A singer's performance may or may not include actual words.

is appellee person of
has unconstrained: P60601
lexical alias: appelleePersonOf.en
name: appelleePersonOf
status: Published
type: Property
domain: C10004
range: C10001
sub property of: is appellee of
inverse of: P10035
definition: Relates a person against whom an appeal is taken on the decision of a lower court recorded in a legal work of a higher court to the work.

is medium of
has unconstrained: P60032
lexical alias: mediumOf.en
name: mediumOf
status: Published
type: Property
domain: C10004
range: C10001
sub property of: is other person, family, or corporate body associated with a work of
inverse of: P10036
definition: Relates a person held to be a channel of communication between the earthly world and a world of spirits to the work.

is appellee of
has subproperty: is appellee person of
has unconstrained: P60601
lexical alias: appelleeOf.en
name: appelleeOf
status: Published
type: Property
range: C10001
sub property of: is other person, family, or corporate body associated with a work of
inverse of: P10037
definition: Relates a person or corporate body against whom an appeal is taken on the decision of a lower court recorded in a legal work of a higher court to the work.

is appellant of
has subproperty: is appellant corporate body of
has subproperty: is appellant person of
has unconstrained: P60691
lexical alias: appellantOf.en
name: appellantOf
status: Published
type: Property
range: C10001
sub property of: is other person, family, or corporate body associated with a work of
inverse of: P10038
definition: Relates a person or corporate body who appeals the decision of a lower court recorded in a legal work of a higher court to the work.

is plaintiff of
has subproperty: is plaintiff corporate body of
has subproperty: is plaintiff person of
has unconstrained: P60693
lexical alias: plaintiffOf.en
name: plaintiffOf
status: Published
type: Property
range: C10001
sub property of: is other person, family, or corporate body associated with a work of
inverse of: P10039
definition: Relates a person or corporate body who brings a suit in a civil proceeding to the work.

is defendant of
has subproperty: is defendant corporate body of
has subproperty: is defendant person of
has unconstrained: P60698
lexical alias: defendantOf.en
name: defendantOf
status: Published
type: Property
range: C10001
sub property of: is other person, family, or corporate body associated with a work of
inverse of: P10040
definition: Relates a person or corporate body who is accused in a criminal proceeding or sued in a civil proceeding to the work.

is degree supervisor of
has unconstrained: P60649
lexical alias: degreeSupervisorOf.en
name: degreeSupervisorOf
status: Published
type: Property
domain: C10004
range: C10001
sub property of: is other person, family, or corporate body associated with a work of
inverse of: P10041
definition: Relates a person, such as an advisor or supervisor of thesis or dissertation research, overseeing either an academic degree or thesis to the work.

is illuminator of
has unconstrained: P60650
lexical alias: illuminatorOf.en
name: illuminatorOf
status: Published
type: Property
domain: C10004
range: C10003
sub property of: is other person, family, or corporate body associated with an item of
inverse of: P40012
definition: Relates a person providing decoration to a specific item using precious metals or color, often with elaborate designs and motifs to the item.

has undifferentiated name indicator
has unconstrained: P60046
lexical alias: undifferentiatedNameIndicator.en
name: undifferentiatedNameIndicator
status: Published
instruction number: 8.11
toolkit definition: A categorization indicating that the core elements recorded are insufficient to differentiate between two or more persons with the same name.
toolkit label: undifferentiated name indicator
type: Property
domain: C10004
definition: Relates a person to a categorization indicating that the core elements recorded are insufficient to differentiate between two or more persons with the same name.

has identifier for the person
has unconstrained: P60053
lexical alias: identifierForThePerson.en
name: identifierForThePerson
status: Published
instruction number: 9.18
toolkit definition: A character string uniquely associated with a person, or with a surrogate for a person (e.g., an authority record).
toolkit label: identifier for the person
type: Property
domain: C10004
definition: Relates a person to a character string uniquely associated with a person, or with a surrogate for a person (e.g., an authority record).
scope note: The identifier serves to differentiate that person from other persons.

has group member of
has unconstrained: P60648
lexical alias: groupMemberOf.en
name: groupMemberOf
status: Published
toolkit definition: A corporate body (performing group, expedition, etc.) of which the person is a member.
toolkit label: group member of
type: Property
domain: C10004
range: C10005
inverse of: has group member
definition: Relates a person to a corporate body (performing group, expedition, etc.) of which the person is a member.

has employer
has unconstrained: P60679
lexical alias: employer.en
name: employer
status: Published
toolkit definition: A corporate body that employs the person.
toolkit label: employer
type: Property
domain: C10004
range: C10005
inverse of: has employee
definition: Relates a person to a corporate body that employs the person.

has country associated with the person
has unconstrained: P60063
lexical alias: countryAssociatedWithThePerson.en
name: countryAssociatedWithThePerson
status: Published
instruction number: 9.1
toolkit definition: A country with which a person is identified.
toolkit label: country associated with the person
type: Property
domain: C10004
definition: Relates a person to a country with which a person is identified.

has period of activity of the person
has unconstrained: P60076
lexical alias: periodOfActivityOfThePerson.en
name: periodOfActivityOfThePerson
status: Published
instruction number: 9.3.4
toolkit definition: A date or range of dates indicative of the period in which a person was active in his or her primary field of endeavour.
toolkit label: period of activity of the person
type: Property
domain: C10004
sub property of: has date associated with the person
definition: Relates a person to a date or range of dates indicative of the period in which a person was active in his or her primary field of endeavour.

has descendants
has unconstrained: P60686
lexical alias: descendants.en
name: descendants
status: Published
toolkit definition: A family descended from the particular person.
toolkit label: descendants
type: Property
domain: C10004
range: C10008
inverse of: has progenitor
definition: Relates a person to a family descended from the particular person.

has field of activity of the person
has unconstrained: P60089
lexical alias: fieldOfActivityOfThePerson.en
name: fieldOfActivityOfThePerson
status: Published
instruction number: 9.15
toolkit definition: A field of endeavour, area of expertise, etc., in which a person is engaged or was engaged.
toolkit label: field of activity of the person
type: Property
domain: C10004
definition: Relates a person to a field of endeavour, area of expertise, etc., in which a person is engaged or was engaged.

has affiliation
has unconstrained: P60095
lexical alias: affiliation.en
name: affiliation
status: Published
instruction number: 9.13
toolkit definition: A group with which a person is affiliated or has been affiliated through employment, membership, cultural identity, etc.
toolkit label: affiliation
type: Property
domain: C10004
definition: Relates a person to a group with which a person is affiliated or has been affiliated through employment, membership, cultural identity, etc.

has language of the person
has unconstrained: P60098
lexical alias: languageOfThePerson.en
name: languageOfThePerson
status: Published
instruction number: 9.14
toolkit definition: A language a person uses when writing for publication, broadcasting, etc.
toolkit label: language of the person
type: Property
domain: C10004
definition: Relates a person to a language a person uses when writing for publication, broadcasting, etc.

has variant name for the person
has unconstrained: P60119
lexical alias: variantNameForThePerson.en
name: variantNameForThePerson
status: Published
instruction number: 9.2.3
toolkit definition: A name or form of name by which a person is known that differs from the name or form of name chosen as the preferred name.
toolkit label: variant name for the person
type: Property
domain: C10004
sub property of: has name of the person
definition: Relates a person to a name or form of name by which a person is known that differs from the name or form of name chosen as the preferred name.

has profession or occupation
has unconstrained: P60468
lexical alias: professionOrOccupation.en
name: professionOrOccupation
status: Published
instruction number: 9.16
toolkit definition: A person
toolkit label: profession or occupation
type: Property
domain: C10004
definition: Relates a person to a person's vocation or avocation.

has alternate identity
has unconstrained: P60036
lexical alias: alternateIdentity.en
name: alternateIdentity
status: Published
toolkit definition: A pseudonymous or other identity assumed by the person.
toolkit label: alternate identity
type: Property
domain: C10004
range: C10004
inverse of: has real identity
definition: Relates a person to a pseudonymous or other identity assumed by the person.

has real identity
has unconstrained: P60037
lexical alias: realIdentity.en
name: realIdentity
status: Published
toolkit definition: A real person who assumes the alternate identity.
toolkit label: real identity
type: Property
domain: C10004
range: C10004
inverse of: has alternate identity
definition: Relates a person to a real person who assumes the alternate identity.

has date associated with the person
has subproperty: has period of activity of the person
has subproperty: has date of death
has subproperty: has date of birth
has unconstrained: P60324
lexical alias: dateAssociatedWithThePerson.en
name: dateAssociatedWithThePerson
status: Published
instruction number: 9.3
toolkit definition: A significant date associated with a person (e.g., date of birth, date of death).
toolkit label: date associated with the person
type: Property
domain: C10004
definition: Relates a person to a significant date associated with a person (e.g., date of birth, date of death).

has other designation associated with the person
has unconstrained: P60370
lexical alias: otherDesignationAssociatedWithThePerson.en
name: otherDesignationAssociatedWithThePerson
status: Published
instruction number: 9.6
toolkit definition: A term other than a title that is associated with a person
toolkit label: other designation associated with the person
type: Property
domain: C10004
definition: Relates a person to a term other than a title that is associated with a person's name.

has place of residence, etc.
has unconstrained: P60360
lexical alias: placeOfResidenceEtc.en
name: placeOfResidenceEtc
status: Published
instruction number: 9.11
toolkit definition: A town, city, province, state, and/or country in which a person resides or has resided, or another significant place associated with the person other than place of birth, place of death, or residence (e.g., a place where a person has worked or studied).
toolkit label: place of residence, etc.
type: Property
domain: C10004
definition: Relates a person to a town, city, province, state, and/or country in which a person resides or has resided, or another significant place associated with the person other than place of birth, place of death, or residence (e.g., a place where a person has worked or studied).

has title of the person
has unconstrained: P60363
lexical alias: titleOfThePerson.en
name: titleOfThePerson
status: Published
instruction number: 9.4
toolkit definition: A word or phrase indicative of royalty, nobility, ecclesiastical rank or office, or a term of address for a person of religious vocation.
toolkit label: title of the person
type: Property
domain: C10004
definition: Relates a person to a word or phrase indicative of royalty, nobility, ecclesiastical rank or office, or a term of address for a person of religious vocation.
scope note: Title of the person includes other terms indicative of rank, honour, or office, including initials and/or abbreviations representing an academic degree, or membership in an organization. Title of the person excludes terms of address that simply indicate gender or marital status (e.g., Mr., Mrs.).

has name of the person
has subproperty: has variant name for the person
has subproperty: has preferred name for the person
has unconstrained: P60368
lexical alias: nameOfThePerson.en
name: nameOfThePerson
status: Published
instruction number: 9.2
toolkit definition: A word, character, or group of words and/or characters by which a person is known.
toolkit label: name of the person
type: Property
domain: C10004
definition: Relates a person to a word, character, or group of words and/or characters by which a person is known.

has founded corporate body of person
has unconstrained: P60687
lexical alias: foundedCorporateBodyOfPerson.en
name: foundedCorporateBodyOfPerson
status: Published
toolkit definition: An organization that the person founded.
toolkit label: founded corporate body of person
type: Property
domain: C10004
range: C10005
inverse of: has founder
definition: Relates a person to an organization that the person founded.

has biographical information
has unconstrained: P60492
lexical alias: biographicalInformation.en
name: biographicalInformation
status: Published
instruction number: 9.17
toolkit definition: Information about the life or history of a person.
toolkit label: biographical information
type: Property
domain: C10004
definition: Relates a person to information about the life or history of a person.

has address of the person
has unconstrained: P60512
lexical alias: addressOfThePerson.en
name: addressOfThePerson
status: Published
instruction number: 9.12
toolkit definition: The address of a person
toolkit label: address of the person
type: Property
domain: C10004
definition: Relates a person to the address of a person's place of residence, business, or employer, and/or an e-mail or internet address.

has fuller form of name
has unconstrained: P60530
lexical alias: fullerFormOfName.en
name: fullerFormOfName
status: Published
instruction number: 9.5
toolkit definition: The full form of a part of a name represented only by an initial or abbreviation in the form chosen as the preferred name, or a part of the name not included in the form chosen as the preferred name.
toolkit label: fuller form of name
type: Property
domain: C10004
definition: Relates a person to the full form of a part of a name represented only by an initial or abbreviation in the form chosen as the preferred name, or a part of the name not included in the form chosen as the preferred name.

has gender
has unconstrained: P60531
lexical alias: gender.en
name: gender
status: Published
instruction number: 9.7
toolkit definition: The gender with which a person identifies.
toolkit label: gender
type: Property
domain: C10004
definition: Relates a person to the gender with which a person identifies.

has preferred name for the person
has unconstrained: P60549
lexical alias: preferredNameForThePerson.en
name: preferredNameForThePerson
status: Published
instruction number: 9.2.2
toolkit definition: The name or form of name chosen to identify the person.
toolkit label: preferred name for the person
type: Property
domain: C10004
sub property of: has name of the person
definition: Relates a person to the name or form of name chosen to identify the person.

has place of death
has unconstrained: P60592
lexical alias: placeOfDeath.en
name: placeOfDeath
status: Published
instruction number: 9.9
toolkit definition: The town, city, province, state, and/or country in which a person died.
toolkit label: place of death
type: Property
domain: C10004
definition: Relates a person to the town, city, province, state, and/or country in which a person died.

has place of birth
has unconstrained: P60593
lexical alias: placeOfBirth.en
name: placeOfBirth
status: Published
instruction number: 9.8
toolkit definition: The town, city, province, state, and/or country in which a person was born.
toolkit label: place of birth
type: Property
domain: C10004
definition: Relates a person to the town, city, province, state, and/or country in which a person was born.

has date of death
has unconstrained: P60598
lexical alias: dateOfDeath.en
name: dateOfDeath
status: Published
instruction number: 9.3.3
toolkit definition: The year a person died.
toolkit label: date of death
type: Property
domain: C10004
sub property of: has date associated with the person
definition: Relates a person to the year a person died.
scope note: Date of death may also include the month or month and day of the person's death.

has date of birth
has unconstrained: P60599
lexical alias: dateOfBirth.en
name: dateOfBirth
status: Published
instruction number: 9.3.2
toolkit definition: The year a person was born.
toolkit label: date of birth
type: Property
domain: C10004
sub property of: has date associated with the person
definition: Relates a person to the year a person was born.
scope note: Date of birth may also include the month or month and day of the person's birth.

is appellant person of
has unconstrained: P60691
lexical alias: appellantPersonOf.en
name: appellantPersonOf
status: Published
type: Property
domain: C10004
range: C10001
sub property of: is appellant of
inverse of: P10042
definition: Relates a person who appeals the decision of a lower court recorded in a legal work of a higher court to the work.

is binder of
has unconstrained: P60692
lexical alias: binderOf.en
name: binderOf
status: Published
type: Property
domain: C10004
range: C10003
sub property of: is other person, family, or corporate body associated with an item of
inverse of: P40013
definition: Relates a person who binds an item to the item.

is plaintiff person of
has unconstrained: P60693
lexical alias: plaintiffPersonOf.en
name: plaintiffPersonOf
status: Published
type: Property
domain: C10004
range: C10001
sub property of: is plaintiff of
inverse of: P10043
definition: Relates a person who brings a suit in a civil proceeding to the work.

is inscriber of
has unconstrained: P60695
lexical alias: inscriberOf.en
name: inscriberOf
status: Published
type: Property
domain: C10004
range: C10003
sub property of: is other person, family, or corporate body associated with an item of
inverse of: P40014
definition: Relates a person who has written a statement of dedication or gift on an item to the item.

is judge of
has unconstrained: P60696
lexical alias: judgeOf.en
name: judgeOf
status: Published
type: Property
domain: C10004
range: C10001
sub property of: is other person, family, or corporate body associated with a work of
inverse of: P10044
definition: Relates a person who hears and decides on legal matters in court to the work.

is praeses of
has unconstrained: P60699
lexical alias: praesesOf.en
name: praesesOf
status: Published
type: Property
domain: C10004
range: C10001
sub property of: is creator of
inverse of: P10045
definition: Relates a person who is the faculty moderator of an academic disputation, normally proposing a thesis and participating in the ensuing disputation to the work.

is annotator of
has unconstrained: P60700
lexical alias: annotatorOf.en
name: annotatorOf
status: Published
type: Property
domain: C10004
range: C10003
sub property of: is other person, family, or corporate body associated with an item of
inverse of: P40015
definition: Relates a person who makes manuscript annotations on an item to the item.

is autographer of
has unconstrained: P60702
lexical alias: autographerOf.en
name: autographerOf
status: Published
type: Property
domain: C10004
range: C10003
sub property of: is other person, family, or corporate body associated with an item of
inverse of: P40016
definition: Relates a person whose manuscript signature appears on an item to the item.

is issuing body of
has unconstrained: P60703
lexical alias: issuingBodyOf.en
name: issuingBodyOf
status: Published
type: Property
domain: C10002
range: C10001
sub property of: is other person, family, or corporate body associated with a work of
inverse of: P10046
definition: Relates a person, family, or corporate body issuing a work, such as an official organ of the body to the work.

is other person, family, or corporate body associated with a work of
has subproperty: is court governed of
has subproperty: is jurisdiction governed of
has subproperty: is medium of
has subproperty: is appellee of
has subproperty: is appellant of
has subproperty: is plaintiff of
has subproperty: is defendant of
has subproperty: is degree supervisor of
has subproperty: is judge of
has subproperty: is issuing body of
has subproperty: is dedicator of
has subproperty: is honouree of
has subproperty: is producer of
has subproperty: is director of
has subproperty: is director of photography of
has subproperty: is dedicatee of
has subproperty: is addressee of
has subproperty: is consultant of
has subproperty: is sponsoring body of
has subproperty: is degree committee member of
has subproperty: is commissioning body of
has subproperty: is participant in a treaty of
has subproperty: is researcher of
has subproperty: is organizer of
has unconstrained: P60602
lexical alias: otherPFCWorkOf.en
name: otherPFCWorkOf
status: Published
type: Property
domain: C10002
range: C10001
inverse of: P10047
definition: Relates a person, family, or corporate body associated with a work other than as a creator to the work.
scope note: Includes persons, etc., to whom correspondence is addressed, persons, etc., honoured by a festschrift, directors, cinematographers, sponsoring bodies, production companies, institutions, etc., hosting an exhibition or event, etc

is dedicator of
has unconstrained: P60603
lexical alias: dedicatorOf.en
name: dedicatorOf
status: Published
type: Property
domain: C10002
range: C10001
sub property of: is other person, family, or corporate body associated with a work of
inverse of: P10048
definition: Relates a person, family, or corporate body by whom a work is dedicated to the work.

is curator of
has subproperty: is collector of
has subproperty: is collection registrar of
has unconstrained: P60604
lexical alias: curatorOf.en
name: curatorOf
status: Published
type: Property
domain: C10002
range: C10003
sub property of: is other person, family, or corporate body associated with an item of
inverse of: P40017
definition: Relates a person, family, or corporate body conceiving, aggregating, and/or organizing an exhibition, collection, or other item to the item.

is composer (expression) of
has unconstrained: P60655
lexical alias: composerExpressionOf.en
name: composerExpressionOf
status: Published
type: Property
domain: C10002
range: C10006
sub property of: is contributor of
inverse of: P20026
definition: Relates a person, family, or corporate body contributing to an expression by adding music to a work that originally lacked it, by composing new music to substitute for the original music, or by composing new music to supplement the existing music to the expression.

is surveyor of
has unconstrained: P60605
lexical alias: surveyorOf.en
name: surveyorOf
status: Published
type: Property
domain: C10002
range: C10006
sub property of: is contributor of
inverse of: P20027
definition: Relates a person, family, or corporate body contributing to an expression of a cartographic work by providing measurements or dimensional relationships for the geographic area represented to the expression.

is animator of
has unconstrained: P60606
lexical alias: animatorOf.en
name: animatorOf
status: Published
type: Property
domain: C10002
range: C10006
sub property of: is contributor of
inverse of: P20028
definition: Relates a person, family, or corporate body contributing to an expression of a moving image work or computer program by giving apparent movement to inanimate objects or drawings to the expression.

is arranger of music of
has unconstrained: P60607
lexical alias: arrangerOfMusicOf.en
name: arrangerOfMusicOf
status: Published
type: Property
domain: C10002
range: C10006
sub property of: is contributor of
inverse of: P20029
definition: Relates a person, family, or corporate body contributing to an expression of a musical work by rewriting the composition for a medium of performance different from that for which the work was originally intended to the expression.
scope note: An arranger of music may also modify the work for the same medium of performance, etc., keeping the musical substance of the original composition essentially unchanged.

is writer of added text of
has subproperty: is writer of added lyrics of
has unconstrained: P60608
lexical alias: writerOfAddedTextOf.en
name: writerOfAddedTextOf
status: Published
type: Property
domain: C10002
range: C10006
sub property of: is writer of supplementary textual content of
inverse of: P20030
definition: Relates a person, family, or corporate body contributing to an expression of a work by providing supplementary textual content (e.g., an appendix, an introduction, a preface) to the original work to the expression.

is stage director of
has unconstrained: P60627
lexical alias: stageDirectorOf.en
name: stageDirectorOf
status: Published
type: Property
domain: C10002
range: C10006
sub property of: is contributor of
inverse of: P20031
definition: Relates a person, family, or corporate body contributing to an expression of a stage work through the general management and supervision of a performance to the expression.

is interviewer (expression) of
has unconstrained: P60659
lexical alias: interviewerExpressionOf.en
name: interviewerExpressionOf
status: Published
type: Property
domain: C10002
range: C10006
sub property of: is contributor of
inverse of: P20032
definition: Relates a person, family, or corporate body contributing to an expression of a work by acting as an interviewer, reporter, pollster, or some other information gathering agent to the expression.

is draftsman of
has unconstrained: P60609
lexical alias: draftsmanOf.en
name: draftsmanOf
status: Published
type: Property
domain: C10002
range: C10006
sub property of: is contributor of
inverse of: P20033
definition: Relates a person, family, or corporate body contributing to an expression of a work by an architect, inventor, etc., by making detailed plans or drawings for buildings, ships, aircraft, machines, objects, etc. to the expression.

is transcriber of
has unconstrained: P60610
lexical alias: transcriberOf.en
name: transcriberOf
status: Published
type: Property
domain: C10002
range: C10006
sub property of: is contributor of
inverse of: P20034
definition: Relates a person, family, or corporate body contributing to an expression of a work by writing down or notating previously unwritten or unnotated content, or by changing it from one system of notation to another to the expression.

is musical director of
has unconstrained: P60611
lexical alias: musicalDirectorOf.en
name: musicalDirectorOf
status: Published
type: Property
domain: C10002
range: C10006
sub property of: is contributor of
inverse of: P20035
definition: Relates a person, family, or corporate body contributing to an expression of a work by coordinating the activities of the composer, the sound editor, and sound mixers for a moving image production or for a musical or dramatic presentation or entertainment to the expression.

is costume designer of
has unconstrained: P60612
lexical alias: costumeDesignerOf.en
name: costumeDesignerOf
status: Published
type: Property
domain: C10002
range: C10006
sub property of: is contributor of
inverse of: P20036
definition: Relates a person, family, or corporate body contributing to an expression of a work by designing the costumes for a moving image production or for a musical or dramatic presentation or entertainment to the expression.

is translator of
has unconstrained: P60613
lexical alias: translatorOf.en
name: translatorOf
status: Published
type: Property
domain: C10002
range: C10006
sub property of: is contributor of
inverse of: P20037
definition: Relates a person, family, or corporate body contributing to an expression of a work by expressing the linguistic content of the work in a language different from that of previous expressions of the original work to the expression.
scope note: A translator may also translate linguistic content between forms of the same language from different time periods.

is art director of
has unconstrained: P60614
lexical alias: artDirectorOf.en
name: artDirectorOf
status: Published
type: Property
domain: C10002
range: C10006
sub property of: is contributor of
inverse of: P20038
definition: Relates a person, family, or corporate body contributing to an expression of a work by overseeing the artists and craftspeople who build the sets for moving image productions to the expression.

is performer of
has subproperty: is conductor of
has subproperty: is actor of
has subproperty: is on-screen presenter of
has subproperty: is dancer of
has subproperty: is teacher of
has subproperty: is host of
has subproperty: is moderator of
has subproperty: is puppeteer of
has subproperty: is panelist of
has subproperty: is instrumentalist of
has subproperty: is commentator of
has subproperty: is narrator of
has subproperty: is storyteller of
has subproperty: is speaker of
has subproperty: is singer of
has unconstrained: P60615
lexical alias: performerOf.en
name: performerOf
status: Published
type: Property
domain: C10002
range: C10006
sub property of: is contributor of
inverse of: P20039
definition: Relates a person, family, or corporate body contributing to an expression of a work by performing music, acting, dancing, speaking, etc. to the expression.

is court reporter of
has unconstrained: P60616
lexical alias: courtReporterOf.en
name: courtReporterOf
status: Published
type: Property
domain: C10002
range: C10006
sub property of: is contributor of
inverse of: P20040
definition: Relates a person, family, or corporate body contributing to an expression of a work by preparing a court's opinions for publication to the expression.

is writer of preface of
has unconstrained: P60617
lexical alias: writerOfPrefaceOf.en
name: writerOfPrefaceOf
status: Published
type: Property
domain: C10002
range: C10006
sub property of: is writer of supplementary textual content of
inverse of: P20041
definition: Relates a person, family, or corporate body contributing to an expression of a work by providing a preface to the original work to the expression.

is cartographer (expression) of
has unconstrained: P60654
lexical alias: cartographerExpressionOf.en
name: cartographerExpressionOf
status: Published
type: Property
domain: C10002
range: C10006
sub property of: is contributor of
inverse of: P20042
definition: Relates a person, family, or corporate body contributing to an expression of a work by providing additional cartography, or by modifying the previous cartography to the expression.

is choreographer (expression) of
has unconstrained: P60662
lexical alias: choreographerExpressionOf.en
name: choreographerExpressionOf
status: Published
type: Property
domain: C10002
range: C10006
sub property of: is contributor of
inverse of: P20043
definition: Relates a person, family, or corporate body contributing to an expression of a work by providing additional choreography, or by modifying the previous choreography to the expression.

is writer of added commentary of
has unconstrained: P60618
lexical alias: writerOfAddedCommentaryOf.en
name: writerOfAddedCommentaryOf
status: Published
type: Property
domain: C10002
range: C10006
sub property of: is writer of supplementary textual content of
inverse of: P20044
definition: Relates a person, family, or corporate body contributing to an expression of a work by providing an interpretation or critical explanation of the original work to the expression.

is writer of introduction of
has unconstrained: P60619
lexical alias: writerOfIntroductionOf.en
name: writerOfIntroductionOf
status: Published
type: Property
domain: C10002
range: C10006
sub property of: is writer of supplementary textual content of
inverse of: P20045
definition: Relates a person, family, or corporate body contributing to an expression of a work by providing an introduction to the original work to the expression.

is writer of supplementary textual content of
has subproperty: is writer of added text of
has subproperty: is writer of preface of
has subproperty: is writer of added commentary of
has subproperty: is writer of introduction of
has subproperty: is writer of foreword of
has unconstrained: P60620
lexical alias: writerOfSupplementaryTextualContentOf.en
name: writerOfSupplementaryTextualContentOf
status: Published
type: Property
domain: C10002
range: C10006
sub property of: is contributor of
inverse of: P20046
definition: Relates a person, family, or corporate body contributing to an expression of a work by providing supplementary textual content (e.g., an appendix, an introduction, a preface) to the original work to the expression.

is interviewee (expression) of
has unconstrained: P60661
lexical alias: intervieweeExpressionOf.en
name: intervieweeExpressionOf
status: Published
type: Property
domain: C10002
range: C10006
sub property of: is contributor of
inverse of: P20047
definition: Relates a person, family, or corporate body contributing to an expression of a work by responding to an interviewer, usually a reporter, pollster, or some other information gathering agent to the expression.

is editor of
has unconstrained: P60621
lexical alias: editorOf.en
name: editorOf
status: Published
type: Property
domain: C10002
range: C10006
sub property of: is contributor of
inverse of: P20048
definition: Relates a person, family, or corporate body contributing to an expression of a work by revising or clarifying the content, , e.g., adding an introduction, notes, or other critical matter to the expression.
scope note: An editor may also prepare an expression of a work for production, publication, or distribution.

is abridger of
has unconstrained: P60622
lexical alias: abridgerOf.en
name: abridgerOf
status: Published
type: Property
domain: C10002
range: C10006
sub property of: is contributor of
inverse of: P20049
definition: Relates a person, family, or corporate body contributing to an expression of a work by shortening or condensing the original work but leaving the nature and content of the original work substantially unchanged to the expression.

is recording engineer of
has unconstrained: P60623
lexical alias: recordingEngineerOf.en
name: recordingEngineerOf
status: Published
type: Property
domain: C10002
range: C10006
sub property of: is contributor of
inverse of: P20050
definition: Relates a person, family, or corporate body contributing to an expression of a work by supervising the technical aspects of a sound or video recording session to the expression.

is illustrator of
has subproperty: is letterer of
has unconstrained: P60624
lexical alias: illustratorOf.en
name: illustratorOf
status: Published
type: Property
domain: C10002
range: C10006
sub property of: is contributor of
inverse of: P20051
definition: Relates a person, family, or corporate body contributing to an expression of a work by supplementing the primary content with drawings, diagrams, photographs, etc to the expression.

is recordist of
has unconstrained: P60625
lexical alias: recordistOf.en
name: recordistOf
status: Published
type: Property
domain: C10002
range: C10006
sub property of: is contributor of
inverse of: P20052
definition: Relates a person, family, or corporate body contributing to an expression of a work by using a recording device to capture sound and/or video during a recording session, including field recordings of natural sounds, folkloric events, music, etc to the expression.

is contributor of
has subproperty: is composer (expression) of
has subproperty: is surveyor of
has subproperty: is animator of
has subproperty: is arranger of music of
has subproperty: is stage director of
has subproperty: is interviewer (expression) of
has subproperty: is draftsman of
has subproperty: is transcriber of
has subproperty: is musical director of
has subproperty: is costume designer of
has subproperty: is translator of
has subproperty: is art director of
has subproperty: is performer of
has subproperty: is court reporter of
has subproperty: is cartographer (expression) of
has subproperty: is choreographer (expression) of
has subproperty: is writer of supplementary textual content of
has subproperty: is interviewee (expression) of
has subproperty: is editor of
has subproperty: is abridger of
has subproperty: is recording engineer of
has subproperty: is illustrator of
has subproperty: is recordist of
has subproperty: is presenter of
has subproperty: is editor of moving image work of
has subproperty: is production designer of
has subproperty: is minute taker of
has subproperty: is visual effects provider of
has subproperty: is special effects provider of
has subproperty: is sound designer of
has subproperty: is lighting designer of
has subproperty: is on-screen participant of
has subproperty: is software developer of
has subproperty: is colourist of
has subproperty: is make-up artist of
has unconstrained: P60626
lexical alias: contributorOf.en
name: contributorOf
status: Published
type: Property
domain: C10002
range: C10006
inverse of: P20053
definition: Relates a person, family, or corporate body contributing to an expression to the expression.
scope note: Contributors include editors, translators, arrangers of music, performers, etc.

is current owner of
has subproperty: is depositor of
has unconstrained: P60628
lexical alias: currentOwnerOf.en
name: currentOwnerOf
status: Published
type: Property
domain: C10002
range: C10003
sub property of: is owner of
inverse of: P40018
definition: Relates a person, family, or corporate body currently having legal possession of an item to the item.

is former owner of
has subproperty: is donor of
has subproperty: is seller of
has unconstrained: P60630
lexical alias: formerOwnerOf.en
name: formerOwnerOf
status: Published
type: Property
domain: C10002
range: C10003
sub property of: is owner of
inverse of: P40019
definition: Relates a person, family, or corporate body formerly having legal possession of an item to the item.

is custodian of
has unconstrained: P60631
lexical alias: custodianOf.en
name: custodianOf
status: Published
type: Property
domain: C10002
range: C10003
inverse of: P40020
definition: Relates a person, family, or corporate body having legal custody of an item to the item.

is owner of
has subproperty: is current owner of
has subproperty: is former owner of
has unconstrained: P60632
lexical alias: ownerOf.en
name: ownerOf
status: Published
type: Property
domain: C10002
range: C10003
inverse of: P40021
definition: Relates a person, family, or corporate body having legal possession of an item to the item.

is honouree of
has unconstrained: P60634
lexical alias: honoureeOf.en
name: honoureeOf
status: Published
type: Property
domain: C10002
range: C10001
sub property of: is other person, family, or corporate body associated with a work of
inverse of: P10049
alternative label: is honoree of
definition: Relates a person, family, or corporate body honoured by a work (e.g., the honouree of a festschrift) to the work.

is honouree (item) of
has unconstrained: P60634
lexical alias: honoureeOfItemOf.en
name: honoureeOfItemOf
status: Published
type: Property
domain: C10002
range: C10003
sub property of: is other person, family, or corporate body associated with an item of
inverse of: P40022
alternative label: is honoree (item) of
definition: Relates a person, family, or corporate body honoured by an item, e.g., a person to whom a copy is presented, to the item.

is broadcaster of
has unconstrained: P60635
lexical alias: broadcasterOf.en
name: broadcasterOf
status: Published
type: Property
domain: C10002
range: C10007
sub property of: is publisher of
inverse of: P30067
definition: Relates a person, family, or corporate body involved in broadcasting a manifestation to an audience via radio, television, webcast, etc to the manifestation.

is film distributor of
has unconstrained: P60636
lexical alias: filmDistributorOf.en
name: filmDistributorOf
status: Published
type: Property
domain: C10002
range: C10007
sub property of: is distributor of
inverse of: P30068
definition: Relates a person, family, or corporate body involved in distributing a moving image manifestation to theatres or other distribution channels to the manifestation.

is book designer of
has unconstrained: P60637
lexical alias: bookDesignerOf.en
name: bookDesignerOf
status: Published
type: Property
domain: C10002
range: C10007
sub property of: is manufacturer of
inverse of: P30069
definition: Relates a person, family, or corporate body involved in manufacturing a manifestation by being responsible for the entire graphic design of a book, including arrangement of type and illustration, choice of materials, and process used to the manifestation.

is engraver of
has unconstrained: P60638
lexical alias: engraverOf.en
name: engraverOf
status: Published
type: Property
domain: C10002
range: C10007
sub property of: is manufacturer of
inverse of: P30070
definition: Relates a person, family, or corporate body involved in manufacturing a manifestation by cutting letters, figures, etc., on a surface such as a wooden or metal plate used for printing to the manifestation.

is braille embosser of
has unconstrained: P60639
lexical alias: brailleEmbosserOf.en
name: brailleEmbosserOf
status: Published
type: Property
domain: C10002
range: C10007
sub property of: is manufacturer of
inverse of: P30071
definition: Relates a person, family, or corporate body involved in manufacturing a manifestation by embossing braille cells using a stylus, special embossing printer, or other device to the manifestation.

is printmaker of
has unconstrained: P60640
lexical alias: printmakerOf.en
name: printmakerOf
status: Published
type: Property
domain: C10002
range: C10007
sub property of: is manufacturer of
inverse of: P30072
definition: Relates a person, family, or corporate body involved in manufacturing a manifestation by making a relief, intaglio, or planographic printing surface to the manifestation.

is caster of
has unconstrained: P60641
lexical alias: casterOf.en
name: casterOf
status: Published
type: Property
domain: C10002
range: C10007
sub property of: is manufacturer of
inverse of: P30073
definition: Relates a person, family, or corporate body involved in manufacturing a manifestation by pouring a liquid or molten substance into a mold and leaving it to solidify to take the shape of the mold to the manifestation.

is lithographer of
has unconstrained: P60642
lexical alias: lithographerOf.en
name: lithographerOf
status: Published
type: Property
domain: C10002
range: C10007
sub property of: is manufacturer of
inverse of: P30074
definition: Relates a person, family, or corporate body involved in manufacturing a manifestation by preparing a stone or plate for lithographic printing, including a graphic artist creating a design directly on the surface from which printing will be done to the manifestation.

is platemaker of
has unconstrained: P60643
lexical alias: platemakerOf.en
name: platemakerOf
status: Published
type: Property
domain: C10002
range: C10007
sub property of: is manufacturer of
inverse of: P30075
definition: Relates a person, family, or corporate body involved in manufacturing a manifestation by preparing plates used in the production of printed images and/or text to the manifestation.

is etcher of
has unconstrained: P60644
lexical alias: etcherOf.en
name: etcherOf
status: Published
type: Property
domain: C10002
range: C10007
sub property of: is manufacturer of
inverse of: P30076
definition: Relates a person, family, or corporate body involved in manufacturing a manifestation by subjecting metal, glass, or some other surface used for printing, to acid or another corrosive substance to the manifestation.

is collotyper of
has unconstrained: P60645
lexical alias: collotyperOf.en
name: collotyperOf
status: Published
type: Property
domain: C10002
range: C10007
sub property of: is manufacturer of
inverse of: P30077
definition: Relates a person, family, or corporate body involved in manufacturing a manifestation using a photomechanical process for making prints directly from a hardened film of gelatin or other colloid that has ink-receptive and ink-repellent surfaces to the manifestation.

is printer of
has unconstrained: P60646
lexical alias: printerOf.en
name: printerOf
status: Published
type: Property
domain: C10002
range: C10007
sub property of: is manufacturer of
inverse of: P30078
definition: Relates a person, family, or corporate body involved in manufacturing a manifestation of printed text, notated music, etc., from type or plates, such as a book, newspaper, magazine, broadside, score, etc. to the manifestation.

is presenter of
has unconstrained: P60647
lexical alias: presenterOf.en
name: presenterOf
status: Published
type: Property
domain: C10002
range: C10006
sub property of: is contributor of
inverse of: P20054
definition: Relates a person, family, or corporate body mentioned in an "X presents" credit for moving image materials and who is probably associated with production, finance, or distribution in some way to the expression.

is other person, family, or corporate body associated with a manifestation of
has unconstrained: P60602
lexical alias: otherPFCManifestationOf.en
name: otherPFCManifestationOf
status: Published
type: Property
domain: C10002
range: C10007
inverse of: P30079
definition: Relates a person, family, or corporate body other than a producer, publisher, distributor or manufacturer associated with a manifestation to the manifestation.
scope note: Includes book designers, platemakers, etc.

is other person, family, or corporate body associated with an item of
has subproperty: is illuminator of
has subproperty: is binder of
has subproperty: is inscriber of
has subproperty: is annotator of
has subproperty: is autographer of
has subproperty: is curator of
has subproperty: is honouree (item) of
has subproperty: is restorationist of
has subproperty: is dedicatee (item) of
has unconstrained: P60602
lexical alias: otherPFCItemOf.en
name: otherPFCItemOf
status: Published
type: Property
domain: C10002
range: C10003
inverse of: P40023
definition: Relates a person, family, or corporate body other than an owner or custodian associated with an item to the item.
scope note: Includes curators, binders, restorationists, etc.

is editor of moving image work of
has unconstrained: P60651
lexical alias: editorOfMovingImageWorkOf.en
name: editorOfMovingImageWorkOf
status: Published
type: Property
domain: C10002
range: C10006
sub property of: is contributor of
inverse of: P20055
definition: Relates a person, family, or corporate body responsible for assembling, arranging, and trimming film, video, or other moving image formats, including both visual and audio aspects to the expression.

is programmer of
has unconstrained: P60652
lexical alias: programmerOf.en
name: programmerOf
status: Published
type: Property
domain: C10002
range: C10001
sub property of: is creator of
inverse of: P10050
definition: Relates a person, family, or corporate body responsible for creating a computer program to the work.

is designer of
has unconstrained: P60653
lexical alias: designerOf.en
name: designerOf
status: Published
type: Property
domain: C10002
range: C10001
sub property of: is creator of
inverse of: P10051
definition: Relates a person, family, or corporate body responsible for creating a design for an object to the work.

is cartographer of
has unconstrained: P60654
lexical alias: cartographerOf.en
name: cartographerOf
status: Published
type: Property
domain: C10002
range: C10001
sub property of: is creator of
inverse of: P10052
definition: Relates a person, family, or corporate body responsible for creating a map, atlas, globe, or other cartographic work to the work.

is composer of
has unconstrained: P60655
lexical alias: composerOf.en
name: composerOf
status: Published
type: Property
domain: C10002
range: C10001
sub property of: is creator of
inverse of: P10053
definition: Relates a person, family, or corporate body responsible for creating a musical work to the work.

is inventor of
has unconstrained: P60656
lexical alias: inventorOf.en
name: inventorOf
status: Published
type: Property
domain: C10002
range: C10001
sub property of: is creator of
inverse of: P10054
definition: Relates a person, family, or corporate body responsible for creating a new device or process to the work.

is compiler of
has unconstrained: P60657
lexical alias: compilerOf.en
name: compilerOf
status: Published
type: Property
domain: C10002
range: C10001
sub property of: is creator of
inverse of: P10055
definition: Relates a person, family, or corporate body responsible for creating a new work (e.g., a bibliography, a directory) by selecting, arranging, aggregating, and editing data, information, etc. to the work.

is photographer of
has unconstrained: P60658
lexical alias: photographerOf.en
name: photographerOf
status: Published
type: Property
domain: C10002
range: C10001
sub property of: is creator of
inverse of: P10056
definition: Relates a person, family, or corporate body responsible for creating a photographic work to the work.

is interviewer of
has unconstrained: P60659
lexical alias: interviewerOf.en
name: interviewerOf
status: Published
type: Property
domain: C10002
range: C10001
sub property of: is creator of
inverse of: P10057
definition: Relates a person, family, or corporate body responsible for creating a work by acting as an interviewer, reporter, pollster, or some other information gathering agent to the work.

is artist of
has subproperty: is sculptor of
has subproperty: is calligrapher of
has subproperty: is book artist of
has unconstrained: P60660
lexical alias: artistOf.en
name: artistOf
status: Published
type: Property
domain: C10002
range: C10001
sub property of: is creator of
inverse of: P10058
definition: Relates a person, family, or corporate body responsible for creating a work by conceiving, and often implementing, an original graphic design, drawing, painting, etc. to the work.

is interviewee of
has unconstrained: P60661
lexical alias: intervieweeOf.en
name: intervieweeOf
status: Published
type: Property
domain: C10002
range: C10001
sub property of: is creator of
inverse of: P10059
definition: Relates a person, family, or corporate body responsible for creating a work by responding to an interviewer, usually a reporter, pollster, or some other information gathering agent to the work.

is choreographer of
has unconstrained: P60662
lexical alias: choreographerOf.en
name: choreographerOf
status: Published
type: Property
domain: C10002
range: C10001
sub property of: is creator of
inverse of: P10060
definition: Relates a person, family, or corporate body responsible for creating a work of movement to the work.

is author of
has subproperty: is screenwriter of
has subproperty: is lyricist of
has subproperty: is librettist of
has subproperty: is rapporteur of
has unconstrained: P60663
lexical alias: authorOf.en
name: authorOf
status: Published
type: Property
domain: C10002
range: C10001
sub property of: is creator of
inverse of: P10061
definition: Relates a person, family, or corporate body responsible for creating a work that is primarily textual in content, regardless of media type (e.g., printed text, spoken word, electronic text, tactile text) or genre (e.g., poems, novels, screenplays, blogs) to the work.

is architect of
has subproperty: is landscape architect of
has unconstrained: P60664
lexical alias: architectOf.en
name: architectOf
status: Published
type: Property
domain: C10002
range: C10001
sub property of: is creator of
inverse of: P10062
definition: Relates a person, family, or corporate body responsible for creating an architectural design, including a pictorial representation intended to show how a building, etc. to the work.

is filmmaker of
has unconstrained: P60665
lexical alias: filmmakerOf.en
name: filmmakerOf
status: Published
type: Property
domain: C10002
range: C10001
sub property of: is creator of
inverse of: P10063
definition: Relates a person, family, or corporate body responsible for creating an independent or personal film to the work.
scope note: A filmmaker is individually responsible for the conception and execution of all aspects of the film.

is production designer of
has unconstrained: P60666
lexical alias: productionDesignerOf.en
name: productionDesignerOf
status: Published
type: Property
domain: C10002
range: C10006
sub property of: is contributor of
inverse of: P20056
definition: Relates a person, family, or corporate body responsible for designing the overall visual appearance of a moving image production to the expression.

is distributor of
has subproperty: is film distributor of
has unconstrained: P60667
lexical alias: distributorOf.en
name: distributorOf
status: Published
type: Property
domain: C10002
range: C10007
inverse of: P30080
definition: Relates a person, family, or corporate body responsible for distributing a resource to the manifestation.

is producer of an unpublished resource of
has unconstrained: P60817
lexical alias: producerOfAnUnpublishedResourceOf.en
name: producerOfAnUnpublishedResourceOf
status: Published
type: Property
domain: C10002
range: C10007
inverse of: P30081
definition: Relates a person, family, or corporate body responsible for inscribing, fabricating, constructing, etc. to the manifestation.

is producer of
has subproperty: is film producer of
has subproperty: is radio producer of
has subproperty: is television producer of
has unconstrained: P60668
lexical alias: producerOf.en
name: producerOf
status: Published
type: Property
domain: C10002
range: C10001
sub property of: is other person, family, or corporate body associated with a work of
inverse of: P10064
definition: Relates a person, family, or corporate body responsible for most of the business aspects of a production for screen, sound recording, television, webcast, etc to the work.
scope note: The producer is generally responsible for fund raising, managing the production, hiring key personnel, arranging for distributors, etc.

is manufacturer of
has subproperty: is book designer of
has subproperty: is engraver of
has subproperty: is braille embosser of
has subproperty: is printmaker of
has subproperty: is caster of
has subproperty: is lithographer of
has subproperty: is platemaker of
has subproperty: is etcher of
has subproperty: is collotyper of
has subproperty: is printer of
has subproperty: is papermaker of
has unconstrained: P60669
lexical alias: manufacturerOf.en
name: manufacturerOf
status: Published
type: Property
domain: C10002
range: C10007
inverse of: P30082
definition: Relates a person, family, or corporate body responsible for printing, duplicating, casting, etc. to the manifestation.

is publisher of
has subproperty: is broadcaster of
has unconstrained: P60670
lexical alias: publisherOf.en
name: publisherOf
status: Published
type: Property
domain: C10002
range: C10007
inverse of: P30083
definition: Relates a person, family, or corporate body responsible for publishing, releasing, or issuing a resource to the manifestation.

is creator of
has subproperty: is enacting jurisdiction of
has subproperty: is praeses of
has subproperty: is programmer of
has subproperty: is designer of
has subproperty: is cartographer of
has subproperty: is composer of
has subproperty: is inventor of
has subproperty: is compiler of
has subproperty: is photographer of
has subproperty: is interviewer of
has subproperty: is artist of
has subproperty: is interviewee of
has subproperty: is choreographer of
has subproperty: is author of
has subproperty: is architect of
has subproperty: is filmmaker of
has unconstrained: P60672
lexical alias: creatorOf.en
name: creatorOf
status: Published
type: Property
domain: C10002
range: C10001
inverse of: P10065
definition: Relates a person, family, or corporate body responsible for the creation of a work to the work.

is director of
has subproperty: is film director of
has subproperty: is radio director of
has subproperty: is television director of
has unconstrained: P60673
lexical alias: directorOf.en
name: directorOf
status: Published
type: Property
domain: C10002
range: C10001
sub property of: is other person, family, or corporate body associated with a work of
inverse of: P10066
definition: Relates a person, family, or corporate body responsible for the general management and supervision of a filmed performance, a radio or television program, etc. to the work.

is restorationist of
has unconstrained: P60674
lexical alias: restorationistOf.en
name: restorationistOf
status: Published
type: Property
domain: C10002
range: C10003
sub property of: is other person, family, or corporate body associated with an item of
inverse of: P40024
definition: Relates a person, family, or corporate body responsible for the set of technical, editorial, and intellectual procedures aimed at compensating for the degradation of an item by bringing it back to a state as close as possible to its original condition to the item.

is director of photography of
has unconstrained: P60678
lexical alias: directorOfPhotographyOf.en
name: directorOfPhotographyOf
status: Published
type: Property
domain: C10002
range: C10001
sub property of: is other person, family, or corporate body associated with a work of
inverse of: P10068
definition: Relates a person, family, or corporate body that captures images, either electronically or on film or video stock, and often selects and arranges the lighting to the work.
scope note: The director of photography for a movie is also called the chief cinematographer.

is dedicatee of
has unconstrained: P60689
lexical alias: dedicateeOf.en
name: dedicateeOf
status: Published
type: Property
domain: C10002
range: C10001
sub property of: is other person, family, or corporate body associated with a work of
inverse of: P10069
definition: Relates a person, family, or corporate body to whom a work is dedicated to the work.

is addressee of
has unconstrained: P60690
lexical alias: addresseeOf.en
name: addresseeOf
status: Published
type: Property
domain: C10002
range: C10001
sub property of: is other person, family, or corporate body associated with a work of
inverse of: P10070
definition: Relates a person, family, or corporate body to whom a work or part of a work is addressed to the work.

is dedicatee (item) of
has unconstrained: P60689
lexical alias: dedicateeOfItemOf.en
name: dedicateeOfItemOf
status: Published
type: Property
domain: C10002
range: C10003
sub property of: is other person, family, or corporate body associated with an item of
inverse of: P40025
definition: Relates a person, family, or corporate body to whom an item is dedicated to the item.

is consultant of
has unconstrained: P60701
lexical alias: consultantOf.en
name: consultantOf
status: Published
type: Property
domain: C10002
range: C10001
sub property of: is other person, family, or corporate body associated with a work of
inverse of: P10071
definition: Relates a person, family, or corporate body who provides consultation services, and often makes recommendations, for another person, family, or corporate body that is represented as the creator of a work to the work.

is minute taker of
has unconstrained: P60671
lexical alias: minuteTakerOf.en
name: minuteTakerOf
status: Published
type: Property
domain: C10002
range: C10006
sub property of: is contributor of
inverse of: P20058
definition: Relates a person, family, or corporate body, responsible for recording the minutes of a meeting to the expression.

is film producer of
has unconstrained: P60033
lexical alias: filmProducerOf.en
name: filmProducerOf
status: Published
type: Property
domain: C10002
range: C10001
sub property of: is producer of
inverse of: P10073
definition: Relates a producer responsible for most of the business aspects of a film to the work.

is radio producer of
has unconstrained: P60034
lexical alias: radioProducerOf.en
name: radioProducerOf
status: Published
type: Property
domain: C10002
range: C10001
sub property of: is producer of
inverse of: P10074
definition: Relates a producer responsible for most of the business aspects of a radio program to the work.

is television producer of
has unconstrained: P60035
lexical alias: televisionProducerOf.en
name: televisionProducerOf
status: Published
type: Property
domain: C10002
range: C10001
sub property of: is producer of
inverse of: P10075
definition: Relates a producer responsible for most of the business aspects of a television program to the work.

is writer of added lyrics of
has unconstrained: P60600
lexical alias: writerOfAddedLyricsOf.en
name: writerOfAddedLyricsOf
status: Published
type: Property
domain: C10002
range: C10006
sub property of: is writer of added text of
inverse of: P20068
definition: Relates a writer of words added to an expression of a musical work to the expression.

is voice actor of
has unconstrained: P60027
lexical alias: voiceActorOf.en
name: voiceActorOf
status: Published
type: Property
domain: C10002
range: C10006
sub property of: is actor of
inverse of: P20070
definition: Relates an actor contributing to an expression of a work by providing the voice for characters in radio and audio productions and for animated characters in moving image works, as well as by providing voice-overs in radio and television commercials, dubbed resources, etc to the expression.

has related corporate body
has unconstrained: P60454
lexical alias: relatedCorporateBody.en
name: relatedCorporateBody
status: Published
instruction number: 32.1
toolkit definition: A corporate body that is associated with the person, family, or corporate body being identified (e.g., a musical group to which a person belongs, a subsidiary company).
toolkit label: related corporate body
type: Property
domain: C10002
range: C10005
definition: Relates an agent to a corporate body that is associated with the person, family, or corporate body being identified (e.g., a musical group to which a person belongs, a subsidiary company).
scope note: Related corporate bodies include corporate bodies that precede or succeed the corporate body being identified as the result of a change of name.

has related family
has unconstrained: P60454
lexical alias: relatedFamily.en
name: relatedFamily
status: Published
instruction number: 31.1
toolkit definition: A family that is associated with the person, family, or corporate body being identified (e.g., a person's family, a family that owns the controlling interest in a corporate body).
toolkit label: related family
type: Property
domain: C10002
range: C10008
definition: Relates an agent to a family that is associated with the person, family, or corporate body being identified (e.g., a person's family, a family that owns the controlling interest in a corporate body).

has related person
has unconstrained: P60454
lexical alias: relatedPerson.en
name: relatedPerson
status: Published
instruction number: 30.1
toolkit definition: A person who is associated with the person, family, or corporate body being identified (e.g., a collaborator, a member of a family, a founder of a corporate body).
toolkit label: related person
type: Property
domain: C10002
range: C10004
definition: Relates an agent to a person who is associated with the person, family, or corporate body being identified (e.g., a collaborator, a member of a family, a founder of a corporate body).
scope note: Related persons include separate identities established by an individual (either alone or in collaboration with one or more other individuals).

is landscape architect of
has unconstrained: P60704
lexical alias: landscapeArchitectOf.en
name: landscapeArchitectOf
status: Published
type: Property
domain: C10002
range: C10001
sub property of: is architect of
inverse of: P10200
definition: Relates an architect responsible for creating landscape works to the work.

is sculptor of
has unconstrained: P60705
lexical alias: sculptorOf.en
name: sculptorOf
status: Published
type: Property
domain: C10002
range: C10001
sub property of: is artist of
inverse of: P10202
definition: Relates an artist responsible for creating a three-dimensional work by modeling, carving, or similar technique to the work.

is screenwriter of
has unconstrained: P60706
lexical alias: screenwriterOf.en
name: screenwriterOf
status: Published
type: Property
domain: C10002
range: C10001
sub property of: is author of
inverse of: P10203
definition: Relates an author of a screenplay, script, or scene to the work.

is lyricist of
has unconstrained: P60707
lexical alias: lyricistOf.en
name: lyricistOf
status: Published
type: Property
domain: C10002
range: C10001
sub property of: is author of
inverse of: P10204
definition: Relates an author of the words of a popular song, including a song or songs from a musical to the work.

is librettist of
has unconstrained: P60708
lexical alias: librettistOf.en
name: librettistOf
status: Published
type: Property
domain: C10002
range: C10001
sub property of: is author of
inverse of: P10205
definition: Relates an author of the words of an opera or other musical stage work, or an oratorio to the work.

is sponsoring body of
has unconstrained: P60675
lexical alias: sponsoringBodyOf.en
name: sponsoringBodyOf
status: Published
type: Property
domain: C10002
range: C10001
sub property of: is other person, family, or corporate body associated with a work of
inverse of: P10067
definition: Relates a person, family, or corporate body sponsoring some aspect of a work, e.g., funding research, sponsoring an event, to the work.

is writer of afterword of
has unconstrained: P60717
lexical alias: writerOfAfterwordOf.en
name: writerOfAfterwordOf
status: Published
type: Property
domain: C10002
range: C10006
sub property of: is writer of supplementary textual content of
inverse of: P20237
definition: Relates a person, family, or corporate body contributing to an expression of a work by providing an afterword to the original work to the expression.

is writer of postface of
has unconstrained: P60718
lexical alias: writerOfPostfaceOf.en
name: writerOfPostfaceOf
status: Published
type: Property
domain: C10002
range: C10006
sub property of: is writer of supplementary textual content of
inverse of: P20238
definition: Relates a person, family, or corporate body contributing to an expression of a work by providing a postface to the original work to the expression.

has predecessor of split
has unconstrained: P60733
lexical alias: predecessorOfSplit.en
name: predecessorOfSplit
status: Published
toolkit definition: A corporate body that split or divided into the other corporate body.
toolkit label: predecessor of split
type: Property
domain: C10005
range: C10005
inverse of: has product of split
definition: Relates a corporate body to a corporate body that split or divided into the other corporate body.

has membership corporate body
has unconstrained: P60648
lexical alias: membershipCorporateBody.en
name: membershipCorporateBody
status: Published
toolkit definition: A corporate body formed from the membership of other corporate bodies.
toolkit label: membership corporate body
type: Property
domain: C10005
range: C10005
inverse of: has corporate member
definition: Relates a corporate body to a corporate body formed from the membership of other corporate bodies.

has corporate member
has unconstrained: P60697
lexical alias: corporateMember.en
name: corporateMember
status: Published
toolkit definition: A corporate body that is a member of the other corporate body.
toolkit label: corporate member
type: Property
domain: C10005
range: C10005
inverse of: has membership corporate body
definition: Relates a corporate body to a corporate body that is a member of the other corporate body.

has component of merger
has unconstrained: P60736
lexical alias: componentOfMerger.en
name: componentOfAMerger
status: Published
toolkit definition: A corporate body that formed the other corporate body by merging with one or more other corporate bodies.
toolkit label: component of merger
type: Property
domain: C10005
range: C10005
inverse of: has product of merger
definition: Relates a corporate body to a corporate body that formed the other corporate body by merging with one or more other corporate bodies.

has family
has unconstrained: P60697
lexical alias: family.en
name: family
status: Published
toolkit definition: A family to which the person belongs.
toolkit label: family
type: Property
domain: C10004
range: C10008
inverse of: has family member
definition: Relates a person to a family to which the person belongs.

has officiated corporate body
has unconstrained: P60737
lexical alias: officiatedCorporateBody.en
name: officiatedCorporateBody
status: Published
toolkit definition: A corporate body in which the person holds an office.
toolkit label: officiated corporate body
type: Property
domain: C10004
range: C10005
inverse of: has incumbent
definition: Relates a person to a corporate body in which the person holds an office.

has language of the family
has unconstrained: P60098
lexical alias: languageOfTheFamily.en
name: languageOfTheFamily
status: Published
instruction number: 10.8
toolkit definition: A language a family uses in its communications.
toolkit label: language of the family
type: Property
domain: C10008
definition: Relates a family to a language a family uses in its communications.

has period of activity of the corporate body
has unconstrained: P60076
lexical alias: periodOfActivityOfTheCorporateBody.en
name: periodOfActivityOfTheCorporateBody
status: Published
instruction number: 11.4.5
toolkit definition: A date or range of dates indicative of the period in which a corporate body was active.
toolkit label: period of activity of the corporate body
type: Property
domain: C10005
sub property of: has date associated with the corporate body
definition: Relates a corporate body to a date or range of dates indicative of the period in which a corporate body was active.

has type of corporate body
has unconstrained: P60047
lexical alias: typeOfCorporateBody.en
name: typeOfCorporateBody
status: Published
instruction number: 11.7.1.4
toolkit label: type of corporate body
type: Property
domain: C10005
sub property of: has other designation associated with the corporate body
definition: Relates a corporate body to the type of corporate body.

has type of jurisdiction
has unconstrained: P60047
lexical alias: typeOfJurisdiction.en
name: typeOfJurisdiction
status: Published
instruction number: 11.7.1.5
toolkit label: type of jurisdiction
type: Property
domain: C10005
sub property of: has other designation associated with the corporate body
definition: Relates a corporate body to the type of jurisdiction.

has other designation
has unconstrained: P60370
lexical alias: otherDesignation.en
name: otherDesignation
status: Published
instruction number: 11.7.1.6
toolkit label: other designation
type: Property
domain: C10005
sub property of: has other designation associated with the corporate body
definition: Relates a corporate body to the other designation.

has broader affiliated body
has unconstrained: P60738
lexical alias: broaderAffiliatedBody.en
name: broaderAffiliatedBody
status: Published
toolkit definition: A corporate body that acts for the local affiliated body and others at a broader organizational level.
toolkit label: broader affiliated body
type: Property
domain: C10005
range: C10005
definition: Relates a corporate body to a corporate body that acts for the local affiliated body and others at a broader organizational level.

has local affiliate
has unconstrained: P60739
lexical alias: localAffiliate.en
name: localAffiliate
status: Published
toolkit definition: A local corporate body affiliated with the broader body which acts for it and others at a broader organizational level.
toolkit label: local affiliate
type: Property
domain: C10005
range: C10005
definition: Relates a corporate body to a local corporate body affiliated with the broader body which acts for it and others at a broader organizational level.

is papermaker of
has unconstrained: P60747
lexical alias: papermakerOf.en
name: papermakerOf
status: Published
type: Property
domain: C10002
range: C10007
sub property of: is manufacturer of
inverse of: P30215
definition: Relates a person, family, or corporate body responsible for the production of paper used to manufacture a manifestation to the manifestation.

is visual effects provider of
has unconstrained: P60754
lexical alias: visualEffectsProviderOf.en
name: visualEffectsProviderOf
status: Published
type: Property
domain: C10002
range: C10006
sub property of: is contributor of
inverse of: P20257
definition: Relates a person, family, or corporate body contributing to an expression of a moving image work by designing and creating post-production visual effects to the expression.

is special effects provider of
has unconstrained: P60755
lexical alias: specialEffectsProviderOf.en
name: specialEffectsProviderOf
status: Published
type: Property
domain: C10002
range: C10006
sub property of: is contributor of
inverse of: P20258
definition: Relates a person, family, or corporate body contributing to an expression of a moving image or audio work by designing and creating on-set special effects (on-set mechanical effects and in-camera optical effects) to the expression.

is letterer of
has unconstrained: P60756
lexical alias: lettererOf.en
name: lettererOf
status: Published
type: Property
domain: C10002
range: C10006
sub property of: is illustrator of
inverse of: P20259
definition: Relates an illustrator contributing to an expression of a comic book, graphic novel, etc. to the expression.

is calligrapher of
has unconstrained: P60758
lexical alias: calligrapherOf.en
name: calligrapherOf
status: Published
type: Property
domain: C10002
range: C10001
sub property of: is artist of
inverse of: P10253
definition: Relates an artist responsible for creating a work of calligraphy where the focus of interest lies in the aesthetic value of its penmanship or graphic artistry, regardless of whether the same person, etc to the work.

is book artist of
has unconstrained: P60759
lexical alias: bookArtistOf.en
name: bookArtistOf
status: Published
type: Property
domain: C10002
range: C10001
sub property of: is artist of
inverse of: P10254
definition: Relates an artist resonsible for creating art works that exploit the book form or alter its physical structure as part of the content of the work to the work.

is rapporteur of
has unconstrained: P60757
lexical alias: rapporteurOf.en
name: rapporteurOf
status: Published
type: Property
domain: C10002
range: C10001
sub property of: is author of
inverse of: P10255
definition: Relates an author who is appointed by an organization to report on the proceedings of its meetings to the work.

is subject of (person)
has unconstrained: P60806
lexical alias: subjectOfPerson.en
name: subjectOfPerson
status: Published
type: Property
domain: C10004
range: C10001
sub property of: P10283
inverse of: P10261
definition: Relates a person to a work that is about the person.

is subject of (family)
has unconstrained: P60806
lexical alias: subjectOfFamily.en
name: subjectOfFamily
status: Published
type: Property
domain: C10008
range: C10001
sub property of: P10283
inverse of: P10262
definition: Relates a family to a work that is about the family.

is subject of (corporate body)
has unconstrained: P60806
lexical alias: subjectOfCorporateBody.en
name: subjectOfCorporateBody
status: Published
type: Property
domain: C10005
range: C10001
sub property of: P10283
inverse of: P10263
definition: Relates a corporate body to a work that is about the corporate body.

has graduate
has unconstrained: P60807
lexical alias: graduate.en
name: graduate
status: Published
toolkit definition: A person who receives an academic degree from the granting institution or faculty.
toolkit label: graduate
type: Property
domain: C10005
range: C10004
inverse of: is graduate of
definition: Relates a corporate body to a person who receives an academic degree from the granting institution or faculty.

is graduate of
has unconstrained: P60808
lexical alias: graduateOf.en
name: graduateOf
status: Published
toolkit definition: An institution or faculty that granted an academic degree to the person.
toolkit label: graduate of
type: Property
domain: C10004
range: C10005
inverse of: has graduate
definition: Relates a person to an institution or faculty that granted an academic degree to the person.

is writer of foreword of
has unconstrained: P60810
lexical alias: writerOfForewordOf.en
name: writerOfForewordOf
status: Published
type: Property
domain: C10002
range: C10006
sub property of: is writer of supplementary textual content of
inverse of: P20275
definition: Relates a person, family, or corporate body contributing to an expression of a work by providing a foreword to the original work to an expression.

is sound designer of
has unconstrained: P60812
lexical alias: soundDesignerOf.en
name: soundDesignerOf
status: Published
type: Property
domain: C10002
range: C10006
sub property of: is contributor of
inverse of: P20276
definition: Relates a person, family, or corporate body contributing to an expression of a work by designing and creating audio/sound components to the expression.

is lighting designer of
has unconstrained: P60814
lexical alias: lightingDesignerOf.en
name: lightingDesignerOf
status: Published
type: Property
domain: C10002
range: C10006
sub property of: is contributor of
inverse of: P20277
definition: Relates a person, family, or corporate body contributing to an expression of a work by designing and creating lighting components to the expression.

is degree committee member of
has unconstrained: P60816
lexical alias: degreeCommitteeMemberOf.en
name: degreeCommitteeMemberOf
status: Published
type: Property
domain: C10004
range: C10001
sub property of: is other person, family, or corporate body associated with a work of
inverse of: P10284
definition: Relates a person serving on a committee that supervises a student's thesis or dissertation to the work.

is defendant corporate body of
has unconstrained: P60698
lexical alias: defendantCorporateBodyOf.en
name: defendantCorporateBodyOf
status: Published
type: Property
domain: C10005
range: C10001
sub property of: is defendant of
inverse of: P10285
definition: Relates a corporate body who is accused in a criminal proceeding or sued in a civil proceeding to the work.

is defendant person of
has unconstrained: P60698
lexical alias: defendantPersonOf.en
name: defendantPersonOf
status: Published
type: Property
domain: C10004
range: C10001
sub property of: is defendant of
inverse of: P10286
definition: Relates a person who is accused in a criminal proceeding or sued in a civil proceeding to the work.

has other place associated with the corporate body
has unconstrained: P60325
lexical alias: otherPlaceAssociatedWithTheCorporateBody.en
name: otherPlaceAssociatedWithTheCorporateBody
status: Published
instruction number: 11.3.3
toolkit definition: A place associated with a corporate body other than location of a conference, etc.
toolkit label: other place associated with the corporate body
type: Property
domain: C10005
definition: Relates a corporate body to a place associated with a corporate body other than location of a conference, etc.

is on-screen participant of
has unconstrained: P60825
lexical alias: onScreenParticipantOf.en
name: onscreenParticipantOf
status: Published
type: Property
domain: C10002
range: C10006
sub property of: is contributor of
inverse of: P20279
definition: Relates a person, family, or corporate body contributing to an expression of a nonfiction moving image work by taking an active role as a participant to the expression.

is commissioning body of
has unconstrained: P60827
lexical alias: commissioningBodyOf.en
name: commissioningBodyOf
status: Published
type: Property
domain: C10002
range: C10001
sub property of: is other person, family, or corporate body associated with a work of
inverse of: P10287
definition: Relates a person, family, or corporate body responsible for commissioning a work to the work.

is software developer of
has unconstrained: P60829
lexical alias: softwareDeveloperOf.en
name: softwareDeveloperOf
status: Published
type: Property
domain: C10002
range: C10001
sub property of: is contributor of
inverse of: P20280
definition: Relates a person, family, or corporate body contributing to an expression of a work by researching, designing, implementing, or testing the software to the expression.

is participant in a treaty of
has unconstrained: P60835
lexical alias: participantInATreatyOf.en
name: participantInATreatyOf
status: Published
type: Property
domain: C10005
range: C10001
sub property of: is other person, family, or corporate body associated with a work of
inverse of: P10292
definition: Relates a government, international intergovernmental body, or other corporate body that has signed, ratified, or acceded to a treaty to the work.

is researcher of
has unconstrained: P60837
lexical alias: researcherOf.en
name: researcherOf
status: Published
type: Property
domain: C10002
range: C10001
sub property of: is other person, family, or corporate body associated with a work of
inverse of: P10293
definition: Relates a person, family, or corporate body who does research in support of the creation of a work to the work.

is colourist of
has unconstrained: P60839
lexical alias: colouristOf.en
name: colouristOf
status: Published
type: Property
domain: C10002
range: C10006
sub property of: is contributor of
inverse of: P20283
definition: Relates a person, family, or corporate body contributing to an expression of a work by applying colour to drawings, prints, photographs, maps, moving images, etc. to the expression.

is make-up artist of
has unconstrained: P60841
lexical alias: makeUpArtistOf.en
name: makeUpArtistOf
status: Published
type: Property
domain: C10002
range: C10006
sub property of: is contributor of
inverse of: P20284
definition: Relates a person, family, or corporate body contributing to an expression of a work by applying make-up and prosthetics for a moving image production or for a musical or dramatic presentation or entertainment.

is choral conductor of
has unconstrained: P60843
lexical alias: choralConductorOf.en
name: choralConductorOf
status: Published
type: Property
domain: C10002
range: C10006
sub property of: is conductor of
inverse of: P20285
definition: Relates a conductor contributing to an expression of a musical work by leading a choral performing group in a musical or dramatic presentation, etc. to the expression.

is instrumental conductor of
has unconstrained: P60845
lexical alias: instrumentalConductorOf.en
name: instrumentalConductorOf
status: Published
type: Property
domain: C10002
range: C10006
sub property of: is conductor of
inverse of: P20286
definition: Relates a conductor contributing to an expression of a musical work by leading an instrumental performing group in a musical or dramatic presentation, etc. to the expression.

is organizer of
has unconstrained: P60850
lexical alias: organizerOf.en
name: organizerOf
status: Published
type: Property
domain: C10002
range: C10001
sub property of: is other person, family, or corporate body associated with a work of
inverse of: P10297
definition: Relates a person, family, or corporate body organizing the exhibit, event, conference, etc., which gave rise to a work to the work.