è classificazione di bene fotografico di
type: ObjectProperty
domain: Classificazione di bene fotografico
label: is photographic heritage classification of @en
range: Bene Fotografico
sub property of: isClassificationOf
version info: Questa proprietà, inversa a "ha classificazione di bene fotografico", collega una classificazione di un bene fotografico secondo un sistema di classificazione alternativo a Iconclass, a un bene fotografico.
version info: stabile
version info: stable @en

Parte Residuale di Bene Culturale
type: Class
comment: This class represents the residual part of a cultural property, that is what's left of the original cultural property. @en
comment: Questa classe rappresenta la parte residuale di un bene culturale, cioè la parte che si conserva del bene culturale originale.
label: Cultural Property Residual @en
subclass of: Bene culturale
subclass of: Restriction
  on property: è parte residuale di bene culturale
  some values from: Bene culturale
subclass of: Restriction
  all values from: integer
  on property: numero di parti residuali di bene culturale
version info: stable @en
version info: stabile
iccd norm tag: OG/OGT/OGTW

numero di oggetti/elementi componenti
type: DatatypeProperty
type: FunctionalProperty
comment: This property represents the number of components of a complex cultural property. @en
comment: Questa proprietà rappresenta il numero di esemplari/oggetti/elementi componenti di un bene culturale. Nel caso di un bene complesso identificato come serie o come insieme, si usa per specificare il numero, espresso in cifre, degli esemplari o degli oggetti componenti, oppure degli elementi componenti nel caso in cui il bene sia un insieme o una serie i cui esemplari/oggetti componenti comprendono ciascuno più elementi. Il range della proprietà è rdfs:Literal perché, nei casi in cui non sia stato possibile rilevare per motivi pratici la consistenza numerica, il valore della proprietà sarà "QNR".
domain: Bene Culturale Complesso
label: number of components @en
range: Literal
sub property of: numero di parti
version info: stabile
version info: stable @en
iccd norm tag: ICCD Normativa Trasversale 4.00: OG/QNT/QNTN; OG/QNT/QNTI; OG/QNT/QNTS

numero di membri
type: DatatypeProperty
type: FunctionalProperty
comment: This property represents the number of members of a cultural property that is a collection (e.g.: series) @en
comment: Questa proprietà rappresenta il numero di membri di un bene culturale che si identifica come una collezione (es.: serie)
domain: Insieme di beni culturali
label: number of members @en
range: Literal
sub property of: numero di parti
version info: stable @en
version info: stabile
iccd norm tag: ICCD Normativa Trasversale 4.00: OG/QNT/QNTN; OG/QNT/QNTI; OG/QNT/QNTS

Bene Demoetnoantropologico
type: Class
comment: This class represents a demo-ethno-anthropological heritage, both tangible and intangible. The intangible demoetnoanthropological properties are cultural properties consisting of unique and unrepeatable performances, structurally connected to the territory and to socially shared custom, transmitted through orality and bodily techniques, both in Italy and in Europe and beyond Europe (non-verbal communications, dances, parties and ceremonies, games, oral letters, music, customary norms, performances and shows, knowledge, techniques). Demo-ethno-anthropological tangible properties are cultural properties whose construction and/or use are structurally associated with a socially shared custom, transmitted through orality and bodily techniques, both in the Italian and European and extra-European areas (clothing and body ornaments, furnishings and furnishings, means of transport, rituals, instruments and accessories, properties on the territory). @en
comment: Questa classe rappresenta un bene culturale demoetnoantropologico, che può essere di tipo immateriale e materiale. I beni demoetnoantropologici immateriali sono beni consistenti in performance uniche e irrepetibili strutturalmente connesse al territorio e a prassi socialmente condivise trasmesse attraverso l’oralità e le tecniche corporali, tanto in ambito italiano quanto in ambito europeo ed extra-europeo (comunicazioni non verbali, danze, feste e cerimonie, giochi, letterature orali, musiche, norme consuetudinarie, rappresentazioni e spettacoli, saperi, tecniche). I beni demoetnoantropologici materiali sono beni la cui costruzione e/o il cui uso sono strutturalmente associati a prassi socialmente condivise, trasmesse attraverso l'oralità e le tecniche corporali, tanto in ambito italiano quanto in ambito europeo ed extra-europeo (abbigliamento e ornamenti del corpo, arredi e suppellettili, mezzi di trasporto, ritualità, strumenti e accessori, beni sul territorio).
label: Demo-ethno-anthropological Heritage @en
subclass of: Bene culturale
subclass of: Restriction
  all values from: Documentation
  on property: hasPrimaryDocumentation
subclass of: Restriction
  all values from: Research
  on property: hasResearch
version info: stable @en
version info: stabile

Archeologico
type: Ambito di tutela MiBAC
type: NamedIndividual
label: Archeaological @en
version info: stable @en
version info: stabile

ha categoria
type: ObjectProperty
comment: Questa proprietà collega un bene culturale alla sua categoria.
comment: This property relates a cultural property to its category. @en
domain: Bene culturale
label: has cultural property category @en
range: Categoria del bene
sub property of: hasCategory
inverse of: è categoria di bene culturale
version info: stable @en
version info: stabile

note sullo strumento musicale
type: FunctionalProperty
type: DatatypeProperty
comment: This property represents notes on a musical instrument. @en
comment: Questa proprietà rappresenta le note relative agli aspetti acustici di uno strumento musicale, ed eventualmente anche relative ai rilevamenti e ai criteri adottati in sede di restauro.
domain: Bene Musicale
label: musical instrument note @en
range: Literal
sub property of: note
version info: stabile
version info: stable @en
iccd norm tag: ICCD Normativa SM 4.00: AA/AAS

data di inizio
type: DatatypeProperty
comment: Questa proprietà rappresenta la data di inizio di un intervallo temporale, che può essere espressa secondo criteri diversi e a diverso livello di dettaglio (secolo, intervallo di secoli, anno, intervallo di anni, aaaa/mm/gg, periodo storico, etc.)
comment: This property represents the start time of a time interval, according to different criteria and level of detail (century, century interval, year, yyyy/mm/dd, historical period, etc.). @en
domain: TimeInterval
label: start time @en
range: Literal
sub property of: time
version info: stabile
version info: stable @en

Bene immateriale
type: Class
comment: Questa classe rappresenta un bene immateriale, cioè quella parte del patrimonio culturale rappresentata da performance effimere di manifestazioni tradizionali, tecniche, saperi (feste, esecuzioni musicali e coreutiche, rappresentazioni teatrali, tecniche artigianali, letteratura orale, ecc.), colte nel momento in cui avvengono e di cui è possibile mantenere memoria solo attraverso la ripresa audio-visiva che le fissa stabilmente, cristallizzandole.
comment: This class represents an intangible cultural property, that part of cultural heritage represented by ephemeral performances of traditional manifestations, techniques, knowledge (festivals, musical and dance performances, theatrical performances, craft techniques, oral literature, etc.), when they occur and of which it is possible to keep memory only through the audio-visual recording that fixes them permanently, crystallizing them. @en
label: Intangible Cultural Property @en
subclass of: Bene culturale
disjoint with: Bene materiale
version info: stabile
version info: stable @en

Tema cartografico
type: Class
comment: Questa classe rappresenta il tema di riferimento associato a una classificazione cartografica di un bene culturale.
comment: This class represents the cartographic theme associated to a cartographic classification of a cultural property. @en
label: Cartographic theme @en
subclass of: Concept
subclass of: Restriction
  on property: è tema cartografico di
  some values from: Tema cartografico
version info: stable @en
version info: stabile
iccd norm tag: ICCD Normativa Trasversale 4.00: CT/CTM/CTMT

è disciplina principale di
type: ObjectProperty
comment: Questa proprietà permette di associare la disciplina scientifica principale, cui un bene culturale fa riferimento, al bene culturale stesso.
comment: This property relates the main scientific discipline related to a cultural property to that cultural property. @en
domain: SubjectDiscipline
label: is main discipline of @en
range: Bene culturale
version info: stabile
version info: stable @en

ha classificazione di bene fotografico
type: ObjectProperty
comment: This property connects a photographic property to a photographic property's classification, according to to other classification systems as Iconclass. The system has to be recognised and used at national or preferably international level. @en
comment: Questa proprietà collega un bene fotografico a una classificazione di un bene fotografico secondo un sistema di classificazione alternativo a Iconclass, che sia comunque riconosciuto e utilizzato a livello nazionale, o preferibilmente internazionale.
domain: Bene Fotografico
label: has photographic heritage classification @en
range: Classificazione di bene fotografico
sub property of: hasClassification
inverse of: è classificazione di bene fotografico di
version info: stable @en
version info: stabile
iccd norm tag: ICCD Normativa F 4.00: SG/CLF

numero di parte di bene culturale
type: DatatypeProperty
type: FunctionalProperty
comment: This property represents the number of specimens of the same cultural property part (es.: the number of the teeth of an anthropological material). @en
comment: Questa proprietà rappresenta il numero di esemplari di una stessa parte di un bene culturale (es.: il numero di denti di un reperto antropologico)
domain: Parte di Bene Culturale
label: number of cultural property part @en
range: integer
sub property of: numero di parti
version info: stabile
version info: stable @en
iccd norm tag: ICCD Normativa AT 3.01: EL/ELE/ELEM

ha categoria tematica
type: ObjectProperty
comment: Questa proprietà collega una classificazione cartografica di un bene culturale alla categoria tematica.
comment: This property relates a cartographic classification of a cultural property to the thematic category. @en
domain: Classificazione cartografica
label: has thematic category @en
range: Categoria tematica
sub property of: hasCategory
inverse of: è categoria tematica di
version info: stabile
version info: stable @en
iccd norm tag: ICCD Normativa Trasversale 4.00: CT/CTM/CTMC

Classificazione di strumento musicale
type: Class
comment: Questa classe rappresenta una classificazione relativa a uno strumento musicale, secondo la classificazione di Hornbostel-Sachs ed eventualmente anche secondo altre classificazioni.
comment: This class represents a classification concerning a musical instrument, concerning the Hornbostel-Sachs classification or possibily other classifications. @en
label: Musical instrument classification @en
subclass of: CulturalEntityClassification
subclass of: Restriction
  on property: è classificazione di strumento musicale di
  some values from: Bene Musicale
version info: stabile
version info: stable @en
iccd norm tag: Normativa SM 4.00: CL

ha categoria basata su repertorio
type: ObjectProperty
comment: This property relates a cultural property to a category based on a classification related to an inventory approved by the specific subject area. @en
comment: Questa proprietà collega un bene culturale a una categoria basata su una classificazione relativa a un repertorio riconosciuto dallo specifico ambito disciplinare.
domain: Bene culturale
label: has cultural property inventory category @en
range: Categoria di bene culturale basata su repertorio
sub property of: hasCategory
inverse of: è categoria basata su repertorio di
version info: stable @en
version info: stabile
iccd norm tag: ICCD Normativa Trasversale 4.00: OG/OGT/OGTS

è classificazione cartografica di
type: ObjectProperty
comment: This is the inverse property of "has cartographic classification". @en
comment: Questa è la proprietà inversa di "ha classificazione cartografica".
domain: Classificazione cartografica
label: is cartographic classification of @en
range: Bene culturale
sub property of: isClassificationOf
version info: stable @en
version info: stabile

soggetto classificato
type: FunctionalProperty
type: DatatypeProperty
comment: This property represents the subject of a photographic heritage as described in a photographic heritage classification other than Iconclass. @en
comment: Questa proprietà rappresenta la descrizione codificata del/i soggetto/i raffigurato/i nell'opera secondo il sistema di classificazione scelto dall'Ente schedatore, in alternativa e/o in aggiunta ad Iconclass.
domain: Classificazione di bene fotografico
label: classified subject @en
range: Literal
version info: stable @en
version info: stabile
iccd norm tag: ICCD Normativa F 4.00: SG/CLF/CLFS

è categoria basata su repertorio di
type: ObjectProperty
comment: Questa proprietà collega una categoria basata su una classificazione relativa a un repertorio riconosciuto dallo specifico ambito disciplinare a un bene culturale.
comment: This property relates a category based on a classification related to an inventory approved by the specific subject area to a cultural property. @en
domain: Categoria di bene culturale basata su repertorio
label: is cultural property inventory category of @en
range: Bene culturale
sub property of: isCategoryOf
version info: stabile
version info: stable @en
iccd norm tag: ICCD Normativa Trasversale 4.00: OG/OGT/OGTS

è ente schedatore di
type: ObjectProperty
comment: Questa proprietà rappresenta la relazione che collega un ente schedatore al relativo bene culturale che ha schedato. La relazione tra il ruolo e l'ente che lo riveste è espressa nel nome della proprietà, che quindi ne fornisce una rappresentazione semplificata, con ridotta espressività. Nell'ontologia questa relazione è modellata anche, in maniera più espressiva, dalla classe AgentRole, che permette di collegare l'ente e il suo ruolo.
comment: This property relates a cagaloguing agency to the catalogued cultural property. The relation is declared in the name of the property, but within the ontology this relation is also modeled, in a more expressive way, through the class AgentRole. @en
domain: Agent
label: is cataloguing agency of @en
range: Bene culturale
sub property of: è ente collegato a
version info: stable @en
version info: stabile
iccd norm tag: ICCD Normativa Trasversale 4.00: CD/ESC

Categoria del materiale archeologico
type: Class
comment: Questa classe rappresenta la categoria di materiale, parte di un lotto di materiali archeologici. (es.: ceramiche, industria litica, intonaco, legno, etc.)
comment: This class represents the category of an archaeological material, that is part of a lot of archaeological materials (e.g.: ceramics, plaster, lithic materials, etc.) @en
label: Archaeological material category @en
subclass of: Category
subclass of: Restriction
  on property: è categoria di materiale archeologico
  some values from: Materiale archeologico
version info: stable @en
version info: stabile
iccd norm tag: ICCD Normativa TMA: MA/MAC/MACC

è tema cartografico di
type: ObjectProperty
comment: Questa è la proprietà inversa di "ha tema cartografico".
comment: This is the inverse property of "has cartographic theme". @en
domain: Tema cartografico
label: is cartographic theme of @en
range: Classificazione cartografica
sub property of: isConceptOf
version info: stable @en
version info: stabile

Bene Culturale Complesso
type: Class
comment: Questa classe rappresenta un bene culturale complesso, cioè costituito da più parti componenti.
comment: This class represents a complex cultural property, that consists of different components. @en
label: Complex Cultural Property @en
subclass of: Bene culturale
equivalent class: Class
  union of: Insieme di beni culturali
  union of: Restriction
    on property: ha parte componente di bene culturale
    some values from: Parte Componente di Bene Culturale
version info: stabile
version info: stable @en
iccd norm tag: ICCD Normativa Trasversale 4.00: se viene valorizzato il campo OG/OGT/OGTP, i valori dei campi OGTD e OGTT si riferiscono a un bene culturale complesso, rappresentato quindi per mezzo di questa classe, di cui OGTP è parte componente.

è categoria di materiale archeologico
type: ObjectProperty
comment: Questa è la proprietà inversa di "ha categoria di materiale archeologico".
comment: This is the inverse property of "has archaeological material category of". @en
domain: Categoria del materiale archeologico
label: is archaeological material category of @en
range: Materiale archeologico
sub property of: isCategoryOf
version info: stable @en
version info: stabile

data di fine
type: DatatypeProperty
comment: Questa proprietà rappresenta la data di fine di un intervallo temporale, che può essere espressa secondo criteri diversi e a diverso livello di dettaglio (secolo, intervallo di secoli, anno, intervallo di anni, aaaa/mm/gg, periodo storico, etc.)
comment: This property represents the end time of a time interval, according to different criteria and level of detail (century, century interval, year, yyyy/mm/dd, historical period, etc.). @en
domain: TimeInterval
label: end time @en
range: Literal
sub property of: time
version info: stabile
version info: stable @en

ha ambito di tutela
type: ObjectProperty
comment: This property relates a cultural property to ist MiBAC scope of protection @en
comment: Questa proprietà associa un bene culturale all'ambito di tutela nel quale ricade.
domain: Bene culturale
label: has MiBAC scope of protection @en
range: Ambito di tutela MiBAC
inverse of: è ambito di tutela di
version info: stabile
version info: stable @en
iccd norm tag: ICCD Normativa Trasversale 4.00: OG/AMB

Legenda tipo
type: Class
comment: This class represents the reference coin legend. @en
comment: Questa classe rappresenta la legenda tipo di un bene numismatico, inteso come parametro di classificazione attestato nei repertori di riferimento.
label: Reference coin legend @en
subclass of: Concept
subclass of: Restriction
  on property: è legenda tipo di
  some values from: Bene Numismatico
version info: stabile
version info: stable @en
iccd norm tag: ICCD Normativa NU: OG/OGT/OGTL

numero di parti
type: DatatypeProperty
type: FunctionalProperty
comment: This property represents the number of parts of an entity. @en
comment: Questa proprietà rappresenta il numero di parti di un'entità.
domain: Thing
label: number of parts @en
range: integer
version info: stabile
version info: stable @en

ha ente schedatore
type: ObjectProperty
comment: This property relates a cultural property to its cagaloguing agency. The relation is declared in the name of the property, but within the ontology this relation is also modeled, in a more expressive way, through the class AgentRole. @en
comment: Questa proprietà rappresenta la relazione che collega un bene culturale al relativo ente schedatore. La relazione tra il ruolo e l'ente che lo riveste è espressa nel nome della proprietà, che quindi ne fornisce una rappresentazione semplificata, con ridotta espressività. Nell'ontologia questa relazione è modellata anche, in maniera più espressiva, dalla classe AgentRole, che permette di collegare l'ente e il suo ruolo.
domain: Bene culturale
label: has cataloguing agency @en
range: Agent
sub property of: ha ente collegato
inverse of: è ente schedatore di
version info: stabile
version info: stable @en
iccd norm tag: ICCD Normativa Trasversale 4.00: CD/ESC

suffisso
type: DatatypeProperty
type: FunctionalProperty
comment: Questa proprietà permette di associare il suffisso a un bene culturale descritto in una scheda catalografica.
comment: This property represents the "suffix" associated to a cultural property described by a catalogue record. @en
domain: Bene culturale
label: suffix @en
range: Literal
sub property of: identifier
version info: stabile
version info: stable @en
iccd norm tag: ICCD Normativa Trasversale 4.00: CD/NCT/NCTS

codice univoco
type: FunctionalProperty
type: DatatypeProperty
comment: This property represents the unique identifier (derived as the concatenation of the region identifier, the catalogue number and the suffix) of a cultural property describey by a catalogue record. @en
comment: Questa proprietà permette di associare il codice univoco (ricavato dalla concatenazione di codice regione, numero di catalogo generale ed eventuale suffisso) a un bene culturale descritto in una scheda catalografica.
domain: Bene culturale
label: unique identifier @en
range: Literal
sub property of: identifier
version info: stable @en
version info: stabile
iccd norm tag: ICCD Normativa Trasversale 4.00: concat(CD/NCT/NCTR + CD/NCT/NCTN + CD/NCT/NCTS)

Bene Architettonico o Paesaggistico
type: Class
comment: This class represents an architectural or landscape heritage. Architecture: monumental complexes, public and religious buildings, noble residences, fortified architectures, private buildings, rural buildings, industrial archeology buildings characterized by particular historical and artistic importance. Historical centers: urban settlement structures older than the municipal territories, characterized by particularly important historical artistic testimonies. Parks and gardens: green spaces of particular historical, artistic and environmental importance. Examples of this type of cultural heritage are gardens and parks annexed to noble properties, vegetable gardens and botanical gardens, urban parks, green areas included in archaeological sites, but also small private gardens, cloisters and courtyards, cemeteries, always if characterized by particular historical and artistic relevance. @en
comment: Questa classe rappresenta un bene culturale architettonico e paesaggistico. Architettura: complessi monumentali, edifici pubblici e di culto, dimore gentilizie, architetture fortificate, edifici privati, edilizia rurale, fabbricati di archeologia industriale caratterizzati da particolare rilevanza storico artistica. Centri/nuclei storici: strutture insediative urbane più antiche dei territori comunali, caratterizzate da testimonianze storico artistiche di particolare rilevanza. Parchi e giardini: spazi verdi di particolare rilevanza storica, artistica e ambientale. Esempi di questa tipologia di beni culturali sono i giardini e i parchi annessi alle proprietà nobiliari, gli orti e i giardini botanici, i parchi urbani, le aree verdi comprese nei siti archeologici, ma anche i piccoli giardini privati, i chiostri e i cortili, i cimiteri, sempre se caratterizzati da particolare rilevanza storico artistica.
label: Architectural or Landscape Heritage @en
subclass of: Bene immobile
version info: stable @en
version info: stabile

Simbolo cartografico
type: Class
comment: Questa classe rappresenta il simbolo con cui si rappresenta il bene su una base cartografica in relazione al tema di interesse.
comment: This class represents the symbol used to represent the cultural property on a cartographic base map, referring to the cartographic theme. @en
label: Cartographic symbol @en
subclass of: Concept
subclass of: Restriction
  on property: è simbolo cartografico di
  some values from: Classificazione cartografica
subclass of: Restriction
  all values from: Literal
  on property: identificativo del simbolo cartografico
version info: stabile
version info: stable @en
iccd norm tag: ICCD Normativa Trasversale 4.00: CT/CTM/CTMD

Storico Artistico
type: Ambito di tutela MiBAC
type: NamedIndividual
label: Historical Artistic @en
version info: stable @en
version info: stabile

definizione e posizione delle parti componenti
type: DatatypeProperty
comment: Questa proprietà rappresenta le informazioni sulla definizione e posizione delle parti componenti di un bene culturale complesso.
comment: This property represents information on definition and position of the components of a complex cultural property. @en
domain: Bene Culturale Complesso
label: definition and position of components @en
range: Literal
version info: stabile
version info: stable @en
iccd norm tag: ICCD Normativa Trasversale 4.00: OG/OGC/OGCD

ha altra disciplina
type: ObjectProperty
comment: This property relates a cultural property to a related scientific discipline, alternative to the main one. @en
comment: Questa proprietà permette di associare un bene culturale a discipline scientifiche, alternative a quella principale, cui fa riferimento.
domain: Bene culturale
label: has alternative discipline @en
range: SubjectDiscipline
inverse of: è altra disciplina di
version info: stable @en
version info: stabile
iccd norm tag: ICCD Normativa PST: CT/CTA

Tipo di classificazione di bene fotografico
type: Class
comment: This class represents photographic property's classification type,, according to to other classification systems as Iconclass. The system has to be recognised and used at national or preferably international level. @en
comment: Questa classe rappresenta il tipo di classificazione di un bene fotografico, relativamente a un sistema di classificazione alternativo a Iconclass, che sia comunque riconosciuto e utilizzato a livello nazionale, o preferibilmente internazionale.
label: Photographic heritage classification type @en
subclass of: Type
subclass of: Restriction
  on property: è tipo di classificazione di bene fotografico
  some values from: Classificazione di bene fotografico
version info: stabile
version info: stable @en
iccd norm tag: ICCD Normativa F: SG/CLF/CLFT

Bene immobile
type: Class
comment: This class represents an immovable cultural property, a property fastened and/or incorporated into the ground (buildings, monumental complexes, territorial areas, etc.) which generally has a significant spatial extent. @en
comment: Questa classe rappresenta un bene materiale immobile, cioè un bene agganciato e/o incorporato al suolo (edifici, complessi monumentali, spazi territoriali, ecc.) che presentano, in genere, un consistente sviluppo spaziale. Si intende come un particolare tipo di Site (contenitore fisico), in quanto luogo fisico georeferenziato che possiede esso stesso un interesse culturale.
label: Immovable Cultural Property @en
subclass of: Bene materiale
disjoint with: Bene mobile
version info: stabile
version info: stable @en

è classificazione di strumento musicale di
type: ObjectProperty
comment: Questa proprietà, inversa a "ha classificazione di bene musicale", collega un una classificazione con cui uno strumento musicale può essere codificato al bene musicale.
domain: Classificazione di strumento musicale
label: is musical instrument classification of @en
range: Bene Musicale
sub property of: isClassificationOf
version info: stable @en
version info: stabile

è identificativo RFId di
type: ObjectProperty
comment: This property relates a radio-frequency identification (RFID) to an object. @en
comment: Questa proprietà collega un identificatore a radiofrequenza RFId a un oggetto.
domain: Identificativo RFId
label: is RFId identifier of @en
range: Thing
version info: stable @en
version info: stabile

Etnoantropologico
type: Ambito di tutela MiBAC
type: NamedIndividual
label: Ethno-anthropological @en
version info: stable @en
version info: stabile

identificativo del simbolo cartografico
type: DatatypeProperty
comment: Questa proprietà rappresenta il codice identificativo attribuito al simbolo cartografico.
comment: This property represents the identifier associated to the cartographic symbol. @en
domain: Simbolo cartografico
label: cartographic symbol identifier @en
range: Literal
sub property of: identifier
version info: stabile
version info: stable @en
iccd norm tag: ICCD Normativa Trasversale 4.00: CT/CTM/CTMS

Bene Naturalistico
type: Class
comment: This class represents a natural heritage, related to botany, mineralogy, paleontology, petrology, planetary science, zoology. Botany: specimens of the plant world from botanical collections (collections of dried plants: herbaria). Mineralogy: specimens of minerals from collections of mineralogy (Augite, Goethite, box of quartz etc.). Paleontology: fossil finds (animals, plants, ichnofossils, samples and microscope preparations, etc.). Petrology: specimens of rocks from collections (Riolite, Trachiandesite etc.). Planetology: meteorites from collections (Aubrite, Ureilite, Eucrite, etc.). Zoology: specimens of the animal world from zoology collections (ustiolo, shrew, mammal, arthropod, butterfly box, elmintological collection, etc.) @en
comment: Questa classe rappresenta un bene culturale naturalistico, relativo ai campi della botanica, della mineralogia, della paleontologia, della petrologia, della planetologia, della zoologia. Botanica: esemplari del mondo vegetale provenienti da collezioni di botanica (raccolte di piante essiccate: erbari). Mineralogia: esemplari di minerali provenienti da collezioni di mineralogia (Augite, Goethite, scatola di quarzi ecc. ). Paleontologia: reperti fossili (animali, vegetali, ichnofossili, campioni e preparati per microscopio, ecc.). Petrologia: esemplari di rocce provenienti da collezioni (Riolite, Trachiandesite ecc). Planetologia: esemplari di meteoriti provenienti da collezioni ( Aubrite, Ureilite, Eucrite ecc.). Zoologia: esemplari del mondo animale provenienti da collezioni di zoologia (ustiolo, toporagno, mammifero, artropode, scatola di farfalle, collezione elmintologica, ecc.)
label: Natural Heritage @en
subclass of: Bene mobile
version info: stable @en
version info: stabile

è tipo di classificazione di bene fotografico
type: ObjectProperty
comment: Questa è la proprietà inversa di "ha tipo di classificazione di bene fotografico".
comment: This is the inverse property of "has photographic heritage classification type". @en
domain: Tipo di classificazione di bene fotografico
label: is photographic heritage classification type of @en
range: Classificazione di bene fotografico
sub property of: isTypeOf
version info: stable @en
version info: stabile

è ente competente per la tutela di
type: ObjectProperty
comment: This property relates an heritage protection agency to the cultural property. The relation is declared in the name of the property, but within the ontology this relation is also modeled, in a more expressive way, through the class AgentRole. @en
comment: Questa proprietà rappresenta la relazione che collega un ente competente per la tutela al relativo bene culturale della cui tutela è competente. La relazione tra il ruolo e l'ente che lo riveste è espressa nel nome della proprietà, che quindi ne fornisce una rappresentazione semplificata, con ridotta espressività. Nell'ontologia questa relazione è modellata anche, in maniera più espressiva, dalla classe AgentRole, che permette di collegare l'ente e il suo ruolo.
domain: Agent
label: is heritage protection agency of @en
range: Bene culturale
sub property of: è ente collegato a
version info: stable @en
version info: stabile
iccd norm tag: ICCD Normativa Trasversale 4.00: CD/ECP

è parte residuale di bene culturale
type: ObjectProperty
comment: This property, inverse of "has residual", relates a residual of a cultural property to the cultural property. @en
comment: Questa proprietà, inversa a "ha parte residuale", collega una parte residuale di un bene culturale al bene culturale stesso.
domain: Parte Residuale di Bene Culturale
label: is cultural property residual of @en
range: Bene culturale
sub property of: isPartOf
version info: stable @en
version info: stabile
iccd norm tag: OG/OGT/OGTW

ha disciplina principale
type: ObjectProperty
comment: This property relates a cultural property to the main related scientific discipline. @en
comment: Questa proprietà permette di associare un bene culturale alla disciplina scientifica più importante, o storicamente riconosciuta, cui fa riferimento.
domain: Bene culturale
label: has main discipline @en
range: SubjectDiscipline
inverse of: è disciplina principale di
version info: stable @en
version info: stabile
iccd norm tag: ICCD Normativa PST: CT/CTP

Bene mobile
type: Class
comment: Questa classe rappresenta un bene materiale mobile, cioè un oggetto o un manufatto che può essere movimentato in vario modo. I beni mobili possono risultare "immobilizzati per destinazione", cioè incorporati saldamente nel contesto in cui si trovano.
comment: This class represents a movable cultural property, that is, an object or an artefact that can be moved in various ways. Movable cultural properties may be "immobilized by destination", i.e. incorporated firmly in the context in which they are located. @en
label: Movable Cultural Property @en
subclass of: Bene materiale
subclass of: Restriction
  all values from: CollectionMembership
  on property: isMemberOfCollection
subclass of: Restriction
  all values from: Estimate
  on property: hasEstimate
version info: stable

ha ente competente per la tutela
type: ObjectProperty
comment: This property relates a cultural property to its heritage protection agency. The relation is declared in the name of the property, but within the ontology this relation is also modeled, in a more expressive way, through the class AgentRole. @en
comment: Questa proprietà rappresenta la relazione che collega un bene culturale al relativo ente competente per la tutela. La relazione tra il ruolo e l'ente che lo riveste è espressa nel nome della proprietà, che quindi ne fornisce una rappresentazione semplificata, con ridotta espressività. Nell'ontologia questa relazione è modellata anche, in maniera più espressiva, dalla classe AgentRole, che permette di collegare l'ente e il suo ruolo.
domain: Bene culturale
label: has heritage protection agency @en
range: Agent
sub property of: ha ente collegato
inverse of: è ente competente per la tutela di
version info: stable @en
version info: stabile
iccd norm tag: ICCD Normativa Trasversale 4.00: CD/ECP

Materiale archeologico
type: Class
comment: Questa classe rappresenta un materiale archeologico, che è una parte di un lotto di materiali archeologici.
comment: This class represents an archaeological material, that is a part of a lot of archaeological materials. @en
label: Archaeological material @en
subclass of: Parte di Bene Culturale
subclass of: Restriction
  on property: number of archeological materials
  some values from: integer
subclass of: Restriction
  on property: ha categoria di materiale archeologico
  some values from: Categoria del materiale archeologico
version info: stabile
version info: stable @en
iccd norm tag: ICCD Normativa TMA: MA

ha ente collegato
type: ObjectProperty
comment: Questa proprietà rappresenta la relazione che collega un bene culturale a un ente che riveste un ruolo nei suoi confronti. La relazione tra il ruolo e l'ente che lo riveste è espressa, in maniera generica, nel nome della proprietà, che quindi ne fornisce una rappresentazione semplificata, con ridotta espressività. La proprietà è specializzata per mezzo di sottoproprietà. Nell'ontologia questa relazione è modellata anche, in maniera più espressiva, dalla classe AgentRole, che permette di collegare l'ente e il suo ruolo.
comment: This property relates a cultural property to an agency that plays a role related to the cultural property. The relation is declared in the name of the property, but within the ontology this relation is also modeled, in a more expressive way, through the class AgentRole. @en
domain: Bene culturale
label: has related agency @en
range: Agent
inverse of: è ente collegato a
property chain axiom: hasAgentRole
property chain axiom: hasAgent
version info: stable @en
version info: stabile

Bene Fotografico
type: Class
comment: Questa classe rappresenta un bene culturale fotografico, che può essere una fotografia o un fondo fotografico. Beni fotografici: negativi, positivi, processi fotografici che danno origine a prodotti unici (dagherrotipi, ferrotipi, polaroid, chimigrammi, ecc.), fotografia digitale; elementi complessi come album, cartelle, fotomontaggi, panorami, porfolii. Fondi fotografici: entità concettuali che si caratterizzano per l'accumulo di più unità fisiche omogenee o eterogenee dal punto di vista dei materiali che li compongono e che acquisiscono nella loro totalità valenza di bene culturale.
comment: This class represents a photographic heritage. Photographs: negative, positive, photographic processes that give rise to unique products (daguerreotypes, ferrotypes, polaroids, chimigrams, etc.), digital photography; complex elements like albums, folders, photomontages, panoramas, porfolii. Photographic funds: conceptual entities that are characterized by the accumulation of multiple homogeneous or heterogeneous physical units from the point of view of the materials that compose them and which represent in their totality a cultural heritage. @en
label: Photographic Heritage @en
subclass of: Bene mobile
subclass of: Restriction
  all values from: Classificazione di bene fotografico
  on property: ha classificazione di bene fotografico
subclass of: Restriction
  all values from: Responsibility
  on property: hasResponsibility
subclass of: Restriction
  all values from: Literal
  on property: numberInCirculation
subclass of: Restriction
  all values from: Class
    union of: ArchivalRecord
    union of: ArchivalRecordSet
  on property: hasPart
subclass of: Restriction
  all values from: PhotographicSeriesMembership
  on property: isMemberOfPhotographicSeries
version info: stable @en
version info: stabile

ha parte residuale di bene culturale
type: ObjectProperty
comment: Questa proprietà collega un bene culturale alla/alle sua/e parte/i residuale/i.
comment: This property relates a cultural property to its residual. @en
domain: Bene culturale
label: has cultural property residual @en
range: Parte Residuale di Bene Culturale
sub property of: hasPart
inverse of: è parte residuale di bene culturale
version info: stable @en
version info: stabile
iccd norm tag: OG/OGT/OGTW

Classificazione cartografica
type: Class
comment: This class represents a cartographic classification of a cultural property, referring to the cartographic representation on specific thematic levels, based on a standard or a classification defined by the cataloguing agency. @en
comment: Questa classe rappresenta una classificazione di un bene culturale relativamente alla rappresentazione cartografica del bene su specifici livelli tematici, con riferimento a uno standard oppure a un'organizzazione logica predefinita dall'Ente responsabile dell'attività di catalogazione.
label: Cartographic classification @en
subclass of: CulturalEntityClassification
subclass of: Restriction
  on property: ha tema cartografico
  some values from: Tema cartografico
subclass of: Restriction
  on property: è classificazione cartografica di
  some values from: Bene culturale
subclass of: Restriction
  all values from: Categoria tematica
  on property: ha categoria tematica
subclass of: Restriction
  on property: ha simbolo cartografico
  some values from: Simbolo cartografico
version info: stabile
version info: stable @en
iccd norm tag: ICCD Normativa Trasversale: CT

Bene Numismatico
type: Class
comment: Questa classe rappresenta un bene culturale numismatico, ovvero monete e altri oggetti di interesse numismatico (reperti premonetali e paramonetali, conii e punzoni monetali, pesi per il controllo monetale, sigilli e medaglie), pertinenti a qualsiasi epoca.
comment: This class represents a numismatic property, that is coins and other objects of numismatic interest (premonetal and paramonetal finds, coinage and monetary punches, weights for monetary control, seals and medals), pertinent to any age. @en
label: Numismatic Property @en
subclass of: Bene mobile
subclass of: Restriction
  all values from: Bene Numismatico
  on property: ha categoria di bene numismatico
subclass of: Restriction
  all values from: NumismaticSeries
  on property: isCoinMemberOf
subclass of: Restriction
  all values from: CoinIssuance
  on property: hasCoinIssuance
version info: stabile
version info: stable @en

Classificazione di bene fotografico
type: Class
comment: Questa classe rappresenta una classificazione di un bene fotografico secondo un sistema di classificazione alternativo a Iconclass, che sia comunque riconosciuto e utilizzato a livello nazionale, o preferibilmente internazionale.
comment: This class represents a photographic entity's classification accorting to other classification systems as Iconclass. The system has to be recognised and used at national or preferably international level. @en
label: Photographic heritage classification @en
subclass of: CulturalEntityClassification
subclass of: Restriction
  on property: ha tipo di classificazione di bene fotografico
  some values from: Tipo di classificazione di bene fotografico
subclass of: Restriction
  on property: soggetto classificato
  some values from: Literal
subclass of: Restriction
  on property: è classificazione di bene fotografico di
  some values from: Bene Fotografico
version info: stable @en
version info: stabile
iccd norm tag: ICCD Normativa F 4.00: SG/CLF

edizione Hornbostel-Sachs
type: DatatypeProperty
comment: Questa proprietà rappresenta l'indicazione bibliografica dell'edizione Hornbostel-Sachs utilizzata per la classificazione dello strumento musicale.
comment: This property represents the edition Horbonstel-Sachs used for classifying a musical instrument. @en
domain: Classificazione Hornbostel-Sachs
label: Hornbostel-Sachs edition @en
range: Literal
version info: stabile
version info: stable @en
iccd norm tag: Normativa SM 4.00: CL/CHS/CHSE

Ambito di tutela MiBAC
type: Class
comment: Questa classe rappresenta l'ambito di tutela del MiBAC (archeologico, architettonico e paesaggistico, etnoantropologico, storico artistico), nel quale ricade il bene culturale in esame.
comment: This class represents the MiBAC scope of protection (historical artistic, ethoanthropological, architectural landscape, archaeological) of a cultural property. @en
label: MiBAC Scope of protection @en
subclass of: Restriction
  on property: è ambito di tutela di
  some values from: Bene culturale
equivalent class: Class
  one of: Archeologico
  one of: Architettonico o Paesaggistico
  one of: Etnoantropologico
  one of: Storico Artistico
version info: stabile
version info: stable @en

ha classificazione cartografica
type: ObjectProperty
comment: This property relates a cultural property to its cartographic classification. @en
comment: Questa proprietà collega un bene culturale alla sua classificazione cartografica.
domain: Bene culturale
label: has cartographic classification @en
range: Classificazione cartografica
sub property of: hasClassification
inverse of: è classificazione cartografica di
version info: stable @en
version info: stabile
iccd norm tag: ICCD Normativa Trasversale 4.00: CT

Parte di Bene Culturale
type: Class
comment: This class represents a generic part of a cultural property, to which some specific information is referred. @en
comment: Questa classe rappresenta, a un livello generico, una parte di un bene culturale descritto in una scheda cui si possono riferire informazioni specifiche.
label: Cultural Property Part @en
subclass of: CulturalEntity
subclass of: Restriction
  all values from: integer
  on property: numero di parte di bene culturale
version info: stabile
version info: stable @en
iccd norm tag: "Riferimento alla parte", presente in molti campi strutturati delle normative ICCD - ICCD Normativa AT 3.01: EL/ELE

Insieme di beni culturali
type: Class
comment: This class represents a complex cultural property, when it is a series or a set. @en
comment: Questa classe rappresenta un bene culturale complesso, quando questo si configuri come una serie o un insieme.
label: Cultural Property Collection @en
subclass of: Collection
subclass of: Restriction
  all values from: Literal
  on property: numero di membri
version info: stabile
version info: stable @en

Ontologia ArCo (ArCo network)
type: Ontology
comment: The ArCo module is the root of the network ArCo - Architecture of Knowledge. It imports all the other modules and models top-level distinctions from the cultural heritage domain. In this module are used as template the following Ontology Design Patterns: - http://www.ontologydesignpatterns.org/cp/owl/classification.owl - http://www.ontologydesignpatterns.org/cp/owl/collectionentity.owl - http://www.ontologydesignpatterns.org/cp/owl/componency.owl - http://www.ontologydesignpatterns.org/cp/owl/partof.owl - http://www.ontologydesignpatterns.org/cp/owl/situation.owl @en
comment: Questo è il modulo centrale della rete di ontologie di ArCo - Architettura della Conoscenza. Qui si modellano informazioni, relative al dominio dei beni culturali, considerate top-level. Vengono importati tutti gli altri moduli della rete. In questo modulo sono riusati come template i seguenti Ontology Design Patterns: - http://www.ontologydesignpatterns.org/cp/owl/classification.owl - http://www.ontologydesignpatterns.org/cp/owl/collectionentity.owl - http://www.ontologydesignpatterns.org/cp/owl/componency.owl - http://www.ontologydesignpatterns.org/cp/owl/partof.owl - http://www.ontologydesignpatterns.org/cp/owl/situation.owl
label: ArCo Ontology (ArCo network) @en
reuses pattern as template: classification.owl
reuses pattern as template: situation.owl
reuses pattern as template: collectionentity.owl
reuses pattern as template: partof.owl
reuses pattern as template: componency.owl
creator: Valentina Carriero (ISTC-CNR, STLab)
creator: Valentina Presutti (ISTC-CNR, STLab)
creator: Chiara Veninata (MiBAC, ICCD)
creator: Maria Letizia Mancinelli (MiBAC, ICCD)
creator: Aldo Gangemi (ISTC-CNR, STLab)
creator: Andrea Nuzzolese (ISTC-CNR, STLab)
creator: Ludovica Marinucci (ISTC-CNR, STLab)
description: The ArCo module is the root of the network ArCo - Architecture of Knowledge. It imports all the other modules and models top-level distinctions from the cultural heritage domain. @en
description: Questo è il modulo centrale della rete di ontologie di ArCo - Architettura della Conoscenza. Qui si modellano informazioni, relative al dominio dei beni culturali, considerate top-level. Vengono importati tutti gli altri moduli della rete.
language: ITA
language: ENG
issued: 2019-03-05
license: A31 CCBYSA40
license: https://creativecommons.org/licenses/by-sa/4.0/
modified: 2019-06-01
imports: cultural-event
imports: context-description
imports: denotative-description
imports: catalogue
imports: location
version info: Version 1.0 @en
version info: Versione 1.0

Architettonico o Paesaggistico
type: Ambito di tutela MiBAC
type: NamedIndividual
label: Architectural or Landscape @en
version info: stable @en
version info: stabile

è altra disciplina di
type: ObjectProperty
comment: This property relates a scientific discipline, alternative to the main one, related to a cultural property to that cultural property. @en
comment: Questa proprietà permette di associare discipline scientifiche, alternative a quella principale, cui un bene culturale fa riferimento, al bene culturale stesso.
domain: SubjectDiscipline
label: is alternative discipline of @en
range: Bene culturale
version info: stable @en
version info: stabile

Categoria di bene culturale basata su catalogazione
type: Class
comment: Questa classe rappresenta una categoria di un bene culturale basata su una valutazione soggettiva del catalogatore durante il processo di catalogazione.
comment: This class represents a cultural property category based on a subjective evaluation of the cataloguing agent, during the cataloguing process. @en
label: Cultural property cataloguing category @en
subclass of: Category
subclass of: Restriction
  on property: è categoria di bene culturale basata su catalogazione di
  some values from: Bene culturale
version info: stable @en
version info: stabile
iccd norm tag: ICCD Normativa Trasversale 4.00: OG/OGT/OGTV

ha simbolo cartografico
type: ObjectProperty
comment: Questa proprietà collega una classificazione cartografica di un bene cultural al simbolo cartografico, in riferimento al tema.
comment: This property relates a cartographic classification of a cultural property to the cartographic symbol related to the theme. @en
domain: Classificazione cartografica
label: has cartographic symbol @en
range: Simbolo cartografico
sub property of: hasConcept
inverse of: è simbolo cartografico di
version info: stabile
version info: stable @en
iccd norm tag: ICCD Normativa Trasversale 4.00: CT/CTM/CTMD

Bene Musicale
type: Class
comment: Questa classe rappresenta un bene culturale musicale. Strumenti musicali: oggetti nati appositamente per produrre suoni organizzati secondo le diverse culture musicali, senza limiti spazio-temporali (strumenti e accessori di interesse archeologico, storico artistico, etnoantropologico). Strumenti musicali-Organo: oggetto nato per produrre suoni, costituito da una serie di canne metalliche, di forma, lunghezza e diametro diversi, nelle quali viene immessa, per mezzo di un mantice o altro meccanismo, una quantità d’aria regolata da una o più tastiere e da una pedaliera (corredato da accessori), caratterizzato da specifici aspetti morfologici-decorativi e fonico-strumentali (organo idraulico, organo positivo, organo portativo, organo elettronico ecc.)
comment: This class represents a music heritage. Musical instruments: objects created specifically to produce sounds according to different musical cultures, without space-time limits (instruments and accessories of archaeological, artistic, ethno-anthropological interest). Musical instruments-Organ: an object created to produce sounds, consisting of a series of metal rods, of different shape, length and diameter, in which a quantity of air is introduced, by means of a bellows or other mechanism, regulated by one or more keyboards and a pedal board (accompanied by accessories), characterized by specific morphological-decorative and phonic-instrumental aspects (hydraulic organ, positive organ, portative organ, electronic organ, etc.) @en
label: Music Heritage @en
subclass of: Bene mobile
subclass of: Restriction
  all values from: Classificazione di strumento musicale
  on property: ha classificazione di strumento musicale
subclass of: Restriction
  all values from: Agent
  on property: hasMusician
subclass of: Restriction
  all values from: Agent
  on property: hasMusicalEnsemble
subclass of: Restriction
  all values from: Accessory
  on property: hasAccessory
subclass of: Restriction
  all values from: Research
  on property: hasResearch
version info: stable @en
version info: stabile

Categoria del bene
type: Class
comment: Questa classe rappresenta la categoria di un bene culturale, che contiene le indicazioni che consentono di inquadrare l'individuazione terminologica del bene catalogato nell'ambito di una più ampia e complessa organizzazione semantica.
comment: This class represents the category of a cultural property, which contains the information that allows us to frame the terminological identification of the properties catalogued in the context of a wider and more complex semantic structure. @en
label: Cultural Property Category @en
subclass of: Category
subclass of: Restriction
  on property: è categoria di bene culturale
  some values from: Bene culturale
subclass of: Restriction
  all values from: Literal
  on property: name
version info: stable @en
version info: stabile
iccd norm tag: ICCD Normativa Trasversale 4.00: OG/CTG - Normativa AT: OG/OGT/OGTP - Normativa RA: OG/CLS - Normative CA e MA e Normativa VeAC: OG/OGT/OGTC

è categoria di bene culturale
type: ObjectProperty
comment: This is the inverse property of "has cultural property category". @en
comment: Questa è la proprietà inversa di "ha categoria".
domain: Categoria del bene
label: is cultural property category of @en
range: Bene culturale
sub property of: isCategoryOf
version info: stable @en
version info: stabile

sigla identificativa del saggio stratigrafico
type: DatatypeProperty
type: FunctionalProperty
comment: This property represents the archaeological site identifier. @en
comment: Questa proprietà rappresenta la sigla del saggio stratigrafico.
domain: Bene Archeologico
label: archaeological site identifier @en
range: Literal
sub property of: identifier
version info: stable @en
version info: stabile
iccd norm tag: ICCD Normativa SAS: OG/OGT/OGTI

note sulla fotografia digitale
type: DatatypeProperty
type: FunctionalProperty
comment: This property represents notes on a digital photograph. @en
comment: Questa proprietà rappresenta le note relative alla fotografia digitale. Può rappresentare informazioni utili a identificare le intenzioni dell'autore in relazione alla visualizzazione o rioggettivazione della fotografia digitale, come la dimensione del quadro, la risoluzione di stampa e relativa unità di misura, altre indicazioni per la stampa (tipo stampante, correzioni cromatiche, ecc.), categoria, URL, ecc.
domain: Bene Fotografico
label: digital photograph note @en
range: Literal
sub property of: note
version info: stabile
version info: stable @en
iccd norm tag: ICCD Normativa F: MT/FVC/FVCV

Bene materiale
type: Class
comment: This class represents a tangible cultural property, either immovable or movable. @en
comment: Questa classe rappresenta un bene materiale, cioè fisicamente tangibile, sia mobile che immobile.
label: Tangible Cultural Property @en
subclass of: Bene culturale
version info: stable @en
version info: stabile

è categoria di bene culturale basata su catalogazione di
type: ObjectProperty
comment: Questa è la proprietà inversa a "ha categoria di bene culturale basata su catalogazione".
comment: This is the inverse property of "has cultural property cataloguing category of". @en
domain: Categoria di bene culturale basata su catalogazione
label: is cultural property cataloguing category of @en
range: Bene culturale
sub property of: isCategoryOf
version info: stable @en
version info: stabile

codice internazionale
type: FunctionalProperty
type: DatatypeProperty
comment: Questa proprietà rappresenta il numero di codice internazionale che identifica un bene scientifico e tecnologico. All'indirizzo http://www.isin.org/ è possibile reperire tutte le specifiche per l'adesione al progetto e l'attribuzione del codice internazionale. Il Registro Online è un database che raccoglie informazioni su strumenti scientifici di interesse storico promosso dal Museum of the History of Science di Oxford in collaborazione con la Commissione Strumenti Scientifici dell'International Union of the History and Philosophy of Science.
comment: This property represents the international identifier of a scientific or technological heritage. More info can be found at https://www.isin.org/ @en
domain: Bene Scientifico o Tecnologico
label: international identifier @en
range: Literal
sub property of: identifier
version info: stable @en
version info: stabile
iccd norm tag: ICCD Normativa PST: AC/ACI

numero di parti residuali di bene culturale
type: FunctionalProperty
type: DatatypeProperty
comment: Questa proprietà rappresenta il numero di parti residuali, nel caso in cui si stia descrivendo un bene di cui si conservano più parti residuali.
comment: This property represents the number of residuals (only if more than one) of a cultural property. @en
domain: Parte Residuale di Bene Culturale
label: number of cultural property residual parts @en
range: integer
sub property of: numero di parti
version info: stable @en
version info: stabile
iccd norm tag: OG/QNT/QNTR

Codice numerico Hornbostel-Sachs
type: FunctionalProperty
type: DatatypeProperty
comment: Questa proprietà rappresenta il codice numerico, secondo l'edizione specifica Hornbostel-Sachs, associato allo strumento musicale nell'ambito della classificazione Hornbostel-Sachs.
comment: This property represents the numerical code associated to a musical instrument according to a specific edition of the Hornbostel-Sachs classification. @en
domain: Classificazione Hornbostel-Sachs
label: Hornbostel-Sachs number @en
range: Literal
sub property of: identifier
version info: stabile
version info: stable @en
iccd norm tag: Normativa SM 4.00: CL/CHS/CHSN

è categoria di bene numismatico
type: ObjectProperty
comment: Questa proprietà collega una categoria di bene numismatico al bene numismatico cui si riferisce.
domain: Classificazione di bene numismatico
label: is numismatic property category of @en
range: Bene Numismatico
sub property of: isCategoryOf
version info: stabile
version info: stable @en
iccd norm tag: ICCD Normativa NU 4.00: OG/OGT/OGTH

ha categoria di materiale archeologico
type: ObjectProperty
comment: Questa proprietà collega un materiale archeologico alla sua categoria (es.: ceramiche, industria litica, intonaco, legno, etc.)
comment: This property relates the archaeological material to its category (e.g.: ceramics, plaster, lithic materials, etc.) @en
domain: Materiale archeologico
label: has archaeological material category @en
range: Categoria del materiale archeologico
sub property of: hasCategory
inverse of: è categoria di materiale archeologico
version info: stabile
version info: stable @en
iccd norm tag: ICCD Normativa TMA: MA/MAC/MACC

ha parte componente di bene culturale
type: ObjectProperty
comment: Questa proprietà collega un bene culturale complesso a una delle sue parti componenti.
comment: This property relates a cultural property to its components. @en
domain: Bene Culturale Complesso
label: has cultural property component @en
range: Parte Componente di Bene Culturale
sub property of: hasComponent
inverse of: è parte componente di bene culturale
version info: stable @en
version info: stabile
iccd norm tag: OG/OGT/OGTP

Parte Componente di Bene Culturale
type: Class
comment: This class represents a component of a complex cultural property. @en
comment: Questa classe rappresenta una parte componente di un bene culturale complesso.
label: Cultural Property Component @en
subclass of: Bene culturale
subclass of: Restriction
  all values from: Literal
  on property: positionInComplexCulturalProperty
subclass of: Restriction
  on property: è parte componente di bene culturale
  some values from: Bene Culturale Complesso
version info: stabile
version info: stable @en
iccd norm tag: OG/OGT/OGTP

number of archeological materials
type: FunctionalProperty
type: DatatypeProperty
comment: numero di materiali archeologici componenti
comment: This property represents the total quantity of an archaeological material that is part of a lot of archaeological materials. @en
comment: Questa proprietà rappresenta la quantità complessiva di uno stesso materiale archeologico componente di un lotto di materiali.
domain: Materiale archeologico
range: integer
sub property of: numero di parti
version info: stable @en
version info: stabile
iccd norm tag: ICCD Normativa TMA: MA/MAC/MACQ

Classificazione alternativa di strumento musicale
type: Class
comment: This class represents a classification different from the Hornbostel-Sachs classification. @en
comment: Questa classe rappresenta un sistema di classificazione diverso da quello Hornbostel-Sachs, con cui può essere codificato uno strumento musicale.
label: Alternative musical instrument classification @en
subclass of: Classificazione di strumento musicale
subclass of: Restriction
  on property: taxon
  some values from: Literal
subclass of: Restriction
  on property: hasAuthor
  some values from: Agent
subclass of: Restriction
  all values from: Bibliography
  on property: hasBibliography
disjoint with: Classificazione Hornbostel-Sachs
version info: stabile
version info: stable @en
iccd norm tag: Normativa SM 4.00: CL/CLA

Bene Archeologico
type: Class
comment: This class represents an archaeological cultural property, consisting of archaeological complexes, archaeological monuments, anthropological materials, archaeological objects, stratigraphic records, archaeological sites, archaeological materials tables. Archaeological complexes: monumental complexes consisting of several building units (inhabited areas, fortified centers, sanctuaries, thermal complexes, etc.), catalogued regardless of their current conservation status. Archaeological monuments: single building units (a tower, a domus, a temple, etc.) catalogued regardless of their current conservation status. Anthropological materials: biological evidence related to archaeological and paleontological contexts. Archaeological objects: movable properties of archaeological origin (jewelry and jewelry, clothing, furnishings, architectural elements, paintings, archeobotanical and archeozoological objects, sculpture, tools and everyday objects, etc.). Stratigraphic records: stratigraphic sequences found in archaeological excavation contexts. Archaeological sites: portions of territory that preserve archaeological evidence. Archaeological materials tables: lots of archaeological materials. @en
comment: Questa classe rappresenta un bene culturale archeologico, che può essere un complesso archeologico, un monumento archeologico, un reperto archeologico, un reperto antropologico, un saggio stratigrafico, un sito archeologico, o una tabella materiali archeologici. Complessi archeologici: complessi monumentali costituiti da più unità edilizie (abitati, centri fortificati, santuari, complessi termali, ecc.), catalogati a prescindere dal loro attuale stato di conservazione. Monumenti archeologici: singole unità edilizie (una torre, una domus, un tempio, ecc.) catalogate a prescindere dal loro attuale stato di conservazione. Reperti antropologici: testimonianze biologiche in relazione con contesti archeologici e paleontologici. Reperti archeologici: beni mobili di provenienza archeologica (gioielli e monili, vestimenti, arredi, elementi architettonici, opere di pittura, reperti archeobotanici e archeozoologici, scultura, strumenti e oggetti d’uso, ecc.). Saggi stratigrafici: sequenze stratigrafiche rinvenute in contesti di scavo archeologico. Siti archeologici: porzioni di territorio che conservano testimonianze archeologiche. Tabella materiali archeologici: lotti di materiali di provenienza archeologica
label: Archaeological Property @en
subclass of: Bene materiale
subclass of: Restriction
  all values from: Location
  on property: hasStratigraphicSquare
subclass of: Restriction
  all values from: BiologicalTaxonomy
  on property: hasBiologicalTaxonomy
subclass of: Restriction
  all values from: Location
  on property: hasStratigraphicArea
subclass of: Restriction
  all values from: FindingContext
  on property: hasFindingContext
subclass of: Restriction
  all values from: AgeOfDeathEstimate
  on property: hasAgeOfDeathEstimate
subclass of: Restriction
  all values from: Literal
  on property: anthropologicalMaterialMorphology
subclass of: Restriction
  all values from: Location
  on property: hasStratigraphicRoom
subclass of: Restriction
  all values from: SexEstimate
  on property: hasSexEstimate
subclass of: Restriction
  all values from: SampleCollected
  on property: hasSampleCollected
version info: stable @en
version info: stabile

Categoria tematica
type: Class
comment: This class represents the thematic category associated to a cartographic classification of a cultural property (e.g.: Architecture). @en
comment: Questa classe rappresenta la categoria tematica associata alla classificazione cartografica di un bene culturale (es.: Architetture, Emergenze Archeologiche)
label: Thematic category @en
subclass of: Category
subclass of: Restriction
  on property: è categoria tematica di
  some values from: Classificazione cartografica
version info: stabile
version info: stable @en
iccd norm tag: ICCD Normativa Trasversale 4.00: CT/CTM/CTMC

Bene culturale
type: Class
comment: Questa classe rappresenta un bene culturale, sia materiale che immateriale. Un bene culturale è una testimonianza materiale o immateriale, riconosciuta come parte del patrimonio culturale nazionale in quanto utile alla conoscenza e alla ricostruzione della storia e del paesaggio.
comment: This class represents a cultural property, both tangible and intangible. A cultural property is the legacy, tangible or intangible, recognised as part of the national cultural heritage, since it helps know and reconstruct the history and the landscape. @en
label: Cultural Property @en
subclass of: CulturalEntity
subclass of: Restriction
  all values from: CulturalPropertyType
  on property: hasCulturalPropertyType
subclass of: Restriction
  all values from: Literal
  on property: storageConditions
subclass of: Restriction
  all values from: TimeIndexedTypedLocation
  on property: hasLocationSubject
subclass of: Restriction
  all values from: AdditionalForm
  on property: isRelatedToAdditionalForm
subclass of: Restriction
  all values from: Address
  on property: hasCulturalPropertyAddress
subclass of: Restriction
  all values from: TypeOfContext
  on property: hasTypeOfContext
subclass of: Restriction
  all values from: Literal
  on property: numero di oggetti/elementi componenti
subclass of: Restriction
  all values from: TimeIndexedTypedLocation
  on property: hasTimeIndexedTypedLocation
subclass of: Restriction
  all values from: ExportImportCertification
  on property: hasExportImportCertification
subclass of: Restriction
  all values from: Inventory
  on property: hasInventory
subclass of: Restriction
  all values from: ProtectiveMeasure
  on property: hasProtectiveMeasure
subclass of: Restriction
  all values from: Intervention
  on property: hasIntervention
subclass of: Restriction
  all values from: RelatedWorkSituation
  on property: hasRelatedWorkSituation
subclass of: Restriction
  all values from: InformationForm
  on property: isRelatedToInformationForm
subclass of: Restriction
  all values from: AuthorshipAttribution
  on property: hasAuthorshipAttribution
subclass of: Restriction
  all values from: CulturalPropertyAccessibility
  on property: hasCulturalPropertyAccessibility
subclass of: Restriction
  all values from: Parte Componente di Bene Culturale
  on property: ha parte componente di bene culturale
subclass of: Restriction
  all values from: Literal
  on property: subject
subclass of: Restriction
  all values from: Dating
  on property: hasDating
subclass of: Restriction
  all values from: DesignationInTime
  on property: hasDesignationInTime
subclass of: Restriction
  all values from: MeasurementCollection
  on property: hasMeasurementCollection
subclass of: Restriction
  all values from: FunctionalPurpose
  on property: hasFunctionalPurpose
subclass of: Restriction
  all values from: Orientation
  on property: hasOrientation
subclass of: Restriction
  all values from: UrbanPlanningInstrument
  on property: hasUrbanPlanningInstrument
subclass of: Restriction
  all values from: CollectionMembership
  on property: isMemberOfCollection
subclass of: Restriction
  all values from: Literal
  on property: historicalInformation
subclass of: Restriction
  all values from: Literal
  on property: informationGatheredOnSite
subclass of: Restriction
  all values from: Subject
  on property: hasSubject
subclass of: Restriction
  max cardinality: 1
  on property: codice univoco
subclass of: Restriction
  all values from: Acquisition
  on property: hasAcquisition
subclass of: Restriction
  all values from: Bibliography
  on property: hasBibliography
subclass of: Restriction
  all values from: ChangeOfAvailability
  on property: hasChangeOfAvailability
subclass of: Restriction
  all values from: CulturalPropertyAvailability
  on property: hasCulturalPropertyAvailability
subclass of: Restriction
  all values from: Literal
  on property: title
subclass of: Restriction
  max cardinality: 1
  on property: codice regione
subclass of: Restriction
  all values from: Literal
  on property: proposedIntervention
subclass of: Restriction
  max cardinality: 1
  on property: numero catalogo generale
subclass of: Restriction
  max cardinality: 1
  on property: suffisso
subclass of: Restriction
  all values from: Parte Residuale di Bene Culturale
  on property: ha parte residuale di bene culturale
subclass of: Restriction
  all values from: CadastralIdentity
  on property: hasCadastralIdentity
subclass of: Restriction
  all values from: Geometry
  on property: hasGeometry
subclass of: Restriction
  all values from: DetectionMethod
  on property: hasDetectionMethod
subclass of: Restriction
  all values from: IconographicOrDecorativeApparatus
  on property: hasIconographicOrDecorativeApparatus
subclass of: Restriction
  all values from: LegalSituation
  on property: hasLegalSituation
subclass of: Restriction
  all values from: CulturalEntityTechnicalStatus
  on property: hasTechnicalStatus
subclass of: Restriction
  all values from: Title
  on property: hasTitle
subclass of: Restriction
  all values from: Use
  on property: hasUse
subclass of: Restriction
  all values from: AffixedElement
  on property: hasAffixedElement
subclass of: Restriction
  all values from: ConservationStatus
  on property: hasConservationStatus
subclass of: Restriction
  all values from: Literal
  on property: rights
subclass of: Restriction
  on property: hasDocumentation
  some values from: Documentation
subclass of: Restriction
  all values from: Commission
  on property: hasCommission
subclass of: Restriction
  all values from: Survey
  on property: hasSurvey
version info: stabile
version info: stable @en

taxon
type: DatatypeProperty
comment: This property represents the taxon code and the taxon definition associated to the musical instrument, according to a musical instrument classification. @en
comment: Questa proprietà rappresenta il codice tassonomico e la definizione attribuiti allo strumento musicale schedato nell'ambito del sistema di classificazione preso in considerazione.
domain: Classificazione alternativa di strumento musicale
range: Literal
version info: stable @en
version info: stabile
iccd norm tag: Normativa SM 4.00: CL/CLA/CLAT

è categoria tematica di
type: ObjectProperty
comment: Questa è la proprietà inversa di "ha categoria tematica".
comment: This is the inverse property of "has thematic category". @en
domain: Categoria tematica
label: is thematic category of @en
range: Classificazione cartografica
sub property of: isCategoryOf
version info: stabile
version info: stable @en

ha categoria di bene culturale basata su catalogazione
type: ObjectProperty
comment: This property relates a cultural property to a category based on a subjective evaluation of the cataloguing agent, during the cataloguing process. @en
comment: Questa proprietà collega un bene culturale a una categoria basata su una valutazione soggettiva del catalogatore durante il processo di catalogazione.
domain: Bene culturale
label: has cultural property cataloguing category @en
range: Categoria di bene culturale basata su catalogazione
sub property of: hasCategory
inverse of: è categoria di bene culturale basata su catalogazione di
version info: stabile
version info: stable @en
iccd norm tag: ICCD Normativa Trasversale 4.00: OG/OGT/OGTV

è legenda tipo di
type: ObjectProperty
comment: Questa è la proprietà inversa di "ha legenda tipo".
comment: This is the inverse property of "ha reference coin legend". @en
domain: Legenda tipo
label: is reference coin legend of @en
range: Bene Numismatico
sub property of: isConceptOf
version info: stabile
version info: stable @en

è ambito di tutela di
type: ObjectProperty
comment: This is the inverse property of "has MiBAC scope of protection". @en
comment: Questa è la proprietà inversa di "ha ambito di tutela".
domain: Ambito di tutela MiBAC
label: is MiBAC scope of protection of @en
range: Bene culturale
version info: stable @en
version info: stabile

è parte componente di bene culturale
type: ObjectProperty
comment: Questa proprietà, inversa a "ha componente", collega una delle parti componenti di un bene culturale complesso al bene complesso stesso. @en
comment: This property, inverse of "has component", relates a component of a complex cultural property to the complex cultural property. @en
domain: Parte Componente di Bene Culturale
label: is cultural property component of @en
range: Bene Culturale Complesso
sub property of: isPartOf
version info: stabile
version info: stable @en
iccd norm tag: OG/OGT/OGTP

numero catalogo generale
type: FunctionalProperty
type: DatatypeProperty
comment: This property represents the general catalogue number associated to a cultural property described by a catalogue record. @en
comment: Questa proprietà permette di associare il numero di catalogo generale a un bene culturale descritto in una scheda catalografica.
domain: Bene culturale
label: catalogue number @en
range: Literal
sub property of: identifier
version info: stabile
version info: stable @en
iccd norm tag: ICCD Normativa Trasversale 4.00: CD/NCT/NCTN

ha tipo di classificazione di bene fotografico
type: ObjectProperty
comment: This property connects a photographic property's classification to the classification type, according to to other classification systems as Iconclass. The system has to be recognised and used at national or preferably international level. @en
comment: Questa proprietà collega una classificazione di un bene fotografico al tipo di classificazione, relativamente a un sistema di classificazione alternativo a Iconclass, che sia comunque riconosciuto e utilizzato a livello nazionale, o preferibilmente internazionale.
domain: Classificazione di bene fotografico
label: has photographic heritage classification type @en
range: Tipo di classificazione di bene fotografico
sub property of: hasType
inverse of: è tipo di classificazione di bene fotografico
version info: stabile
version info: stable @en
iccd norm tag: ICCD Normativa F: SG/CLF/CLFT

Identificativo RFId
type: Class
comment: Questa classe rappresenta l'identificatore a radiofrequenza RFId.
comment: This class represents the radio-frequency identification (RFID). @en
label: RFId Identifier @en
subclass of: Restriction
  on property: è identificativo RFId di
  some values from: Thing
subclass of: Restriction
  all values from: Literal
  on property: note
version info: stable @en
version info: stabile
iccd norm tag: ICCD Normativa Trasversale 4.00: RF/RFI

ha legenda tipo
type: ObjectProperty
type: FunctionalProperty
comment: This property relates a numismatic property with its reference coin legend. @en
comment: Questa proprietà collega un bene numismatico alla sua legenda tipo.
domain: Bene Numismatico
label: has reference coin legend @en
range: Legenda tipo
sub property of: hasConcept
inverse of: è legenda tipo di
version info: stabile
version info: stable @en
iccd norm tag: ICCD Normativa NU: OG/OGT/OGTL

Classificazione Hornbostel-Sachs
type: Class
comment: This class represents the Hornbostel-Sachs classification of a musical instrument. @en
comment: Questa classe rappresenta la classificazione Hornbostel-Sachs di uno strumento musicale.
label: Hornbostel-Sachs classification @en
subclass of: Classificazione di strumento musicale
subclass of: Restriction
  all values from: Literal
  on property: definizione Hornbostel-Sachs
subclass of: Restriction
  all values from: Literal
  on property: edizione Hornbostel-Sachs
subclass of: Restriction
  on property: Codice numerico Hornbostel-Sachs
  some values from: Literal
version info: stabile
version info: stable @en
iccd norm tag: Normativa SM 4.00: CL/CHS

è ente collegato a
type: ObjectProperty
comment: This property, inverse of "has related agency", relates an agency that plays a role related to a cultural property to that cultural property. The relation is declared in the name of the property, but within the ontology this relation is also modeled, in a more expressive way, through the class AgentRole. @en
comment: Questa proprietà, inversa a "ha ente collegato", rappresenta la relazione che collega un ente che riveste un ruolo nei confronti di un bene culturale al bene culturale stesso. La relazione tra il ruolo e l'ente che lo riveste è espressa, in maniera generica, nel nome della proprietà, che quindi ne fornisce una rappresentazione semplificata, con ridotta espressività. La proprietà è specializzata per mezzo di sottoproprietà. Nell'ontologia questa relazione è modellata anche, in maniera più espressiva, dalla classe TimeIndexedRole, che permette di collegare l'ente, il suo ruolo e la sua corrispondente estensione temporale.
domain: Agent
label: is related agency of @en
range: Bene culturale
version info: stabile
version info: stable @en

definizione Hornbostel-Sachs
type: DatatypeProperty
comment: This property represents the definition associated to a musical instrument, according to the Hornbostel-Sachs classification. @en
comment: Questa proprietà rappresenta la definizione associata allo strumento musicale, secondo la classificazione Hornbostel-Sachs.
domain: Classificazione Hornbostel-Sachs
label: Hornbostel-Sachs definition @en
range: Literal
version info: stabile
version info: stable @en
iccd norm tag: Normativa SM 4.00: CL/CHS/CHSD

Classificazione di bene numismatico
type: Class
comment: Questa classe rappresenta la categoria funzionale di un bene numismatico, in riferimento a una classificazione relativa alla funzione, o alla destinazione, o alla committenza del bene catalogato, secondo le classificazioni più consuete.
comment: This class represents a functional category of a numismatic property, referring to a classification related to the function or the commission of the cultural property, according to the most common classifications. @en
label: Numismatic property classification @en
subclass of: Category
subclass of: Restriction
  on property: è categoria di bene numismatico
  some values from: Bene Numismatico
version info: stabile
version info: stable @en
iccd norm tag: ICCD Normativa NU 4.00: OG/OGT/OGTH

Bene Scientifico o Tecnologico
type: Class
comment: This class represents a scientific and technological heritage, that is instruments of interest to the history of science and technology (astronomical, laboratory, measurement, etc.) relevant to any age and related to specific scientific disciplines (flat-mirror luminaire rotating, apparatus for the colored rings of Newton, bell of Savart, Farina clock, solar clock, pendulum, sextant, telescope, etc.); machines and machinery, means of transport, etc. @en
comment: Questa classe rappresenta un bene culturale scientifico e tecnologico, ovvero strumenti di interesse per la storia della scienza e della tecnica (strumenti astronomici, di laboratorio, di misurazione ecc.) pertinenti a qualsiasi epoca e afferenti a specifiche discipline scientifiche ( apparecchio a specchi a piani rotanti, apparecchio per gli anelli colorati di Newton, campana di Savart, orologio di Farina, orologio solare, pendola, sestante, telescopio ecc.); macchine e macchinari, mezzi di trasporto ecc.
label: Scientific Or Technological Heritage @en
subclass of: Bene mobile
version info: stable @en
version info: stabile

ha identificativo RFId
type: ObjectProperty
comment: This property relates an object to an RFId. @en
comment: Questa proprietà collega un oggetto a un identificatore a radiofrequenza RFId.
domain: Thing
label: has RFId identifier @en
range: Identificativo RFId
inverse of: è identificativo RFId di
version info: stabile
version info: stable @en

Categoria di bene culturale basata su repertorio
type: Class
comment: This class represents a category of a numismatic property, related to a classification based on an inventory approved by the specific subject area. @en
comment: Questa classe rappresenta la categoria di un bene numismatico, in riferimento a una classificazione che si basa su un repertorio riconosciuto nello specifico ambito disciplinare.
label: Cultural property inventory category @en
subclass of: Category
subclass of: Restriction
  on property: è categoria basata su repertorio di
  some values from: Bene culturale
version info: stable @en
version info: stabile
iccd norm tag: ICCD Normativa Trasversale 4.00: OG/OGT/OGTS

ha classificazione di strumento musicale
type: ObjectProperty
comment: Questa proprietà collega un bene musicale a una classificazione con cui lo strumento può essere codificato.
comment: This property connects a cultural entity to a classification through which the instrument can be coded. @en
domain: Bene Musicale
label: has musical instrument classification @en
range: Classificazione di strumento musicale
sub property of: hasClassification
inverse of: è classificazione di strumento musicale di
version info: stabile
version info: stable @en

è simbolo cartografico di
type: ObjectProperty
comment: Questa è la proprietà inversa di "ha simbolo cartografico".
comment: This is the inverse property of "has cartographic symbol". @en
domain: Simbolo cartografico
label: is cartographic symbol of @en
range: Classificazione cartografica
sub property of: isConceptOf
version info: stabile
version info: stable @en

ha tema cartografico
type: ObjectProperty
comment: This property relates a cartographic classification of a cultural property to the cartographic theme. @en
comment: Questa proprietà collega una classificazione cartografica di un bene culturale al tema di riferimento.
domain: Classificazione cartografica
label: has cartographic theme @en
range: Tema cartografico
sub property of: hasConcept
inverse of: è tema cartografico di
version info: stabile
version info: stable @en
iccd norm tag: ICCD Normativa Trasversale 4.00: CT/CTM/CTMT

ha categoria di bene numismatico
type: ObjectProperty
comment: Questa proprietà collega un bene numismatico a una sua categoria.
comment: This property relates a numismatic property to one of its categories. @en
domain: Bene Numismatico
label: has numismatic property category @en
range: Classificazione di bene numismatico
sub property of: hasCategory
inverse of: è categoria di bene numismatico
version info: stable @en
version info: stabile
iccd norm tag: ICCD Normativa NU 4.00: OG/OGT/OGTH

Bene Storico o Artistico
type: Class
comment: Questa classe rappresenta un bene culturale storico e artistico, che può essere un disegno, una matrice incisa, un'opera o oggetto d'arte (contemporanea e non), una stampa, un vestimento antico o contemporaneo. Disegni: opere fatte a mano su qualsiasi supporto (carta, cartoncino, cartone, intonaco, legno, pergamena, pietra, seta, tavola, tela ecc.) e con particolari strumenti (carboncino, gessetto, inchiostro, lapis, matita, pastello, penna ecc.) e specifiche tecniche (acquarellatura, sanguigna ecc.). Matrici incise: lastre di vario materiale (acciaio, legno, linoleum, ottone, pietra, zinco rame ecc.) su cui vengono tracciate rappresentazioni pittoriche con particolari strumenti (bulino, punte di acciaio o di diamante, punzoni, raschietti ecc.) e con specifiche tecniche di incisione (acquaforte, acquatinta, litografia, mezzatinta, serigrafia, silografia, zincografia ecc.). Opere e oggetti d'arte: beni mobili costituenti parte integrante di monumenti artistici e storici o provenienti dallo smembramento dei monumenti stessi, conservati in collezioni, musei e pinacoteche (armi ed armature, arredi civili e religiosi, oggetti per il culto, oggetti d'uso, opere di pittura, tessuti e arazzi, sulture, ecc.). Opere e oggetti d'arte contemporanea: opere rappresentative delle nuove correnti artistiche dei secc. XX e XXI (assemblaggio, computer art, istallazione, istallazione ambientale, istallazione audio, istallazione video, istallazione multimediale interattiva, opera cinetico-visuale, performance, ready made, realtà virtuale, video arte ecc.). Stampe: esemplari prodotti dall'operazione mediante la quale da una matrice di incisione si ottengono copie uguali di rappresentazioni pittoriche su carta, cartoncino, cuoio, pergamena, seta ecc. con varie tecniche di incisione (acquaforte, acquatinta, litografia, zincografia ecc.). Vestimenti antichi e contemporanei: abiti e costumi riguardanti l’abbigliamento maschile, femminile e infantile ad uso civile, connessi alle principali fi…
comment: This class represents an historic or artistic property: drawing, printing plate, (contemporary) artworks, print, historic and contemporary garment. Drawings: works done by hand on any support (paper, cardboard, plaster, wood, parchment, stone, silk, table, canvas, etc.) and with special tools (charcoal, chalk, ink, pencil, pastel, pen etc.) and technical specifications (watercolor, blood, etc.). Printing plates: plates of various materials (steel, wood, linoleum, brass, stone, copper zinc, etc.) on which pictorial representations are traced with particular tools (burin, steel or diamond points, punches, scrapers, etc.) and with technical specifications for etching (etching, aquatint, lithography, halftone, screen printing, silica, zincography, etc.). Artworks: movable cultural properties that are integral part of artistic and historical monuments or coming from the dismemberment of the monuments themselves, preserved in collections, museums and art galleries (weapons and armor, civil and religious furnishings, objects for worship, everyday objects, paintings, fabrics and tapestries, walls, etc.). Contemporary artworks: cultural properties representative of the new artistic currents of the centuries XX and XXI (assembly, computer art, installation, environmental installation, audio installation, video installation, interactive multimedia installation, kinetic-visual work, performance, ready-made, virtual reality, video art, etc.). Prints: specimens created through this process: equal copies of pictorial representations on paper, cardboard, leather, parchment, silk, etc. are obtained from a printing plate, with various engraving techniques (etching, aquatint, lithography, zincography, etc.). Historic and contemporary garments: clothes and costumes for men's, women's and children's clothing for civil use, connected to the main intended use and to different occasions of private and social life, according to the historical typologies of the XVIII, XIX and XX centuries (d… @en
label: Historic Or Artistic Property @en
subclass of: Bene mobile
subclass of: Restriction
  all values from: Fruition
  on property: hasFruition
subclass of: Restriction
  all values from: Literal
  on property: numberInCirculation
version info: stable @en
version info: stabile

codice regione
type: DatatypeProperty
type: FunctionalProperty
comment: This property represents the "region identifier" associated to a cultural property described by a catalogue record. @en
comment: Questa proprietà permette di associare il codice regione a un bene culturale descritto in una scheda catalografica.
domain: Bene culturale
label: region identifier @en
range: Literal
sub property of: identifier
version info: stabile
version info: stable @en
iccd norm tag: ICCD Normativa Trasversale 4.00: CD/NCT/NCTN