Remedy resolution date
type: FunctionalProperty
type: DatatypeProperty
domain: Remedy
label: Fecha de resolución del recurso @es
range: date
sub property of: Date

Contract or procedure extinction
type: ObjectProperty
comment: Propiedad abstracta que indica la extinción de un contrato por resolución, renuncia o abandono. O bien la extinción del procedimiento al ser declarado desierto. Utilizar una de sus subclases. @es
comment: Abstract property pointing to extinction of contract or procedure. Use any of its subclasses.
domain: Public contract
label: Extinción de contrato o de procedimiento @es
range: Contract or procedure extinction

Contract or procedure extinction
type: Class
comment: Clase abstracta. Existe una serie de circunstancias que derivan en la extinctión del contrato o procedimiento. Para describir estas situaciones se hace uso de una de sus subclases. @es
comment: Abstract class. There are some circumstances resulting in the extinction of the procedure of the contract or the contract itself. To describe that situations we may use one of its subclasses.
label: Extinción del contrato o del procedimiento @es

Contract modification
type: ObjectProperty
comment: Indica la modificación efectuada en un contrato. @es
comment: Points to contract modifications being made.
domain: Public contract
label: Modificación de contrato @es
range: Contract modification

Mixed capital company contract
type: Class
comment: Los contrato de sociedad de economia mixta son aquellos en que la Administración participe, por sí o por medio de una entidad pública, en concurrencia con personas naturales o jurídicas. @es
comment: Class describing the contracts where the contracting authority participates concurrently with the natural or legal person.
label: Contrato de sociedad de economia mixta @es
subclass of: Public services management contract

Duration
type: DatatypeProperty
label: Duración @es
range: duration

Contract execution conditions
type: Class
comment: Clase que define las condiciones de ejecución de un contrato (e.g. condiciones especiales ó subcontratación). @es
comment: Class that defines the execution conditions of the contract (e.g. special execution conditions or subcontracting percentage amounts).
label: Condiciones de ejecución del contrato @es

Urgency type scheme
type: Concept scheme
type: NamedIndividual
comment: Scheme that defines the kinds of urgency a procedure can follow.
label: Esquema de tipos de urgencia @es

CONTSEM ontology
type: NamedIndividual
title: ontologia CONTSEM @es

Tender information provider
type: ObjectProperty
domain: Contract procedure
label: Proveedor de información sobre la licitación @es
range: Information provider

Address country
type: DatatypeProperty
label: País @es

Contract
type: Class
label: Contrato @es

Lote
type: ObjectProperty
domain: Contract with lots
label: Lot
range: Lot
sub property of: Lot

Date of award
type: FunctionalProperty
type: DatatypeProperty
domain: Tender
label: Fecha de adjudicación @es
range: date
sub property of: Date
backward compatible with: awardDate

Description
type: DatatypeProperty
label: Descripción @es

Extendable contract
type: Class
comment: Contratos públicos cuya fecha de ejecución puede ser pospuesta o extendida. @es
comment: Class describing contracts whose end date can be extended.
label: Contrato prorrogable @es
subclass of: Public contract

Maximum final price change
type: FunctionalProperty
type: DatatypeProperty
comment: El rango en esta propiedad indica un porcentaje, por lo que el rango del número real a utilizar debe estar comprendido entre 0.0 y 100.0. @es
comment: The range of this property must be a percentage (i.e. float between 0.0 and 100.0)
domain: Contract modification conditions
label: Modificación máxima sobre precio final @es
range: float

Additional information notice
type: Class
label: Anuncio de información adicional @es
subclass of: Notice

Main object of contract
type: FunctionalProperty
type: ObjectProperty
comment: Representación CPV del objeto de un contrato. Debe apuntar a un concepto de objeto siguiendo la clasificación CPV de algún esquema de conceptos SKOS, como http://cpv.data.ac.uk/. @es
comment: Property that points to the concept of the CPV code of an object. The concept used should be a valid representation of a CPV code, as it is in http://cpv.data.ac.uk/.
domain: Contract object
label: Principal objeto del contrato @es
range: Concept
backward compatible with: mainObject

Contracting body
type: FunctionalProperty
type: ObjectProperty
domain: Public contract
label: Órgano de contratación @es
range: Organization

Offered price
type: ObjectProperty
label: Precio ofrecido @es
sub property of: Price specification

Date of notice publication
type: FunctionalProperty
type: DatatypeProperty
domain: Notice
label: Fecha de publicación del anuncio @es
range: date
sub property of: Date

Subjective award criterion
type: Class
comment: Clase para especificar los criterios que dependen de una opinion subjetiva. @es
comment: Class used to describe criteria that depend on a subjetive opinion.
label: Criterio de adjudicación subjetivo @es
subclass of: Award criterion

Remedy interposed to
type: DatatypeProperty
domain: Remedy
label: Recurso interpuesto a @es
range: string

Additional object of contract
type: ObjectProperty
comment: Representación CPV del objeto de un contrato. Debe apuntar a un concepto de objeto siguiendo la clasificación CPV de algún esquema de conceptos SKOS, como http://cpv.data.ac.uk/. @es
comment: Property that points to the concept of the CPV code of an object. The concept used should be a valid representation of a CPV code, as it is in http://cpv.data.ac.uk/.
domain: Contract object
label: Objeto adicional del contrato @es
range: Concept
backward compatible with: additionalObject

Price review allowable
type: FunctionalProperty
type: DatatypeProperty
domain: Contract economic conditions
label: Revisión de precios permitida @es
range: boolean

Early tramitation
type: FunctionalProperty
type: DatatypeProperty
domain: Contract procedure
label: Tramitación anticipada @es
range: boolean

Postal address
type: DatatypeProperty
label: Dirección postal @es

Broader
type: ObjectProperty
label: Más amplio @es

Member
type: ObjectProperty
label: Miembro @es

Contract with lots
type: Class
comment: Clase de los contratos dividos en lotes. Cuando un contrato de muy grande, este puede ser dividido en diversos lotes por la entidad contratante. Las empresas presentan las ofertas a estos lotes separadamente (y no al contrato "raíz"), realizándose la adjudicación de la misma manera. @es
comment: Class of the contract that have lots.
label: Contrato con lotes @es
subclass of: Public contract
subclass of: Restriction
  on property: Lote
  some values from: Lot

Concept scheme
type: Class
label: Esquema de conceptos @es

Procedure type scheme
type: Concept scheme
type: NamedIndividual
comment: Scheme defining the procedure to be followed in a tender.
label: Esquema de tipos de procedimiento @es

Execution requeriments
type: DatatypeProperty
comment: Campo para definir las condiciones de ejecución del contrato si las hubiera (e.g. forma jurídica a adoptar por la agrupación de contratistas) @es
comment: Property to define alternative execution requirements (e.g. legal form to be adopted by tenderers).
domain: Contract execution conditions
label: Condiciones de ejecución @es
range: string

Remedy result
type: DatatypeProperty
comment: Contiene el resultado del recurso interpuesto en un contrato. Normalmente el valor de esta propiedad incluirá valores como "Estimado", "Estimado parcialmente" o "Desestimado". @es
comment: Contains the result of a lodged remedy. Normally it would contains values like "Estimated", "Rejected" or "Partially estimated".
domain: Remedy
label: Resultado del recurso @es
range: string

Contract notice
type: Class
label: Anuncio de licitación @es
subclass of: Notice

Legal document reference
type: ObjectProperty
domain: Public contract
label: Pliego de cláusulas administrativas @es
sub property of: Document reference

Information kind scheme
type: Concept scheme
type: NamedIndividual
comment: Scheme that indicates the type of the information that can be provided.
label: Esquema de tipos de información @es

Framework agreement or dynamic purchasing system
type: Class
comment: Clase a utilizar cuando estemos ante un contrato que consiste en la declaración, tanto de un acuerdo marco como de un sistema dinámico de contratación. @es
comment: Class used to describe a contract that is a declaration of a framework agreement or a dynamic purchasing system.
label: Acuerdo marco o Sistema Dinámico de contratación @es

Other guarantee
type: DatatypeProperty
domain: Contract additional obligations
label: Otras garantías @es
range: string

Electronic auction web
type: ObjectProperty
comment: Apunta a la web donde puede se realiza la subasta electrónica, o en su defecto, donde se pueda encontrar más información acerca de la subasta electrónica. @es
comment: Property that indicated where the electronic auction is made or where we can look for more information about the auction.
domain: Electronic auction
label: Web de la subasta electrónica @es
range: Document

Tender briefing
type: ObjectProperty
domain: Public contract
label: Reunión informativa @es
range: Briefing

Negotiated without publicity
type: Concept
type: NamedIndividual
label: Negociado sin publicidad @es
broader: Negotiated
In scheme: Procedure type scheme

Address
type: DatatypeProperty
label: Dirección @es

Tender committee appointment date
type: FunctionalProperty
type: DatatypeProperty
domain: Tender committee
label: Fecha de nombramiento @es
range: date
sub property of: Date

Contract award notice
type: Class
label: Anuncio de adjudicación @es
subclass of: Notice

Procedure type
type: FunctionalProperty
type: ObjectProperty
domain: Contract procedure
label: Tipo de procedimiento @es
range: Concept
range: Restriction
  has value: Procedure type scheme
  on property: In scheme

Full member
type: ObjectProperty
comment: Miembro titular en una mesa de contratación. @es
comment: Points to a full member of a committee.
domain: Tender committee
label: Miembro titular @es
range: Committee member
sub property of: Member

Construction subsidies
type: DatatypeProperty
comment: Descripción de las aportaciones públicas a la construcción. @es
comment: Description of the public subsidies to construction works contracts.
domain: Contract economic conditions
label: Aportaciones públicas @es
range: string

Notice site
type: DatatypeProperty
comment: Esta propiedad se refiere al medio donde ha publicado el anuncio. Habitualmente este será un boletín o diario oficial, por ejemplo, el DOUE, BOE o boletín autonómico correspondiente, pero puede ser que sea publicado en prensa u otros medios. @es
comment: Property that indicates the sire where the notice is published. Normally it would be an official source, like the Official Jounral of the European Union, but it can be anywhere else, like press.
domain: Notice
label: Medio de publicación del anuncio @es
range: string

Technical committee
type: Class
label: Organismo técnico @es
subclass of: Tender committee

Reserved contract restrictions
type: DatatypeProperty
domain: Tenderers requirements
label: Contratos reservados @es
range: string

Tender requirements
type: FunctionalProperty
type: ObjectProperty
domain: Public contract
label: Requisitos para las ofertas @es
range: Tender requirements

Complementary contract
type: ObjectProperty
comment: Relaciona un contrato con otro contrato complementario. @es
comment: Relates a contract with a complementary contract.
domain: Public contract
label: Contrato complementario @es
range: Public contract

Offered end date
type: FunctionalProperty
type: DatatypeProperty
domain: Tender
label: Fecha de finalización ofertada @es
range: date
sub property of: Date

Ordinary administrative remedy
type: Class
label: Recurso administrativo ordinario @es
subclass of: Remedy

Tender
type: Class
label: Oferta de licitación @es

Price
type: ObjectProperty
label: Precio @es
range: Price specification

Criterion name
type: DatatypeProperty
label: Nombre del criterio @es

Simple open
type: Concept
type: NamedIndividual
label: Abierto simple @es
In scheme: Procedure type scheme
Top concept of: Procedure type scheme

Precomercial procurement
type: Class
label: Compra pública pre-comercial @es
subclass of: Public contract

Shared result agreement contract
type: Class
comment: Clase de los contrato en cuya virtud la Administración y el empresario participarán en los resultados de la explotación del servicio en la proporción que se establezca en el contrato. @es
comment: Class describing contracts whose operation results are shared among the contracting authority and the tenderer.
label: Gestión interesada @es
subclass of: Public services management contract

Start date
type: DatatypeProperty
label: Fecha de inicio @es

Criterion evaluation mode
type: DatatypeProperty
comment: Propiedad para describir la forma de valoración del criterio. @es
comment: Property textually describing the criterion evaluarion mode.
domain: Award criterion
label: Forma de evaluación del criterio @es
range: string

Title
type: DatatypeProperty
label: Título @es

Procedure waive
type: Class
label: Renuncia del procedimiento @es
subclass of: Contract or procedure extinction

Concept
type: Class
label: Concepto @es

Procedure void
type: ObjectProperty
label: Procedimiento desierto @es
range: Procedure void
sub property of: Contract or procedure extinction

Award criteria combination
type: ObjectProperty
label: Combinación de criterios para la adjudicación @es

Contracting body agreement
type: Class
label: Acuerdo del órgano de contratación @es

Extinction cause
type: DatatypeProperty
domain: Contract or procedure extinction
label: Causa de extinctión @es
range: string

Notice sent date
type: FunctionalProperty
type: DatatypeProperty
domain: Notice
label: Fecha de envio del anuncio @es
range: date
sub property of: Date

Expected cause modification
type: DatatypeProperty
domain: Contract modification conditions
label: Causas previstas de modificación @es
range: string

Lot
type: ObjectProperty
label: Lote @es

Postal address
type: Class
label: Dirección postal @es

Submitted tender
type: ObjectProperty
label: Oferta presentada @es

Lease contract
type: Class
comment: Clase de los contratos de suministros cuyo objeto es el arrendamiento financiero de bienes. Popularmente conocido como 'renting' en España. @es
comment: Class defining supplies contracts aimed to lease supplies.
label: Arrendamiento financiero @es
subclass of: Supplies contract

Prior information notice
type: Class
label: Anuncio de información previa @es
subclass of: Notice

Street address
type: DatatypeProperty
label: Calle @es

Contract resolution
type: Class
label: Resolución del contrato @es
subclass of: Contract or procedure extinction

Public works concession contract
type: Class
label: Contrato de concesión de obras públicas @es
subclass of: Public contract

Procedure resignation
type: Class
label: Desistimiento del procedimiento @es
subclass of: Contract or procedure extinction

Legal remedy
type: Class
label: Recurso legal @es
subclass of: Remedy

Special administrative contract
type: Class
label: Contrato administrativo especial @es
subclass of: Public contract

Price specification
type: ObjectProperty
label: Especificación del precio @es

Tender committee role
type: FunctionalProperty
type: DatatypeProperty
comment: Indica el cargo que una persona ostenta dentro del comité del contratación. @es
comment: Indicated the role of a person inside the committee.
domain: Committee member
label: Cargo en el comité de contratación @es
range: string

Offering
type: Class
label: Oferta @es

Negotiated with publicity
type: Concept
type: NamedIndividual
label: Negociado con publicidad @es
broader: Negotiated
In scheme: Procedure type scheme

Maximum number of invitations
type: DatatypeProperty
domain: Contract procedure
label: Número máximo de invitaciones @es
range: string

Rent contract
type: Class
comment: Clase de los contratos de suministros cuyo objeto es el alquiler de bienes. @es
comment: Class defining supplies contracts aimed to rent supplies.
label: Contrato de alquiler @es
subclass of: Supplies contract

Actual duration
type: FunctionalProperty
type: DatatypeProperty
domain: Public contract
label: Duración final @es
sub property of: Duration

Administrative information
type: Concept
type: NamedIndividual
label: Información administrativa @es
In scheme: Information kind scheme
Top concept of: Information kind scheme

Contract economic conditions
type: FunctionalProperty
type: ObjectProperty
domain: Contract object
label: Condiciones económicas del contrato @es
range: Contract economic conditions

Actual price
type: ObjectProperty
label: Precio final @es
sub property of: Price

Contract object
type: Class
comment: Clase que define el objeto del contrato y las diferentes condiciones, obligaciones y modificaciones de este. @es
comment: Class that defines the object of the contract and the conditions or modifications the contract can have.
label: Objeto del contato @es

End mode
type: DatatypeProperty
domain: Electronic auction phase
label: Modo de finalización @es
range: string

Organization
type: Class
label: Organización @es

Top concept of
type: ObjectProperty
label: Concepto superior @es

Expert committee
type: Class
label: Comité de expertos @es
subclass of: Tender committee

Document reference
type: ObjectProperty
comment: Enlace a documentación. Propiedad similar a pc:attachment, pero sin dominio fijo, pues esta misma propiedad puede utilizarse con múltiples clases (e.g. pc:Contract ó contsem:TenderMeeting) @es
comment: Links to external documents.
label: Documentación @es
range: Document

Contract activities
type: FunctionalProperty
type: ObjectProperty
domain: Contract procedure
label: Trámites del contrato @es
range: Contract activites

Procedure waive
type: ObjectProperty
label: Renuncia del procedimiento @es
range: Procedure waive
sub property of: Contract or procedure extinction

Electronic auction phase
type: ObjectProperty
domain: Electronic auction
label: Fase de subasta electrónica @es
range: Electronic auction phase

Other ability requisites
type: DatatypeProperty
domain: Tenderers requirements
label: Otros requisitos @es
range: string

Negotiated
type: NamedIndividual
type: Concept
comment: Abstract concept defining the procedure of the contract as negotiated.
label: Negociado @es
In scheme: Procedure type scheme
narrower: Negotiated without publicity
narrower: Negotiated with publicity
Top concept of: Procedure type scheme

Technical document reference
type: ObjectProperty
domain: Public contract
label: Pliego de prescripciones técnicas @es
sub property of: Document reference

Procedure void
type: Class
label: Procedimiento desierto @es
subclass of: Contract or procedure extinction

Variant description
type: DatatypeProperty
comment: Campo para incluir la descripción, alcance, plazo u otros aspectos que están permitidos al presentar variantes en un contrato. @es
comment: Property to describe the allowed variantes when submitting a variant of a contract.
domain: Contract object
label: Descripción de las variantes @es
range: string

Regular
type: Concept
type: NamedIndividual
label: Ordinaria @es
In scheme: Urgency type scheme
Top concept of: Urgency type scheme

Contract without lots
type: Class
comment: Clase de los contratos que no están dividos en lotes. @es
comment: Class to describe the contract not divided into lots.
label: Contrato sin lotes @es
subclass of: Public contract
subclass of: Restriction
  max qualified cardinality: 0
  on class: Lot
  on property: Lote
subclass of: Restriction
  has value: 0
  on property: Number of lots

Framework agreement
type: FunctionalProperty
type: ObjectProperty
comment: Señala al acuerdo marco o sistema dinámico de contratación en el cual consiste el contrato. Esta propiedad se utiliza cuando el actual contrato consista en la declaración de un acuerdo marco o un sistema dinámico de contratación. @es
comment: Property that indicates the framework agreement in which the contract consists. This property is used when the actual contract consist in the declaration of a framework agreement or a dynamic purchasing system.
domain: Public contract
label: Acuerdo marco o sistema dinámico de contratación @es
range: Framework agreement or dynamic purchasing system

Score
type: FunctionalProperty
type: DatatypeProperty
comment: Indica la puntuación que ha recibido un criterio. @es
domain: Criterion score
label: Valoración @es
label: Puntuación @es
range: float

Contract bodies
type: Class
comment: Clase que engloba los órganos relacionados con un contrato (e.g. mesa de contratación ó comité de expertos). @es
comment: Class describing the bodies related to the contract.
label: Órganos del contrato @es

Procedure resignation
type: ObjectProperty
label: Desistimiento del procedimiento @es
range: Procedure resignation
sub property of: Contract or procedure extinction

Location
type: ObjectProperty
label: Lugar @es

Supplier
type: ObjectProperty
label: Proveedor @es

Estimated duration
type: FunctionalProperty
type: DatatypeProperty
domain: Class
  union of: Contract temporal conditions
  union of: Framework agreement or dynamic purchasing system
  union of: Offering
label: Duración estimada @es
sub property of: Duration

Briefing
type: Class
comment: Reunión informativa sobre la licitación del contrato. @es
comment: Informative meeting about the public procurement contract.
label: Reunión informativa @es
subclass of: Event

Modification reason
type: DatatypeProperty
domain: Contract modification
label: Justificación de la modificación @es
range: string

Information provider
type: Class
comment: Proveedor de información sobre la licitación del contrato. @es
comment: Class defining the provider of information about the contract.
label: Proveedor de información @es

Resolution document reference
type: ObjectProperty
domain: Contracting body agreement
label: Resolución @es
sub property of: Document reference

Tender meeting
type: ObjectProperty
domain: Class
  union of: Tender committee
  union of: Contract activites
label: Reunión de la mesa de contratación @es
range: Tender meeting

Date
type: DatatypeProperty
label: Fecha @es

Place of contract's realization
type: ObjectProperty
domain: Contract object
label: Lugar de realización del contrato @es
range: Place
backward compatible with: location

Objective award criterion
type: Class
comment: Clase para definir criterios que dependen de un juicio de valor. @es
comment: Class describing criterioa that depend on a value judgement.
label: Criterio de adjudicación objetivo @es
subclass of: Award criterion

Website with information
type: ObjectProperty
domain: Information provider
label: Web con información @es
range: Document

Criterion weight
type: DatatypeProperty
label: Peso del criterio @es

Alternate member
type: ObjectProperty
comment: Miembro suplente en una mesa de contratación. @es
comment: Points to an alternate member of a committee.
domain: Tender committee
label: Miembro suplente @es
range: Committee member
sub property of: Member

Contract economic conditions
type: Class
comment: Clase que define las condiciones económicas del contrato (e.g. presupuesto ó revisión de precios). @es
comment: Class defining the actual economic conditions of the contract (e.g. budget or the formula that describes the revision of its price).
label: Condiciones económicas del contrato @es

Object of the contract
type: FunctionalProperty
type: ObjectProperty
domain: Public contract
label: Objeto del contrato @es
range: Contract object

Tender submission mode
type: DatatypeProperty
domain: Contract procedure
label: Modalidad de presentación @es
range: string

Tenderers requirements
type: FunctionalProperty
type: ObjectProperty
domain: Public contract
label: Requisitos de los licitadores @es
range: Tenderers requirements

Price percentage change
type: FunctionalProperty
type: DatatypeProperty
comment: El rango en esta propiedad indica un porcentaje, por lo que el rango del número real a utilizar debe estar comprendido entre 0.0 y 100.0. @es
comment: The range of this property must be a percentage (i.e. float between 0.0 and 100.0)
domain: Contract modification
label: Porcentaje de variación sobre el precio @es
range: float

Price specification
type: Class
label: Especificación del precio @es

Name
type: DatatypeProperty
label: Nombre @es

Electronic auction phase
type: Class
comment: Fase de la subasta electrónica de uno o más de los criterios de adjudicación del contrato. @es
comment: Class describing a phase of an electronic auction.
label: Fase de subasta electrónica @es
subclass of: Event

Tender committee
type: Class
comment: Clase abstracta que representa un conjunto de personas en comité y sus roles dentro del esta agrupación. @es
comment: Abstract class describing a set of persons in committee and its roles.
label: Comité de contratación @es

Competitive dialogue
type: Concept
type: NamedIndividual
label: Diálogo competitvo @es
In scheme: Procedure type scheme
Top concept of: Procedure type scheme

Person
type: Class
label: Persona @es

Place
type: Class
label: Lugar @es

Maximum budget change
type: FunctionalProperty
type: DatatypeProperty
comment: El rango en esta propiedad indica un porcentaje, por lo que el rango del número real a utilizar debe estar comprendido entre 0.0 y 100.0. @es
comment: The range of this property must be a percentage (i.e. float between 0.0 and 100.0)
domain: Contract modification conditions
label: Modificación máxima de presupuesto @es
range: float

Minimum subcontracting
type: FunctionalProperty
type: DatatypeProperty
comment: El rango en esta propiedad indica un porcentaje, por lo que el rango del número real a utilizar debe estar comprendido entre 0.0 y 100.0. @es
comment: The range of this property must be a percentage (i.e. float between 0.0 and 100.0)
domain: Contract execution conditions
label: Subcontratación mínima @es
range: float

Urgency type
type: FunctionalProperty
type: ObjectProperty
domain: Contract procedure
label: Tipo de tramitación @es
range: Concept
range: Restriction
  has value: Urgency type scheme
  on property: In scheme

Number of lots
type: FunctionalProperty
type: DatatypeProperty
domain: Public contract
label: Número de lotes @es
range: nonNegativeInteger

Awarded tender
type: Class
comment: Clase para definir las oferta que han sido adjudicadas. @es
comment: Class describing the awarded tenders.
label: Oferta adjudicada @es
subclass of: Tender
backward compatible with: awardedTender

Provisional financial guarantee
type: FunctionalProperty
type: DatatypeProperty
domain: Contract additional obligations
label: Garantía provisional @es
range: string

Contract resolution
type: ObjectProperty
label: Resolución de contrato @es
range: Contract resolution
sub property of: Contract or procedure extinction

Information kind
type: ObjectProperty
comment: Indica el tipo de información que suministra un proveedor de información. Es posible utilizar esta propiedad numerosas veces para indicar diversos tipos de información. @es
comment: Property pointing to the type of the information is provided.
domain: Information provider
label: Tipo de información @es
range: Concept
range: Restriction
  has value: Information kind scheme
  on property: In scheme

Prorogation number expected
type: FunctionalProperty
type: DatatypeProperty
domain: Contract temporal conditions
label: Prórrogas previstas @es
range: nonNegativeInteger

Contract bodies
type: FunctionalProperty
type: ObjectProperty
domain: Contract procedure
label: Órganos del contrato @es
range: Contract bodies

Criterion maximum and minimum score
type: DatatypeProperty
domain: Award criterion
label: Puntuación máxima y mínima del criterio @es
range: string

Minor
type: Concept
type: NamedIndividual
label: Menor @es
In scheme: Procedure type scheme
Top concept of: Procedure type scheme

Concession contract
type: Class
comment: Clase de los contratos en los que el empresario gestionará el servicio a su propio riesgo y ventura. @es
comment: Class of the contracts in which the awarded tenderer manage the public service themselves.
label: Concesión @es
subclass of: Public services management contract

Briefing
type: ObjectProperty
domain: Contract procedure
label: Reunión informativa @es
range: Briefing

Minimum number of invitations
type: DatatypeProperty
domain: Contract procedure
label: Número mínimo de invitaciones @es
range: string

Tender manteinance duration
type: FunctionalProperty
type: DatatypeProperty
domain: Tender requirements
label: Plazo de vigencia de las ofertas @es
sub property of: Duration

Tender meeting
type: Class
comment: Clase para describir las reuniones que la mesa de contratación, comité de expertos u organismos técnicas han realizado. @es
comment: Class describing the meetings of tender committee.
label: Reunión de la mesa de contratación @es
subclass of: Event

In scheme
type: ObjectProperty
label: En esquema @es

Contract modification
type: Class
comment: Durante un contrato se puede dar también la necesidad de modificarlo una vez iniciada su ejecución, para plasmar este tipo de casos se debe utilizar esta clase. @es
comment: During the execution of a contract it could happen that the contract should be modified, to describe these kind of situations we use this class.
label: Modificación del contrato @es

Contract temporal conditions
type: Class
comment: Clase que define las condiciones temporales de un contrato (e.g. plazo ó prórrogas). @es
comment: Class that describes the temporal conditions of the contract.
label: Condiciones temporales del contrato @es

Tender document needs
type: DatatypeProperty
comment: Define la documentación necesaria a presentar en las ofertas. @es
comment: Defines the necessary documentation a tender must include.
domain: Tender requirements
label: Documentación a presentar @es
range: string

Duration change
type: FunctionalProperty
type: DatatypeProperty
domain: Contract modification
label: Variación del plazo @es
range: string

Time-limit for submission of tenders or requests to participate
type: FunctionalProperty
type: DatatypeProperty
domain: Contract procedure
label: Fecha límite para la presentación de ofertas o de peticiones a participar @es
range: dateTime
sub property of: Date

Required economic and financial standing
type: DatatypeProperty
domain: Tenderers requirements
label: Solvencia económica y financiera requerida @es
range: string

Criterion score
type: Class
comment: Clase para valorar individualmente un criterio de adjudicación. Esta formada por una puntuación (contsem:score) y un criterio (contsem:criterion). @es
comment: Class to describe an award criterion and its score.
label: Valoración de criterio @es

Event
type: Class
label: Evento @es

Framework derivative contract
type: Class
comment: Clase de los contratos derivados de un acuerdo marco @es
comment: Class describing contracts derived from a framework agreement.
label: Contrato derivado de un acuerdo marco @es
subclass of: Derivative contract

Final financial guarantee
type: FunctionalProperty
type: DatatypeProperty
comment: El rango en esta propiedad indica un porcentaje, por lo que el rango del número real a utilizar debe estar comprendido entre 0.0 y 100.0. @es
comment: The range of this property must be a percentage (i.e. float between 0.0 and 100.0)
domain: Contract additional obligations
label: Garantía definitiva @es
range: float

Public contract
type: Class
label: Contrato público @es
subclass of: Contract

Buy contract
type: Class
comment: Clase de los contratos de suministros cuyo objeto es la compra de bienes. @es
comment: Class to describe the supplies contracts aimed to buy supplies.
label: Contrato de compra @es
subclass of: Supplies contract

Lot
type: Class
comment: Clase de los contratos que representan un lote perteneciente a otro contrato. @es
comment: Class describing contracts that are an actual lot of another contract.
label: Lote @es
subclass of: Public contract

Estimated value of the contract
type: FunctionalProperty
type: ObjectProperty
domain: Contract economic conditions
label: Valor estimado del contrato @es
range: Bundle price
sub property of: Price
backward compatible with: estimatedPrice

Criterion
type: FunctionalProperty
type: ObjectProperty
domain: Criterion score
label: Criterio @es
range: Award criterion

Delegating authority
type: FunctionalProperty
type: ObjectProperty
comment: Indica la entidad que delega la licitación de este contrato. @es
comment: Points to the authority that is delegating the contract.
domain: Public contract
label: Entidad delegante @es
range: Organization

Works contract
type: Class
label: Contrato de obras @es
subclass of: Public contract

Contract procedure
type: Class
comment: Clase que define las especificaciones del procedimiento de un contrato (e.g. tipo de procedimiento o de tramitación). @es
comment: Class that specifies the procedure of a contract (e.g. type of procedure or its urgency).
label: Procedimiento del contrato @es

Notice web
type: FunctionalProperty
type: ObjectProperty
domain: Notice
label: Web del anuncio @es
range: Document

Offered duration
type: FunctionalProperty
type: DatatypeProperty
domain: Tender
label: Plazo de ejecución ofertado @es
sub property of: Duration

Public services management contract
type: Class
label: Contrato de gestión de servicios públicos @es
subclass of: Public contract

Contract modification conditions
type: Class
comment: Clase que define las condiciones para la modificación de un contrato (e.g. porcentaje máximo de modificación del presupuesto). @es
comment: Class describing the conditions for which a contract can be modified (e.g. maximum percentage of its price or budget).
label: Condiciones para la modificación del contrato @es

Additional document reference
type: ObjectProperty
domain: Public contract
label: Documentación adicional @es
sub property of: Document reference

Notice
type: Class
label: Anuncio @es

Advertisement amount
type: DatatypeProperty
domain: Contract additional obligations
label: Gastos de publicidad @es
range: string

Award agreement
type: ObjectProperty
comment: Indica el acuerdo del órgano de contratación donde se ha adjudicado el contrato a un licitador. @es
comment: Points to the body agreement where a tender has been awarded.
domain: Tender
label: Acuerdo de adjudicación @es
range: Contracting body agreement

Contract activites
type: Class
comment: Clase que engloba todos los trámites de un contrato (e.g. reuniones ó acuerdos del órgano de contratación). @es
comment: Class describing all activities of a contract (e.g. meetings or agreements of the contracting body).
label: Trámites del contrato @es

Is negotiable
type: FunctionalProperty
type: DatatypeProperty
domain: Award criterion
label: Es negociable @es
range: boolean

Other award terms
type: DatatypeProperty
domain: Tender
label: Otras condiciones de la adjudicación @es
range: string

Formalized tender
type: Class
comment: Clase para definir la oferta que se ha formalizado. @es
comment: Class describing tenders being formalized.
label: Oferta formalizada @es
subclass of: Tender
subclass of: Restriction
  on property: Formalized date
  some values from: date

Formalized date
type: FunctionalProperty
type: DatatypeProperty
domain: Tender
label: Fecha de formalización @es
range: date
sub property of: Date

Award criterion
type: Class
label: Criterio de adjudicación @es

Narrower
type: ObjectProperty
label: Más concreto @es

Derivative contract
type: Class
comment: Clase de los contratos derivados de un acuerdo marco o un sistema dinámico de contratación. @es
comment: Class describing contracts derived from a framework agreement or a dynamic purchasing system.
label: Contrato derivado @es
subclass of: Public contract

Remedy
type: ObjectProperty
domain: Public contract
label: Recurso @es
range: Remedy

Correction notice
type: Class
label: Anuncio de corrección @es
subclass of: Notice

Minutes document reference
type: ObjectProperty
domain: Tender meeting
label: Acta @es
sub property of: Document reference

Contract temporal conditions
type: FunctionalProperty
type: ObjectProperty
domain: Contract object
label: Condiciones temporales del contrato @es
range: Contract temporal conditions

Contracting authority
type: ObjectProperty
label: Entidad contratante @es

Final financial guarantee duration
type: FunctionalProperty
type: DatatypeProperty
domain: Contract additional obligations
label: Plazo de la garantía definitiva @es
sub property of: Duration

Address locality
type: DatatypeProperty
label: Localidad @es

Dynamic purchasing system conclusion contract
type: Class
comment: Clase de los contratos que consisten en el establecimiento de un sistema dinámico de contratación. @es
comment: Class describing the contracts consisting in the conclusion of a dynamic purchasing system.
label: Contrato de establecimiento de un sistema dinámico de contratación @es
subclass of: Conclusion contract

Price Review Index
type: DatatypeProperty
domain: Contract economic conditions
label: Fórmula de revisión de precios @es
range: string

Electronic auction
type: Class
comment: Clase para especificar la realización de una subasta electrónica de uno o más criterios de adjudicación. @es
comment: Class that specifies the existence of an electronic auction of one or more of the award criterions.
label: Subasta electrónica @es

Notice
type: ObjectProperty
domain: Class
  union of: Contract activites
  union of: Contract procedure
label: Anuncio @es
range: Notice

Modification scope
type: DatatypeProperty
domain: Contract modification
label: Alcance de la modificación @es
range: string

Award criteria combination
type: Class
label: Combinación de criterios para la adjudicación @es

Contract procedure specifications
type: FunctionalProperty
type: ObjectProperty
domain: Public contract
label: Especificaciones del procedimiento del contrato @es
range: Contract procedure

Services contract
type: Class
label: Contrato de servicios @es
subclass of: Public contract

Required classification
type: DatatypeProperty
domain: Tenderers requirements
label: Clasificación requerida @es
range: string

Multiannual contract
type: Class
comment: Clase de los contrato plurianuales (i.e. contratos cuya duración se extiende durante más de un ejercicio contable). @es
comment: Class describing the multiannual contracts (i.e. contract whose duration extends over more than one financial year).
label: Contrato plurianual @es
subclass of: Public contract

Contracting body agreement
type: ObjectProperty
domain: Class
  union of: Contract activites
  union of: Contract modification
  union of: Contract or procedure extinction
  union of: Contract procedure
label: Acuerdo del órgano de contratación @es
range: Contracting body agreement

Tender submission supported language
type: DatatypeProperty
domain: Tender requirements
label: Idioma admitido en la presentación de oferta @es
range: string

Harmonized contract
type: Class
comment: Clase de los contratos armonizados (i.e. contratos que alcanzan el umbral para actuar conforme a las Directivas del Parlamento Europeo y del Consejo en contratos públicos) @es
comment: Class to describe harmonized contracts (i.e. contracts that reachs the threshold to be treated as highlighted in the procurement Directives of the European Commision and European Council).
label: Contrato armonizado @es
subclass of: Public contract

Criterion score
type: ObjectProperty
comment: Especifica la valoración de un único criterio, por lo que se utilizará una vez por cada criterio de adjudicación presente en el contrato. @es
comment: Property that points to an unique criterion and its score.
domain: Tender
label: Valoración de criterio @es
range: Criterion score

Framework agreement derivative contract
type: InverseFunctionalProperty
type: ObjectProperty
domain: Conclusion contract
label: Contrato derivado de un acuerdo marco @es
range: Derivative contract

Public-private partnership contract
type: Class
label: Contrato de colaboración público-privada @es
subclass of: Public contract

Bundle price
type: Class
comment: Clase que representa el precio de conjuntos de objetos o un paquete determinado. Se utiliza para especificar el precio de la clase gr:Offering cuando este precio se refiere al del conjunto de los objetos (y no a su precio unitario). @es
comment: Class used to describe the price a set of objets. Can be used to define the total price of an gr:Offering. Its value must be equal to the gr:UnitPriceSpecification multiplied by the number of items.
label: Precio de paquete @es
subclass of: Price specification

Dynamic purchasing system derivative contract
type: Class
comment: Clase de los contratos derivados de un sistema dinámico de contratación @es
comment: Class describing contracts derived from a dynamic purchasing system.
label: Contrato derivado de un sistema dinámico de contratación @es
subclass of: Derivative contract

Maximum number of operators
type: FunctionalProperty
type: DatatypeProperty
domain: Framework agreement or dynamic purchasing system
label: Número máximo de participantes @es
range: nonNegativeInteger

On behalf of
type: ObjectProperty
label: En nombre de @es

Formalization notice
type: Class
label: Anuncio de formalización @es
subclass of: Notice

Maximum subcontracting
type: FunctionalProperty
type: DatatypeProperty
comment: El rango en esta propiedad indica un porcentaje, por lo que el rango del número real a utilizar debe estar comprendido entre 0.0 y 100.0. @es
comment: The range of this property must be a percentage (i.e. float between 0.0 and 100.0)
domain: Contract execution conditions
label: Subcontratación máxima @es
range: float

Assumption protecting the chosen procedure type
type: DatatypeProperty
domain: Contract procedure
label: Supuesto que ampara el uso del procedimiento elegido @es
range: string

Item
type: ObjectProperty
comment: Property for attachment of an item to a tender.
domain: Tender
label: Artículo @es
range: Offering
backward compatible with: item

Managing department
type: FunctionalProperty
type: ObjectProperty
comment: Servicio perteneciente a la entidad contratante que se encarga de la publicación y administración de este contrato. @es
comment: Property that indicates the managing departament responsible of the contract.
domain: Public contract
label: Servicio gestor @es
range: Organization

Contract budget price
type: FunctionalProperty
type: ObjectProperty
domain: Contract economic conditions
label: Presupuesto del contrato @es
range: Bundle price
sub property of: Price

Emergency
type: Concept
type: NamedIndividual
label: Emergencia @es
In scheme: Urgency type scheme
Top concept of: Urgency type scheme

Provision
type: ObjectProperty
domain: Contract object
label: Prestación @es
range: Offering
backward compatible with: item

Electronic auction
type: FunctionalProperty
type: ObjectProperty
domain: Contract procedure
label: Subasta electrónica @es
range: Electronic auction

Tenderers requirements
type: Class
comment: Clase que define los requisitos exigidos a los licitadores (e.g. clasificación profesional ó solvencia económica). @es
comment: Class defining the tenderers requirements (e.g. required classification or financial capability).
label: Requisitos de los licitadores @es

Lodged remedy date
type: FunctionalProperty
type: DatatypeProperty
comment: Fecha en la cual se ha interpuesto el recurso ante el órgano oficial. @es
comment: Date where a remedy is lodged.
domain: Remedy
label: Fecha de interposición del recurso @es
range: date
sub property of: Date

Framework conclusion contract
type: Class
comment: Clase de los contratos que consisten en el establecimiento de un acuerdo marco. @es
comment: Class describing the contracts consisting in the conclusion of a framework agreement.
label: Contrato de establecimiento de un acuerdo marco @es
subclass of: Conclusion contract

Variant admission
type: FunctionalProperty
type: DatatypeProperty
domain: Contract object
label: Admisión de variantes @es
range: boolean

Committee member
type: Class
comment: Miembro perteneciente a un comité de contratación concreto. @es
comment: Class that describes the member a committee.
label: Miembro del comité @es
subclass of: Person

Contract modification conditions
type: FunctionalProperty
type: ObjectProperty
domain: Contract object
label: Condiciones para la modificación del contrato @es
range: Contract modification conditions

Award criterion
type: ObjectProperty
label: Criterio de adjudicación @es

Restricted
type: Concept
type: NamedIndividual
label: Restringido @es
In scheme: Procedure type scheme
Top concept of: Procedure type scheme

Required technical and professional ability
type: DatatypeProperty
domain: Tenderers requirements
label: Solvencia técnica y profesional requerida @es
range: string

Express
type: Concept
type: NamedIndividual
label: Urgente @es
In scheme: Urgency type scheme
Top concept of: Urgency type scheme

Document
type: Class
label: Documento @es

public procurement ontology
type: Ontology
comment: Ontología creada con objeto de publicar datos sobre contratación publica española en RDF. Se ha desarrollado durante el transcurso del proyecto "Optimización de la contratación pública mediante la utilización de técnicas semánticas" (CONTSEM), en el que participan la empresa iASoft (OESIA), la Universidad de Zaragoza y, como administraciones usuarias, el Gobierno de Aragón, la Diputación Provincial de Huesca y los ayuntamientos de Zaragoza y Huesca. Financiado por la Acción Estratégica de Telecomunicaciones y Sociedad de la Información. Año 2012. Ministerio de Industria, Comercio y Turismo (TSI-020606-2012-4), y desarrollado entre noviembre de 2012 y diciembre de 2014. @es
label: ontología de contratación pública @es
creator: https://www.linkedin.com/profile/view
creator: profile-investigador
creator: ~seron
creator: 5a8
version info: Changes from 0.1.4 to 1.0.0: - Minor RDF documentation changes - Added new axiom (pproc:ContractWithoutLots rdfs:subClassOf pproc:numberOfLots value 0) - Web documentation changes - Fixed an error where pproc:criterion had pc:AwardCriteriaCombination as range (instead pc:AwardCriterion) - Added missing pproc:additionalObject to link multiple CPVs - Added missing pproc:endMode from pproc:ElectronicAuctionPhase
version info: Cambios de la versión 0.1.4 a la versión 1.0.0: - Cambios menores en la documentación RDF - Añadido nuevo axioma (pproc:ContractWithoutLots rdfs:subClassOf pproc:numberOfLots value 0) - Cambios en la documentación web - Arreglado un error donde pproc:criterion tenía a pc:AwardCriteriaCombination como (en vez de pc:AwardCriterion) - Añadida pproc:additionalObject para enlazar con múltiples CPVs - Añadida pproc:endMode para pproc:ElectronicAuctionPhase @es
version info: 1.0.0

Start date of the tender dossier
type: FunctionalProperty
type: DatatypeProperty
domain: Contract procedure
label: Fecha de la resolución del inicio del expediente de contratación @es
range: date
sub property of: Date

Contract execution conditions
type: FunctionalProperty
type: ObjectProperty
domain: Contract object
label: Condiciones de ejecución del contrato @es
range: Contract execution conditions

Conclusion contract
type: Class
comment: Clase de los contratos que consisten en el establecimiento de un acuerdo marco o un sistema dinámico de contratación. @es
comment: Class describing the contracts consisting in the conclusion of a framework agreement or a dynamic purchasing system.
label: Contrato de establecimiento @es
subclass of: Public contract
subclass of: Restriction
  on property: Framework agreement
  some values from: Framework agreement or dynamic purchasing system
disjoint with: Derivative contract

Private contract
type: Class
label: Contrato privado @es
subclass of: Public contract

Fee
type: FunctionalProperty
type: ObjectProperty
domain: Contract economic conditions
label: Canon @es
range: Bundle price
sub property of: Price

Remedy
type: Class
comment: Recurso interpuesto sobre alguna de las resoluciones del proceso de licitación. @es
comment: Remedy lodged concerning a resolution about the procurement procedure.
label: Recurso @es

Excluded tender
type: Class
comment: Define las ofertas que han sido excluídas del proceso de licitación. @es
comment: Class that defines the tenders excluded from the procurement procedure.
label: Oferta excluída @es
subclass of: Tender

Estimated end date
type: FunctionalProperty
type: DatatypeProperty
domain: Class
  union of: Contract temporal conditions
  union of: Framework agreement or dynamic purchasing system
  union of: Information provider
  union of: Offering
label: Fecha estimada de finalización @es
range: date
sub property of: Date

Tender submission location
type: ObjectProperty
domain: Contract procedure
label: Sede de presentación de las ofertas @es
range: Place

Committee
type: ObjectProperty
domain: Contract bodies
label: Comité @es
range: Tender committee

Compulsory means for execution
type: DatatypeProperty
domain: Tenderers requirements
label: Adscripción de medios @es
range: string

Tender admission meeting
type: ObjectProperty
domain: Contract procedure
label: Reunión sobre admisión de licitadores @es
range: Tender meeting

Actual end date
type: DatatypeProperty
label: Fecha de finalización final @es
sub property of: Date

Remedy reason
type: DatatypeProperty
domain: Remedy
label: Causa del recurso @es
range: string

Tender committee
type: Class
label: Mesa de contratación @es
subclass of: Tender committee

Regular open
type: Concept
type: NamedIndividual
label: Abierto ordinario @es
In scheme: Procedure type scheme
Top concept of: Procedure type scheme

Tender requirements
type: Class
comment: Clase que define los requisitos exigidos a las ofertas a presentar (e.g. plazo o documentación a presentar). @es
comment: Class to define the tender requirements needed to submit a tender (e.g. tender document needs).
label: Requisitos para las ofertas @es

Special administrative remedy
type: Class
label: Recurso administrativo especial @es
subclass of: Remedy

Contract additional obligations
type: FunctionalProperty
type: ObjectProperty
domain: Contract procedure
label: Obligaciones accesorias del contrato @es
range: Contract additional obligations

Contract additional obligations
type: Class
comment: Clase que define las obligaciones accesorias de un contrato (e.g. garantías ó gastos de publicidad). @es
comment: Class describing the additional obligations the contract needs (e.g. guarantees or advertisement costs)
label: Obligaciones accesorias del contrato @es

Accepted tender
type: Class
comment: Clase para definir las ofertas que se han admitido a licitación. @es
comment: Class describing the tenders accepted in the procurement public contract.
label: Oferta admitida @es
subclass of: Tender
disjoint with: Excluded tender

Agreement contract
type: Class
comment: Contrato de los conciertos con persona natural o jurídica que venga realizando prestaciones análogas a las que constituyen el servicio público de que se trate. @es
comment: Class describing the contract concerts with natural or legal person performing similar services at the public service in question.
label: Concierto @es
subclass of: Public services management contract

Supplies contract
type: Class
comment: Clase de los contratos cuyo objeto es la adquisición de suministros. Esta adquisición puede ser bien mediante compra, alquiler o arrendamiento financiero. @es
comment: Class describing contracts whose object is the acquisition of supplies.
label: Contrato de suministros @es
subclass of: Public contract

Technical information
type: Concept
type: NamedIndividual
label: Información técnica @es
In scheme: Information kind scheme
Top concept of: Information kind scheme

Recurrent remedy
type: DatatypeProperty
domain: Remedy
label: Recurso recurrente @es
range: string

Tender purpose
type: DatatypeProperty
comment: Indica, de manera textual, el propósito de la reunión de contratación (e.g. apertura de sobre A) @es
comment: Indicates the purpose of the meeting (e.g. opening of first envelope).
domain: Tender meeting
label: Propósito de la reunión @es
range: string

Minimum number of operators
type: FunctionalProperty
type: DatatypeProperty
domain: Framework agreement or dynamic purchasing system
label: Número mínimo de participantes @es
range: nonNegativeInteger

Mixed contract
type: Class
label: Contrato mixto @es
subclass of: Public contract

Remedy resolution
type: DatatypeProperty
domain: Remedy
label: Resolución del recurso @es
range: string