Proton
type: Ontology
comment: PROTON (Proto Ontology), Extent module
subject: Upper-level ontology with extensions to handle Linked Open Data (LOD)
label: Proton Ontology
creator: Ontotext (Ivan Terziev, Atanas Kiryakov, Kiril Simov, Dimitar Manov, Mariana Damova, Svetoslav Petrov)
rights: Proton ontology is available under the Creative Commons Attribution 3.0 Unported license; see http://creativecommons.org/licenses/by/3.0/. In a nutshell, you are free to copy, distribute and transmit the work; to remix/adapt the work (e.g. to import the ontology and create specializations of its elements), as long as you attribute the work in the manner specified by the author or licensor (but not in any way that suggests that they endorse you or your use of the work). Proper Attribution: Simply include the statement This work is based on Proton ontology, developed by Ontotext and link back to http://www.ontotext.com/proton-ontology
imports: protontop
version info: 3.0

Automatic Teller Machine (ATM)
type: Class
comment: An unattended electronic machine in a public place, connected to a data system and related equipment and activated by a bank customer to obtain cash withdrawals and other banking services.
subclass of: Telecom Facility

Academic journal
type: Class
comment: A journal publishing scientific articles
subclass of: Magazine

Accident
type: Class
subclass of: Event

Account
type: Class
comment: An explicit agreement between agents. Typically, service providers (e.g. banks or ISPs) provide accounts to their customers or users, which are considered account owners. The existence of the account depends on the provider, even though the user owns it in some metaphoric sense. Examples could be bank, ISP, e-Commerce, ICQ, email accounts. The accounts are usually aligned with a sort of contract.
subclass of: Object

Acquirement
type: Class
comment: The event of the acquiring of one organization by another.
subclass of: Event

Activity
type: Class
comment: Each activity is a Happening which involves volition and participants. It has temporal dimension. It is distinguished from Events by the fact that the activity does not trigger change of state and does not have a conceptual end point.
subclass of: Happening

Address
type: Class
comment: Any sort of address, specifying how to locate something somewhere.
subclass of: ContactInformation

Administrative Region
type: Class
comment: Any administrative region. NIMA GNS designators - PCLIX
subclass of: Populated Place

Agricultural Colony
type: Class
comment: A tract of land set aside for agricultural settlement. NIMA GNS designator L.AGRC.
subclass of: Land Region

Agricultural Facility
type: Class
comment: An agricultural facility; a building and/or tract of land used for improving agriculture
subclass of: Facility

Airbase
type: Class
comment: An area used to store supplies, provide barracks for air force personnel, hangars and runways for aircraft, and from which operations are initiated
subclass of: Military Areas

Airline
type: Class
comment: A company providing air transport services.
subclass of: Company

Airplane Engine
type: Class
comment: Engines of airplanes
subclass of: Machine

Airplane Model
type: Class
comment: A concrete model of an airplane which determines the main features of any airplane of this model. For example, Boeing 737, Airbus A330, etc.
subclass of: ProductModel

Airport
type: Class
comment: An airport, including heliports. NIMA GNS designators AIRP, AIRH.
subclass of: Transport Facility

Album
type: Class
comment: An recording of a several songs. Usually from the same singer.
subclass of: Audio Recording

Alcoholic Beverage
type: Class
comment: A type (specific receipe) for a beverage. For instance: Guiness Beer, Absolut Currant, etc.
subclass of: Beverage

American Football League
type: Class
comment: Any American football league
subclass of: Sports League

American Football Team
type: Class
comment: Any American Football Team
subclass of: Team

Amphibian
type: Class
comment: Amphibian denotes animals such as frogs, salamanders, and caecilians, that are ectothermic (or cold-blooded) animals and metamorphose from a juvenile water-breathing form, either to an adult air-breathing form, or to a paedomorph that retains some juvenile characteristics. (Wikipedia)
subclass of: Animal

Amusement Park
type: Class
comment: (ADL FT) Commercially operated enterprises that offer rides, games, and other forms of entertainment. NIMA GNS designator - no equivalents.
subclass of: Recreational Facility

Animal
type: Class
comment: Animals are a major group of multicellular, eukaryotic organisms. Their body plan eventually becomes fixed as they develop. Most animals are motile. (Wikipedia)
subclass of: Living Object

Announcement
type: Class
comment: A formal public statement; "the government made an announcement about the changes in the drug war" ; "a declaration of independence".) WordNet 1.7.1
subclass of: Published Material

Arachnid
type: Class
comment: Arachnid denotes a class of joint-legged invertebrate animals in the subphylum Chelicerata. All arachnids have eight legs, although in some species the front pair may convert to a sensory function. (Wikipedia)
subclass of: Animal

Arch
type: Class
comment: A natural or man-made structure in the form of an arch
subclass of: Land Region

Archaea
type: Class
comment: Archaea (archeon) are a group of single-celled microorganisms without a cell nucleus or any other membrane-bound organelles (Wikipedia)
subclass of: Living Object

Archipelago
type: Class
comment: (ADL FT) Seas or areas in a sea that contain numerous islands; also, the island groups themselves. NIMA GNS designator - no equivalent.
subclass of: Land Region

Arena
type: Class
comment: Any arena
subclass of: Building

Art
type: Class
comment: Art is the product or process of deliberately arranging items (often with symbolic significance) in a way that influences and affects one or more of the senses, emotions, and intellect. Wikipedia.
subclass of: Social Abstraction

Art Performance
type: Class
comment: A specific performance taking place at some moment, somewhere. Quite often starting at 19:00 in the theatre, stadium, etc.
subclass of: Event

Sportsman
type: Class
comment: A profession in the area of art.
subclass of: Profession

Artery
type: Class
comment: Any artery as a part of the body.
subclass of: Body Part

Article
type: Class
comment: A relatively short document published as a part of Resource Collection.
subclass of: Published Material

Artificial Satellite
type: Class
comment: A satellite created by humans
subclass of: Satellite

Asteroid
type: Class
comment: Asteroids are a class of small Solar System bodies in orbit around the Sun. Wikipedia
subclass of: Astronomical Object

Astronomical Object
type: Class
comment: Any object studied by astronomers, (usually quite large natural and inanimate) object that is located in the physical universe and is not on the surface of the Earth. Definition partly derived from OpenCyc 0.7
subclass of: Location

Atoll
type: Class
comment: Any atoll
subclass of: Island

Audio Recording
type: Class
comment: An recording of a piece of music.
subclass of: Musical Composition

Australian Football League
type: Class
comment: Any Australian football league
subclass of: Sports League

Auto Racing League
type: Class
comment: Any Auto Racing league
subclass of: Sports League

Automobile Engine
type: Class
comment: Engines of automobiles
subclass of: Machine

Award
type: Class
comment: Any award. An award is something given to a person or a group of people to recognize excellence in a certain field; a certificate of excellence, for example trophies, titles, medals, badges, etc.
subclass of: Abstract

Bacteria
type: Class
comment: Bacteria is a single-celled, prokaryote microorganisms, typically a few micrometres in length (Wikipedia)
subclass of: Living Object

Band
type: Class
comment: Any band, a group performing music or other activity together.
subclass of: Organization

Bank
type: Class
comment: A company providing financial services like credits, deposits, etc.
comment: A business establishment in which money is kept for saving or commercial purposes or is invested, supplied for loans, or exchanged.
subclass of: Company
subclass of: Building

Barracks
type: Class
comment: A building for lodging military personnel
subclass of: Military Areas

Baseball League
type: Class
comment: Any Baseball league
subclass of: Sports League

Basketball League
type: Class
comment: Any Basketball league
subclass of: Sports League

Basketball Team
type: Class
comment: Any basketball team
subclass of: Team

Battlefield
type: Class
comment: A site of a land battle of historical importance. NIMA GNS designator L.BTL.
subclass of: Historic Place

Bay
type: Class
comment: (ADL FT) Indentations of a coastline or shoreline enclosing a part of a body of water; bodies of water partly surrounded by land. We use this category for bahias; for coves; and for embayments. NIMA GNS designators BAY, BAYS.
subclass of: Water Region

Beach
type: Class
comment: (ADL FT) Sloping shores along a body of water that is washed by waves or tides and is usually covered by sand or gravel. ... We use this category for sandy areas; and for strands. NIMA GNS designator BCH, BCHS.
subclass of: Land Region

Beacon
type: Class
comment: A fixed artificial navigation mark
subclass of: Facility

Beverage
type: Class
comment: Any liquid suitable for drinking (WordNet, 1.7). The instances of this class are types of drinks, specific receipts. For instance: Diet Coke, Bacardi Spice.
subclass of: Chemical Compound

Bight
type: Class
comment: An open body of water forming a slight recession in a coastline
subclass of: Land Region

Biogeographic Region
type: Class
comment: (ADL FT) Geographic regions characterized chiefly by the dominant forms of plant life and the prevailing climate. [Adapted from American Heritage Dict. of the English Language, 4th ed.] We use this category for biomes; for ecoregions; and for vegetation. Omitted ADL sub-classes: Barren lands, Grasslands, Habitats, Snow Regions, Wetlands. NIMA GNS designator - no equivalent. Some correspondence to class Hypsographic Features.
subclass of: Land Region

Biological Database
type: Class
comment: A database containing information about biological entities.
subclass of: Database

Biological Substance
type: Class
comment: Any substance or element that has biological nature or origine.
subclass of: Object

Bird
type: Class
comment: Bird denotes feathered, winged, bipedal, endothermic (warm-blooded), egg-laying, vertebrate animals. (Wikipedia)
subclass of: Animal

Board Meeting
type: Class
comment: A meeting whose main participants are members of a board.
subclass of: Meeting

Body Part
type: Class
comment: Any part of the body of any living entity
subclass of: Object

Bog
type: Class
comment: http://www.eionet.europa.eu/gemet/concept?ns=1&cp=12161. NIMA GNS designator H.BOG.
subclass of: Water Region

Bone
type: Class
comment: Any bone as a part of the body.
subclass of: Body Part

Book
type: Class
comment: A relatively large published document. It may or may not have chapters. There could be series of books considered as volumes of a single one.
subclass of: Published Material

Boxing League
type: Class
comment: Any Boxing league
subclass of: Sports League

Brain
type: Class
comment: Any brain as a part of the body.
subclass of: Body Part

Brand
type: Class
comment: The American Marketing Association defines a brand as a "Name, term, design, symbol, or any other feature that identifies one seller's good or service as distinct from those of other sellers." Wikipedia. Examples: Dodge and Milka
subclass of: Object

Breakwater
type: Class
comment: A structure erected to break the force of waves at the entrance to a harbor or port
subclass of: Facility

Bridge
type: Class
comment: (ADL FT) Structures erected over a depression or obstacle to carry traffic. [USGS Circ 1048] We use this category for covered bridges; for drawbridges; for overpasses; for trestles; and for viaducts. NIMA GNS designator BDG, BDGQ.
subclass of: Transport Facility

Broadcast network
type: Class
comment: A broadcast network is an organization, such as a corporation or other voluntary association, that provides live television or recorded content, such as movies, newscasts, sports, Public affairs programming, and other television programs for broadcast over a group of radio stations or television stations. Wikipedia
subclass of: Broadcaster

Broadcaster
type: Class
comment: A company that broadcasts audio or video content to a dispersed audience via any audio visual medium. Wikipedia
subclass of: Media Company

Building
type: Class
comment: (ADL FT) Permanent constructions that are roofed and usually walled. [USGS Circ 1048] We use this category for administrative facilities; for administrative facilities; for animal pounds; for animal shelters; for aquariums; for barns; for border posts; for cabins; for castles; for city halls; for civic centers; for civil buildings; for club houses; for coast guard stations; for commissaries; for community centers; for community houses; for conference facilities; for consulates; for convention centers; for customs houses; for customs posts; for depots; for embassy buildings; for exhibition buildings; for facilities; for facility centers; for fire stations; for firehouses; for forest stations; for government buildings; for guard stations; for halls; for headquarters; for hostels; for hotels; for houses; for inns; for inspection stations; for legation buildings; for lodges; for missions; for motels; for neighborhood centers; for offices; for park headquarters; for patrol posts; for pavilions; for planetariums; for plazas; for police posts; for public buildings; for ranger stations; for restaurants; for shelters; for shops; for stations; for structures; for student unions; for studios; for substations; for taverns; for town halls; for trading posts; for treatment plants; for United States Government establishments; for visitor centers; for walls; and for warehouses NIMA GNS designator BLDG.
subclass of: Facility

Bush
type: Class
comment: A small clump of conspicuous bushes in an otherwise bare area
subclass of: Biogeographic Region

Business Abstraction
type: Class
comment: An abstraction related to business.
subclass of: Abstract

Calendar Month
type: Class
comment: A specific month of the year, such as: Jan., Feb., etc.
subclass of: Temporal Abstraction

Calendar Year
type: Class
comment: A specific year, such as 2000, taken as a time interval
subclass of: TimeInterval

Camp
type: Class
comment: (ADL FT) Designated areas on which primitive structure(s) are erected for temporary shelter or where recreational vehicles are temporarily parked. [USGS Circ 1048] We use this category for campgrounds; for camping sites; for logging camps; for oil camps; for refugee camps; for RV parks; and for trailer parks (recreational). NIMA GNS designators CMP, CMPL, CMPLA, CMPO, CMPQ, CMPRF.
subclass of: Recreational Facility

Canadian Football League
type: Class
comment: Any Canadian Football league
subclass of: Sports League

Canadian Football Team
type: Class
comment: Any Canadian Football Team
subclass of: Team

Canal
type: Class
comment: (ADL FT) Artificial waterways with no flow or a controlled flow used for navigation (canal), or for draining or irrigating land (ditch). We use this category for canal bends; for canalized streams; for ditch mouths; for ditches; for drainage canals; for drainage ditches; for drains (channels); for flumes (manmade); for irrigation canals; for irrigation ditches; for irrigation systems; for laterals; for navigation canals; and for underground irrigation canals. NIMA GNS designators CNL,CNLA, CNLB, CNLD, CNLI, CNLN, CNLQ, CNLSB, CNLX.
subclass of: Water Region
subclass of: Hydrographic Structure

Canyon
type: Class
comment: (ADL FT) Relatively narrow, deep depressions with steep sides, the bottom of which generally has a continuous slope ... We use this category for barrancas; for chasms; for flumes (natural); for gorges; for gulches; for quebradas; and for ravines. NIMA GNS designator CNSU, CNYN, CNYU, GRGE, RAVU, RVN.
subclass of: Valley

Cape
type: Class
comment: (ADL FT) Projection of land extending into a body of water that prominently marks a change in or interrupts the coastal trend of that water body. We use this category for headlands; for peninsulas; for points (physiographic); and for promontories. NIMA GNS designator CAPE, HDLD, PROM.
subclass of: Land Region

Capital
type: Class
comment: (ADL FT) Towns or cities that are the official seats of government in a political entity, such as a state or nation. [American Heritage Dic. of the English Language, 4th ed.] We use this category for county seats; for national capitals; and for state capitals. NIMA GNS designators PPLC, PPLA
subclass of: City

Car
type: Class
comment: Any automoabile car.
subclass of: Vehicle

Car Model
type: Class
comment: A concrete model of a car which determines the main features of any car of this model. For example, Ford-T or BMW Z3.
subclass of: ProductModel

Cave
type: Class
comment: (ADL FT) Natural underground passageways or chambers, or hollowed out cavities in the side of a cliff. ... We use this category for cave entrances; for caverns; for grottoes; for natural tunnels; and for underground lakes. NIMA GNS designator CAVE.
subclass of: Land Region

Celebrity
type: Class
comment: The situation of holding a position in a society as celebrity.
subclass of: SocialPosition

Celebrity
type: Class
comment: The social function of celebrity, a status of notoriety in the society.
subclass of: Social Function

Channel
type: Class
comment: (ADL FT) (a) Relatively narrow seas or stretches of water between two close landmasses and connecting two larger bodies of water; (b) Deeper parts of a moving body of water (as bays, estuaries, or straits) through which the main current flows or which affords the best passage through an area otherwise too shallow to navigate. ... We use this category for chutes (hydrographic); for cutoffs (hydrographic); for inlets; for lake channels; for marine channels; for narrows (hydrographic); for navigation channels; for reaches (hydrographic); for sounds (bodies of water); and for straits. NIMA GNS designators CHN, CHNL, CHNM, CHNN, STRT.
subclass of: Canal

Charity
type: Class
comment: Any Charity, an organization involved in the practice of benevolent giving and caring. (Wikipedia)
subclass of: Non-Orofit Organisation

Chemical Compound
type: Class
comment: A specific chemical compound, such as H2O or Zarin.
subclass of: ProductModel
subclass of: Chemical substance

Chemical element
type: Class
comment: A chemical element is a pure chemical substance consisting of one type of atom distinguished by its atomic number, which is the number of protons in its nucleus. Wikipedia
subclass of: Chemical substance

Chemical substance
type: Class
comment: Any substance or element that has chemical nature.
subclass of: Object

City
type: Class
comment: (ADL FT) For smaller, less formally established communities, use 'populated places'. For independent cities, use 'countries, 2nd order divisions. Incorporated populated places. [Adapted from USGS Circ 1048] We use this category for municipalities; for towns; and for urban areas. NIMA GNS designator PPL.
subclass of: Settlement

Cleric
type: Class
comment: The situation of holding a position in society as cleric.
subclass of: SocialPosition

Cleric
type: Class
comment: The social function of a cleric, involving the church.
subclass of: Social Function

Coast
type: Class
comment: (ADL FT: Coastal Zones) Strips of land (of indefinite width) that extend from the low-tide line inland to the first major change in landform features. [Adapted from Glossary of Geology, 4th ed.] We use this category for coastal plains; for coasts; for intertidal zones; for offshore areas; for shorelines; and for shores. NIMA GNS designators CST, SHOR.
subclass of: Land Region

Coconut grove
type: Class
comment: A planting of coconut trees
subclass of: Biogeographic Region

College
type: Class
comment: College
comment: An education organization between the school and the university. In some cases it is a part of university.
subclass of: Educational Organization

Colour
type: Class
comment: Any colour, a visual perceptual property, e.g. red, blue, yellow, etc. (Wikipedia)
subclass of: Abstract

Comics character
type: Class
comment: A character from a comics.
subclass of: Fictional Character

Commercial Organization
type: Class
comment: Organization that buys or sells goods or services for a profit. It may also be a Business or it may merely be a sub-organization of a Business entity.
subclass of: Organization

Company
type: Class
comment: A private, legal, corporate entity with the legal rights to own property, manage itself, and sue or be sued. It is established by a charter or registration granted by the government.
subclass of: Commercial Organization

Concert
type: Class
comment: An art performance consisting of playing music.
subclass of: Art Performance

Confluence
type: Class
comment: in geography, describes the meeting of two or more bodies of water. The opposite of a watershed. NIMA GNS designator H.CNFL.
subclass of: Water Region

Continent
type: Class
comment: (ADL FT) Earth's major land masses, including both dry land and continental shelves. NIMA GNS designator - no equivalent.
subclass of: Populated Place
subclass of: Land Region

Shelf
type: Class
comment: A zone adjacent to a continent (or around an island) that extends from the low water line to a depth at which there is usually a marked increase of slope towards oceanic depths
subclass of: Land Region

Contract
type: Class
comment: Any sort of contract or treaty, as well, as other documents signed or otherwise accepted by more than one agent.
subclass of: Document

Country
type: Class
comment: (ADL FTT) Territory occupied by a large group of people organized under a single, usually independent government, and recognized internationally as a country. [Adapted from American Heritage Dic. of the English Language, 4th ed.] We use this category for nations; and for republics. NIMA GNS designators PCL, PCLD, PCLF, PCLI, PCLS. FIPS 10-4 is applicable, difining: Basic geopolitical entities assigned country codes include the following categories: (a) independent states; (b) dependent areas; (c) areas of quasi-independence, non-contiguous territories, possessions without populations, areas with special sovereignty associations, areas without sovereignty; (d) political regimes not recognized by the United States; and (e) outlying areas of the United States. The list of basic entities provides complete coverage of the land areas of the world without overlap or duplication.
subclass of: Populated Place
subclass of: Political Region

Country Capital
type: Class
comment: A capital of a Country. NIMA GNS designator PPLC.
subclass of: Capital

County
type: Class
comment: (ADL FT: Countries, 2nd order divisions) Second-order divisions of a nation such as parishes, boroughs, counties, municipios, or judicial divisions, and independent cities such as those in Maryland, Missouri, Nevada, and Virginia. [Adapted from USGS Circ 1048] We use this category for boroughs; for counties; for judicial divisions; for municipios; for parishes; and for second-order administrative divisions. NIMA GNS designator ADM2.
subclass of: Populated Place
subclass of: Political Region

Cove
type: Class
comment: a small type of bay or coastal inlet. http://www.eionet.europa.eu/gemet/concept/10142 NIMA GNS designator H.COVE.
subclass of: Bay

Crater
type: Class
comment: (ADL FT) Circular-shaped depressions at the summit of a volcanic core or on the surface of the land caused by the impact of a meteorite; man-made depressions caused by an explosion. ... We use this category for calderas. NIMA GNS designator CRTR, CLDA.
subclass of: Land Region

Creek
type: Class
comment: (ADL FT: Guts) Relatively small coastal waterways connecting larger bodies of water or other waterways. NIMA GNS designator CRKT, INLT.
subclass of: Water Region

Cricket League
type: Class
comment: Any Cricket league
subclass of: Sports League

Crustacean
type: Class
comment: Crustaceans denotes a group of arthropods animals, which includes crabs, lobsters, crayfish, shrimp, krill and barnacles. (Wikipedia)
subclass of: Animal

Cultivated area
type: Class
comment: An area under cultivation
subclass of: Biogeographic Region

Curling League
type: Class
comment: Any Curling league
subclass of: Sports League

Currency
type: Class
comment: Specific currency, usually national
subclass of: Object

Data Schema
type: Class
comment: A particular notation for representation, standardization, and/or structuring of infomation. It can range from db schema, through ontology, to any sort of taxonomies, nomenclatures and subject hierarchies. Examples are Dublin Core, KIMO, SIC, XML, RDFS
subclass of: InformationResource

Database
type: Class
comment: A dataset loaded in a system supporting search, update and other operations over the information in the dataset.
subclass of: Dataset

Dataset
type: Class
comment: A dataset is information encoded in a defined structure (for example, lists, tables, and databases), intended to be useful for direct machine processing (DCMI Type.) Somehow structured and interrelated body of information, data, or knowledge. This includes databases, knowledge bases, catalogues, registries, specific lists, etc. All tangible aspects (like media or host) are irrelevant for this class - it only considers the abstract information. What can be considered as a single document is outside the scope of this class, although it can be comprehensive in terms of size and structure.
subclass of: InformationResource

Date
type: Class
comment: A specific date, as 12th of April, 1956, as the time period (the 24 hours of the day)
subclass of: TimeInterval

Day of Month
type: Class
comment: A specific day of a given month. The days are numbered from 1 to 28, 29, 30, or 31 depending on the month and the year.
subclass of: Temporal Abstraction

Day of Week
type: Class
comment: A specific day of the week. The week has seven days: Monday, Tuesday, Wednesday, Thursday, Friday, Saturday, and Sunday.
subclass of: Temporal Abstraction

Daytime
type: Class
comment: Specific time (point) during the day, when the day is not specified. Like in "the supermarket is closing 20:30 p.m."
subclass of: Temporal Abstraction

Death
type: Class
comment: The event to die.
subclass of: Event

Delta of a River
type: Class
comment: (ADL FT) Flat plains formed by alluvial deposits at the mouth of a stream. NIMA GNS designator DLTA.
label: Delta
subclass of: Land Region

Desert
type: Class
comment: (ADL FT) Regions rendered barren or partially barren by environmental extremes, especially by low rainfall. [USGS Circ 1048] We use this category for arid regions; for bajadas; for rock deserts; for sandy areas; for sandy deserts; and for stony deserts. NIMA GNS designators DSRT, ERG, HMDA, REG.
subclass of: Biogeographic Region

Disease
type: Class
comment: A specific sort of desease, such as AIDS, SARS, Parcinson, etc. The instances of those class can often by considered as terms instead of entities, but in all cases, those are the general phenomena, not the particular situations when somebody is suffering the disease.
subclass of: Event

Ditch
type: Class
comment: A ditch is usually defined as a small to moderate depression created to channel water.(Wikipedia). http://www.eionet.europa.eu/gemet/concept/2276. NIMA GNS designators H.DTCH, H.DTCHD, H.DTCHI, H.DTCHM.
subclass of: Hydrographic Structure
subclass of: Canal

Division
type: Class
comment: Branch, division, department, laboratory, etc. within an organisation. Usually, not a legal agent and not independent.
subclass of: Organization

Drainage Basin
type: Class
comment: An area drained by a stream. NIMA GNS designator L.BSND.
subclass of: Land Region

Drug
type: Class
comment: A chemical substance used to improve the health condition of a person, animal, etc. For example, Aspirin, Viagra, etc.
subclass of: Chemical Compound

E-mail
type: Class
comment: An identifier that determines a electronic mail box.
subclass of: Internet Address

Educational Organization
type: Class
comment: An organization devoted to teaching activities.
subclass of: Organization

Election
type: Class
comment: Generic concept of Election which is normally held at regular periods of time, president elections of the US, municipal elections, etc..
subclass of: Recurring Event

Election
type: Class
comment: Election happening at a particular date.
subclass of: Event

Map
type: Class
comment: A webpage of a map
subclass of: Document

Embryo Body Part
type: Class
comment: Embryology is a science that studies the development of the embryo. This class denotes different composing substances/elements of the embryo and related body parts, and hence is referred to as a body part. It is inspired form DBPedia Embryology/AnatomicalStructure, which has instances as Blastocyst, Amniotic cavity, Vitelline membrane, etc.
subclass of: Body Part

Entertainment Company
type: Class
comment: Any Entertainment Company, a company involved in the entertainment business, e.g. Warner Brothers, MTV, Lido, etc.
subclass of: Company

Estuary
type: Class
comment: A partly enclosed coastal body of water with one or more rivers or streams flowing into it, and with a free connection to the open sea. NIMA GNS designator H.ESTY.
subclass of: Water Region

Ethnic Group
type: Class
comment: Any ethnic group. A group of people whose members identify with each other, through a common heritage, often consisting of a common language, a common culture (often including a shared religion) and an ideology that stresses common ancestry or endogamy. (Wikipedia).
subclass of: Group

Former Inlet
type: Class
comment: An inlet which has been filled in, or blocked by deposits
subclass of: Water Region

Facility
type: Class
comment: (ADL FT: Manmade Features, no def) Any regions and locations determined artificially, as a result of human activity. Many of the ADL sub-classes are omitted. NIMA GNS - no direct equivalent, although many sub-types are defined as classes (S, R) and designators.
subclass of: Location

Fax Number
type: Class
comment: A phone number connected to a fax machine.
subclass of: Phone Number

Festival
type: Class
comment: Any widely recognized festival or holiday, such as, Christmas or St. Valentine's Day.
subclass of: Recurring Event

Festival Held at a Particular Time
type: Class
comment: An occurrence of a Festival or holiday, Sofia Film Festival 2011, Christmas of 2010 or St. Valentine's Day of 2011.
subclass of: Event

Fictional Character
type: Class
comment: The characters in fictional artwork like movies, books, etc
subclass of: Person

Field Hockey League
type: Class
comment: Any Field Hockey league
subclass of: Sports League

Film Festival
type: Class
comment: Any festival involving showing a film.
subclass of: Festival

Fish
type: Class
comment: A fish is any gill-bearing aquatic vertebrate (or craniate) animal that lacks limbs with digits. (Wikipedia)
subclass of: Animal

Fishing Area
type: Class
comment: A bank or area where fishermen go to catch fish. NIMA GNS designator H.FISH.
subclass of: Water Region

Fjord
type: Class
comment: (ADL FT) Long narrow glacially-eroded inlets of the sea, U-shaped and steep-walled, generally several hundred meters deep, between high rocky cliffs or slopes along a mountainous coast. ... We use this category for fiords; and for lochs. NIMA GNS designator FJD, FJDS.
subclass of: Bay

Flowering plant
type: Class
comment: Any flowering plant
subclass of: Plant

Food
type: Class
comment: Food is any eatable or drinkable substance that is normally consumed by humans. DBPedia
subclass of: Object

Football match
type: Class
comment: Any instance of a soccer match.
subclass of: Sport Game

Forest
type: Class
comment: (ADL FT) Dense growths of trees, plants, and underbrush covering a large area. [American Heritage Dic. of the English Language, 4th ed.] We use this category for forest reserves; and for national forests. Omitted ADL sub-classes: Petrified forests, Rain forests, Woods (the sub-classes collapsed here). NIMA GNS designator FRST, FRSTF, GDVC, GRVO, GRVP, GRVPN, TREE.
subclass of: Biogeographic Region

Clearing
type: Class
comment: An area in a forest with trees removed. NIMA GNS designator L.CLG.
subclass of: Biogeographic Region

Fungus
type: Class
comment: Fungus is a member of a large group of eukaryotic organisms that includes microorganisms such as yeasts and molds (Wikipedia)
subclass of: Living Object

Galaxy
type: Class
comment: A galaxy is a massive, gravitationally bound system that consists of stars and stellar remnants, an interstellar medium of gas and dust, and an important but poorly understood component tentatively dubbed dark matter. Wikipedia
subclass of: Astronomical Object

Game
type: Class
comment: Game. Activity involving participants usually divided in teams, which obeys particualr rules, and has often a winner.
subclass of: Activity

Gap
type: Class
comment: (ADL FT) Ravines or gorges cut deeply through mountain ridges, or between hills or mountains. We use this category for cols; for defiles; for passes; for saddles (physiographic); and for sills (physiographic). NIMA GNS designator GAP, GAPU, GAPF, PASS, SILL, SILU.
subclass of: Land Region

Gene
type: Class
comment: A gene is a molecular unit of heredity of a living organism. Wikipedia
subclass of: Biological Substance

Genre
type: Class
comment: Any Genre. Denotes any category of literature as well as various other forms of art or culture, e.g., music, based on some loose set of stylistic criteria. Genres are formed by conventions that change over time as new genres are invented and the use of old ones are discontinued. (Wikipedia)
subclass of: Abstract

Geographic Region
type: Class
comment: Any Geographic Region with lattitude and longitude coordinates
subclass of: Location

Geopolitical Organisation
type: Class
comment: Any geopolitical organization, an organization based on geo-political principles.
subclass of: Organization

Geyser
type: Class
comment: A spring characterized by intermittent discharge of water ejected turbulently and accompanied by a vapour phase (steam). NIMA GNS designator H.GYSR.
subclass of: Spring

Glacier
type: Class
comment: A mass of ice, usually at high latitudes or high elevations, with sufficient thickness to flow away from the source area in lobes, tongues, or masses
subclass of: Land Region

Global Region
type: Class
comment: Things like Southeastern Europe, Middle East, Oceania are global regions
subclass of: Location

Golf League
type: Class
comment: Any Golf league
subclass of: Sports League

Government
type: Class
comment: The governmental cabinet
comment: The government of a country.
subclass of: Government Organization

Government
type: Class
comment: The governmental cabinet
comment: A government agency is a permanent or semi-permanent organization in the machinery of government that is responsible for the oversight and administration of specific functions, such as an intelligence agency. DBPedia
subclass of: Government Organization

Government Building
type: Class
comment: A government building, a building which serves the government, or where government officials work.
subclass of: Building

Government Organization
type: Class
comment: The government of a country, i.e. the authorized country administration, without account for a specific government elected and being in power for some period. This notion of government groups all the administration, including any sort of ministries, agencies, commissions, etc.
subclass of: Organization

Grape
type: Class
comment: Any grape
subclass of: Flowering plant

Grassland
type: Class
comment: An area dominated by grass vegetation
subclass of: Biogeographic Region

Gulf
type: Class
comment: (ADL FT) Largest of various forms of inlets of the sea; usually larger, more enclosed, and more deeply indented than bays. NIMA GNS designator GULF.
subclass of: Bay

Tablemount
type: Class
comment: A seamount having a comparatively smooth, flat top
label: Guyot
subclass of: Land Region

Handball League
type: Class
comment: Any Handball league
subclass of: Sports League

Harbor
type: Class
comment: (ADL FT) Sheltered areas of water where ships or other watercraft can anchor or dock. We use this category for anchorages; for anclajes; for boat yards; for boatyards; for dock yards; for docking basins; for dockyards; for dry docks; for harbors; for marine terminals; for moorings; for ports; for roadsteads (anchorages); and for turning basins. The following sub-classes included (i.e. not-distinguishable): Marinas, Piers. NIMA GNS designators HBR, HBRX, MAR, BTYD, PIER, DCK, DCKB, DCKY, PRT, AIRS.
subclass of: Water Region
subclass of: Hydrographic Structure

Heath
type: Class
comment: An upland moor or sandy area dominated by low shrubby vegetation including heather
subclass of: Biogeographic Region

Historic Building
type: Class
comment: Any Historic Building, an old building with historic value.
subclass of: Building

Historic Place
type: Class
comment: Any Historic Place, an old place with historic value.
subclass of: Location of Special Interest

Hockey Team
type: Class
comment: Any Hockey team
subclass of: Team

Holiday
type: Class
comment: A Holiday is a day designated as having special significance for which individuals, a government, or a religious group have deemed that observance is warranted. Wikipedia
subclass of: Date

Home Page
type: Class
comment: The web page address of a page that is considered main for a web cite.
subclass of: Web Page

Hospital
type: Class
comment: Any Hospital, a building which is a hospital.
subclass of: Building

Hotel
type: Class
comment: A hotel is an establishment that provides paid lodging on a short-term basis. Wikipedia
subclass of: Building

Human
type: Class
comment: Human is a mammal referred to Primate. Also of the sort of hommo sapiens. It has two subClasses: Man and Woman.
subclass of: Mammal

Hydrographic Structure
type: Class
comment: (ADL FT) For constructed bodies of water. For natural water bodies, use 'hydrographic features'. We use this category for boat landings; for boat launches; for boat ramps; for sluices; and for water mills. Many sub-classes omitted; those considered are also made sub-classes of WaterRegion. NIMA GNS ... no direct equivalent.
subclass of: Facility

IP Address
type: Class
comment: An Internet Protocol address (IP address) is a numerical label assigned to each device (e.g., computer, printer) participating in a computer network that uses the Internet Protocol for communication. Wikipedia
subclass of: Internet Address

ISBN
type: DatatypeProperty
comment: The ISBN (International Standard Book Number) is a unique machine-readable identification number, which marks any book unmistakably.
domain: Book
sub property of: informationResourceIdentifier

ISSN
type: DatatypeProperty
comment: The ISSN (International Standard Serial Number) is an eight-digit number which identifies periodical publications as such, including electronic serials. More than one million ISSN numbers have so far been assigned.
domain: Periodical Publication
sub property of: informationResourceIdentifier

Ice Hockey League
type: Class
comment: Any Ice Hockey league
subclass of: Sports League

Icecap
type: Class
comment: A dome-shaped mass of glacial ice covering an area of mountain summits or other high lands; smaller than an ice sheet
subclass of: Land Region

Ideology
type: Class
comment: An ideology is a set of ideas that constitute one's goals, expectations, and actions. Wikipedia.
subclass of: Social Abstraction

Industry Sector
type: Class
comment: A classification of companies that have similar production processes, similar products, etc.
subclass of: Business Abstraction

Inline Hockey League
type: Class
comment: Any Inline Hockey league
subclass of: Sports League

Insect
type: Class
comment: Insects are a class within the arthropods that have a chitinous exoskeleton, a three-part body (head, thorax, and abdomen), three pairs of jointed legs, compound eyes, and two antennae. (Wikipedia)
subclass of: Animal

Institute
type: Class
comment: A research organization devoted primarily on search in some scientific research.
subclass of: Research Organization

Insurance Company
type: Class
comment: A company providing insurance services agains different dangerous or risky events.
subclass of: Company

International Organization
type: Class
comment: Legal international organization. Legal in this case means officially recognized by more than one government.
subclass of: Organization

Internet Address
type: Class
comment: An identifier that determines a resource on the Internet.
subclass of: Address

Internet Domain
type: Class
comment: A domain name is an identification string that defines the area of administrative autonomy, authority, or control in the Internet. Wikipedia.
subclass of: Internet Address

Irrigation System
type: Class
comment: A network of ditches and one or more of the following elements: water supply, reservoir, canal, pump, well, drain, etc. NIMA GNS designator H.SYSI.
subclass of: Water Region

Island
type: Class
comment: (ADL FT) Tracts of land smaller than a continent, surrounded by the water of an ocean, sea, lake or stream. [Glossary of Geology, 4th ed.] We use this category for atolls; for cays; for island arcs; for isles; for islets; for keys (islands); for land-tied islands; and for mangrove islands. NIMA GNS designator ISL, ISLF, ISLM, ISLS, ISLT, ISLX
subclass of: Land Region

Issue of Periodical
type: Class
comment: A specific issue, number, and/or volume of periodical publication such as magazine.
subclass of: Published Material

Isthmus
type: Class
comment: (ADL FT) Narrow sections of land in a body of water connecting two larger land areas. NIMA GNS designator ISTH.
subclass of: Land Region

Job Title
type: Class
comment: The name of a position a person holds within an organization.
subclass of: Social Function

Jungle
type: Class
comment: (ADL FT) Tropical regions of wild, tangled, dense vegetation. NIMA GNS designator - no equivalent.
subclass of: Biogeographic Region

Lacrosse League
type: Class
comment: Any Lacrosse league
subclass of: Sports League

Lagoon
type: Class
comment: A body of water cut off from the open sea by coral reefs or sand bars. http://www.eionet.europa.eu/gemet/concept/4589. NIMA GNS designator H.LGN, H.LGNS, H.LGNX.
subclass of: Water Region

Lake
type: Class
comment: (ADL FT) Use 'reservoirs' for human engineered lakes. Natural inland bodies of standing water, generally of appreciable size, occupying a depression in the Earth's surface. [Adapted from Glossary of Geology, 4th ed.] We use this category for beaver ponds; for crater lakes; for dry lakes; for fish ponds; for fishponds; for inland seas; for intermittent lakes; for intermittent oxbow lakes; for intermittent ponds; for intermittent pools; for intermittent salt lakes; for intermittent salt ponds; for lagoons; for laguna; for lake beds; for lochs; for millponds; for oxbow lakes; for ponds; for pools (water bodies); for salt evaporation ponds; for salt lakes; for salt ponds; and for tarns. NIMA GNS designators LBED, LK, LKC, LKI, LKN, LKNI, LKO, LKOI, LKS, LKSB, LKSC, LKSI, LKSN, LKSNI, LKX
subclass of: Water Region

Area
type: Class
comment: A tract of land without homogeneous character or boundaries. NIMA GNS designator L.AREA.
subclass of: Land Region

Land Region
type: Class
comment: Any sort of land regions which are sort of natural, i.e. excluding urban areas, political and administrative regions. It combines number of ADL feature types under Physiographic features and Regions. Omitted ADL sub-classes: Badlands, Bars, Basins, Bight, Cirques, Cliffs, Dunes, Flats, Karst areas. Ledges, Massifs, Mineral deposit areas, Moraines, Natural rock formations, Arches, Playas, Seafloor Features, Tectonic features, Volcanic features (Volcano put under Mountain), Subcontinents. NIMA GNS designators FSR, FURU, HMCK, PLDR, RKFL, SINK, SLID, SLP, SLPU, TERU, TRR.
subclass of: Location

Launch Facility
type: Class
comment: (ADL FT) Areas from which rockets/missiles may be housed and projected, usually equipped with associated buildings and facilities. [USGS Circ 1048] We use this category for missile sites. NIMA GNS designator - no equivalent.
subclass of: Transport Facility

Law firm
type: Class
comment: A law firm is a business entity formed by one or more lawyers to engage in the practice of law. The primary service provided by a law firm is to advise clients (individuals or corporations) about their legal rights and responsibilities, and to represent their clients in civil or criminal cases, business transactions, and other matters in which legal advice and other assistance are sought. DBPedia
subclass of: Company

Legal Cases
type: Class
comment: Denotes concrete legal cases, such as Dennis v. United States, Francis v. Resweber, United_States v. Virginia, etc.
subclass of: Event

Legislation
type: Class
comment: Various sorts of legislative documents, including consitutions, laws, etc.
subclass of: InformationResource

Library
type: Class
comment: A collection of books, journals, audio and video materials, etc.
subclass of: Resource Collection

Library
type: Class
comment: A building in which library organization is housed.
subclass of: Building

Library
type: Class
comment: An education organization teaching pupils from first grade to tenth/eleventh/twelfth grade. It could be a primary school, or a secondary school.
subclass of: Educational Organization

Living Object
type: Class
comment: Living object is any organism which is living, e.g. breathing and regular lifecycle.
subclass of: Object

Local Capital
type: Class
comment: A capital of a Province or smaller administrative region. NIMA GNS designator PPLA.
subclass of: Capital

Location of Special Interest
type: Class
comment: Any place with some particular value, which triggers interest.
subclass of: Location

Lock
type: Class
comment: (ADL FT) Stretches of water in canals, streams, or docks, enclosed by gates at each end, and used in raising and lowering boats as they pass from one water level to another. NIMA GNS designator LOCK.
subclass of: Transport Facility
subclass of: Hydrographic Structure

Locomotive
type: Class
comment: Locomotive, a railway vehicle that provides the motive power for a train. (Wikipedia)
subclass of: Vehicle

Lymphatic Node
type: Class
comment: Lymph is a general concept gathering all lymph nodes of the body.
subclass of: Body Part

Machine
type: Class
comment: Any produced device with particular purpose that uses energy to perform some activity. The device has parts that perform or assist in performing any type of work. (Wikipedia)
label: Device
subclass of: ProductModel

Magazine
type: Class
comment: A periodic paperback publication; "it takes several years before a magazine starts to break even or make money"), WordNet 1.7.1. This includes also journals and digests. The specific issues typically contain a number of different articles.
subclass of: Periodical Publication

Magazine Issue
type: Class
comment: A specific issue of a magazine, journal or digest.
subclass of: Resource Collection
subclass of: Issue of Periodical

Mammal
type: Class
comment: Mammals are members of a class of air-breathing vertebrate animals characterized by the possession of hair, three middle ear bones, and mammary glands functional in mothers with young. Most mammals also possess sweat glands and specialized teeth, and the largest group of mammals, the placentals, have a placenta which feeds the offspring during gestation. (Wikipedia)
subclass of: Animal

Man
type: Class
comment: A male human.
subclass of: Person
subclass of: Human

Market
type: Class
comment: In contrast to IndustrySector, the market is determined by the customers instead of the business or the manifacturers. The market can be defined in terms of types of goods/services, geographic region, price levels and typical customer behaviours. Corresponding to the third sense in WordNet 1.7.1 "the customers for a particular product or service".
subclass of: Business Abstraction

Marsh
type: Class
comment: An area of open ground overlaid with wet peaty soils; a wetland dominated by grass-like vegetation; a flat area, subject to periodic salt water inundation, dominated by grassy salt-tolerant plants; a salt flat or salt encrusted plain subject to periodic inundation from flooding or high tides
subclass of: Water Region

Meadow
type: Class
comment: A small, poorly drained area dominated by grassy vegetation
subclass of: Biogeographic Region

Media Brand
type: Class
comment: A brand of a media company.
subclass of: Brand

Media Company
type: Class
subclass of: Company

Media Product
type: Class
comment: A mass media product (for instance a newspaper) abstracted from its organizational and ownership aspects (i.e. from its publisher) and considered more as a social phenomenon, partly a brand.
subclass of: ProductModel

Meeting
type: Class
comment: A meeting is a gathering of two or more people that has been convened for the purpose of achieving a common goal through verbal interaction, such as sharing information or reaching an agreement. Wikipedia.
subclass of: Event

Meeting Proceedings
type: Class
comment: A collection of articles or presentations published as a book.
subclass of: Resource Collection
subclass of: Book

Message
type: Class
comment: A written message, including various postings in newspapers or public sources, job position adverts, etc.
subclass of: Document

Military Areas
type: Class
comment: (ADL FTT) We use this category for air force bases; for army facilities; for arsenals; for artillery ranges; for barracks; for bases (military); for camps (military); for forts; for infantry camps; for maneuver areas; for military bases; for military installations; for national guard facilities; and for naval bases. The following NIMA designators fit here: MILB, INSM, SCHM. The following ADL types are skipped as irrelevant: Cadastral areas,
subclass of: Political Region

Military Command
type: Class
comment: Any military command, the organization which has a commanding role in a military organization.
subclass of: Military Unit

Military Conflict
type: Class
comment: An event of organized, armed, and often prolonged conflict carried on between states, nations, or other parties. Wikipedia.
subclass of: Event

Military Organisation
type: Class
comment: Any military organisation, the structuring of the armed forces of a state so as to offer military capability required by the national defence policy. (Wikipedia)
subclass of: Organization

Military Unit
type: Class
comment: Any military unit, a smaller military organization.
subclass of: Military Organisation

Mine Site
type: Class
comment: (ADL FT) Places or areas from which commercial minerals are or were removed by excavation from the Earth. [Adapted from USGS Feature Class Definitions <http://mapping.usgs.gov/www/ti/GNIS/gnis_users_guide_appendixc.html>] We use this category for adits (mine sites); for chrome mines; for coal mines; for collieries; for copper mines; for diatomite mines; for gold mines; for gravel pits; for iron mines; for lead mines; for mine entrances; for mine shafts; for mines; for mining areas; for mining camps; for nickel mines; for open pit mines; for placer mines; for quarries; for salt mines; for strip mines; and for tin mines. NIMA GNS designators MN, MNA, MNAU, MNC, MNCR, MNDT, MNCU, MNFE, MNN, MNNI, MNPB, MNPL. MNQ, MNSN.
subclass of: Facility

Ministry
type: Class
comment: (Department) A specific ministry or department, structural unit of the government of specific country with focus and authority on specific problems of the country.
subclass of: Government Organization

Mixed Martial Arts League
type: Class
comment: Any Mixed Martial Arts league
subclass of: Sports League

Mollusca
type: Class
comment: Mollusca is a large phylum of invertebrate animals. This is the largest marine phylum, comprising about 23% of all the named marine organisms. Numerous molluscs also live in freshwater and terrestrial habitats. Molluscs are highly diverse, not only in size and in anatomical structure, but also in behaviour and in habitat. (Wikipedia)
subclass of: Animal

Money
type: Class
comment: A specific amount of money in specific currency
subclass of: Social Abstraction

Month
type: Class
comment: A specific month, like Dec 2000, as a time period.
subclass of: TimeInterval

Monument
type: Class
comment: (ADL FT) Structures erected as memorials. [Adapted from American Heritage Dic. of the English Language, 4th ed.] We use this category for cairns; for landmarks (monuments); for memorials; for national monuments; for pyramids; for shrines; for statues; and for tombs. NIMA GNS designators MNMT, PYR, PYRS, CARN.
subclass of: Facility

Motorcycle Racing League
type: Class
comment: Any Motorcycle Racing league
subclass of: Sports League

Mountain
type: Class
comment: (ADL FT) Landmasses that project conspicuously above their surroundings. [USGS Circ 1048] We use this category for cerros; for cordilleras; for foothills; for hills; for knolls; for mounds; and for mounts. Omitted ADL sub-classes: Continental divides. NIMA GNS designator MT, MTS, MTSU, MTU, MND, KNLU, KNSU, CDAU, HLL, HLLS, HLLU, HLSU.
subclass of: Land Region

Mountain Pass
type: Class
comment: Any mountain pass. NIMA GNS designators - no direct equivalents
subclass of: Land Region

Mountain Range
type: Class
comment: (ADL FT) (a) Chains of hills or mountains; (b) somewhat linear, complex mountainous or hilly areas. ... We use this category for ranges (physiographic); and for sierra. NIMA GNS designator RNGU.
subclass of: Mountain

Mountain Summit
type: Class
comment: (ADL FT) Peaks of mountains. [USGS Circ 1048] We use this category for ahus; for mountain crests; for nunataks; for peaks; and for summits. NIMA GNS designators PK, PKS, PKSU, PKU.
subclass of: Mountain

Movie
type: Class
comment: A film, also called a movie or motion picture, is a series of still or moving images. Wikipedia.
subclass of: Media Product

Mud Flat
type: Class
comment: A relatively level area of mud either between high and low tide lines, or subject to flooding; a large flat area of mud or sand attached to the shore and alternately covered and uncovered by the tide; a tropical tidal mud flat characterized by mangrove vegetation
subclass of: Land Region

Muscle
type: Class
comment: Any muscle of a body.
subclass of: Body Part

Museum
type: Class
comment: Any museum, an institution that houses and cares for a collection of artifacts and other objects of scientific, artistic, or historical importance and makes them available for public viewing through exhibits that may be permanent or temporary. (Wikipedia)
subclass of: Building

Musical Company
type: Class
comment: Any Musical company, a company involved in the music business, e.g. sells compositions, recordings and performances of music, like Soni Music Entertainment.
subclass of: Entertainment Company

Music Festival
type: Class
comment: Any festival involving playing music.
subclass of: Festival

Music Genre
type: Class
comment: Any genre which pertians to music, e.g. classical, folk, pop, etc.
subclass of: Genre

Musical
type: Class
comment: Musical is a form of theatre or movie combining music, songs, spoken dialogue and dance. (Wikipedia)
subclass of: ProductModel

Musical Composition
type: Class
comment: An original piece of music.
subclass of: Media Product

Musical Instrument
type: Class
comment: Musical Instrument, a device created or adapted for the purpose of making musical sounds. (Wikipedia)
subclass of: Object

Narrows
type: Class
comment: A tidal strait. NIMA GNS designator H.NRWS.
subclass of: Water Region

Nationality
type: Class
comment: Any nationality. In most cases it is connected with a country name, but there are notionalities without countries - Kurd, etc.
subclass of: Abstract

Natural Phenomenon
type: Class
comment: Such as particular disease, the Gulfstream and other similar natural abstractions. The particular events or objects which could instantiate an abstract natural phenomena (i.e. specific sickness event caused by a disease) are not instances of this class.
subclass of: Abstract

Natural Satellite
type: Class
comment: A satellite which is not a direct result of human activity
subclass of: Satellite

Nerve
type: Class
comment: Nerve is a general concept gathering all nerves of a body.
subclass of: Body Part

News agency
type: Class
comment: A news agency is an organization of journalists established to supply news reports to news organizations: newspapers, magazines, and radio and television broadcasters. Wikipedia
subclass of: Media Company

Newspaper
type: Class
comment: A newspaper abstracted from its organizational and ownership aspects as well as from a specific issue or paper body.
subclass of: Periodical Publication

Newspaper Issue
type: Class
comment: A specific issue of a newspaper.
subclass of: Resource Collection
subclass of: Issue of Periodical

Nobelty
type: Class
comment: The situation of holding a position in society as nobelty.
subclass of: SocialPosition

Nobelty
type: Class
comment: The social function of a nobelty.
subclass of: Social Function

Non-Orofit Organisation
type: Class
comment: Any Non-Profit Organization, an organization that does not distribute its surplus funds to owners or shareholders, but instead uses them to help pursue its goals. (Wikipedia)
subclass of: Organization

Non Alcoholic Beverage
type: Class
comment: A type (specific receipe) for a beverage. For instance: Coca Cola, Schweppes, Apple Juice, etc.
subclass of: Beverage

Non-Geographic Location
type: Class
comment: A non-geographic region in some 3D space. The Longitude and Latitude properties for such objects could be void.
subclass of: Location

Oasis
type: Class
comment: (ADL FT) Fertile, vegetated areas in the midst of a desert, where the water table has come close enough to the surface for wells and springs or seepages to exist, thus making them suitable for human habitation. NIMA GNS designator OAS.
subclass of: Biogeographic Region

Ocean
type: Class
comment: (ADL FT) Continuous salt-water bodies that surround the continents and fill the Earth's great depressions. NIMA GNS designator OCN
subclass of: Sea

Offer
type: Class
comment: Something offered (as a proposal or bid), WordNet 1.7.1. An offer is a statement made by the offerer to a specific agent or without recepient.
subclass of: Statement

Official Political Meeting
type: Class
comment: A meeting whose main participants are political entities playing official roles within it.
subclass of: Meeting

Official Position
type: Class
comment: A job position having a representative function with respect to an organization. Usually this is a position within a governmental organization.
subclass of: JobPosition

Oil Field
type: Class
comment: (ADL FT) Areas with reserves of recoverable petroleum or where petroleum has been removed from the Earth. ... We use this category for gas fields; for gasfields; for oilfields; for petroleum fields; and for storage fields (petroleum). NIMA GNS designator CMPO, OILF, OILQ, OILW, PMPO, GASF.
subclass of: Facility

Olympic Games
type: Class
comment: The institution of Olympic Games held every 4 years
subclass of: Recurring Event

Olympic Games
type: Class
comment: A specific issue of the games, like Athens 2004
subclass of: Sport Event

Opera Performance
type: Class
comment: An art performance following an opera music and script.
subclass of: Art Performance

Orchard
type: Class
comment: A planting of fruit or nut trees
subclass of: Biogeographic Region

Order
type: Class
comment: A statement used to request someone to supply something in return for payment and providing specifications and quantities. WordNet 2.1.
subclass of: Statement

OutOfLaws
type: Class
comment: The situation of holding a position in a society as out of law.
subclass of: SocialPosition

Criminal
type: Class
comment: Criminal, the social function of a person who has committed a crime and is out of the law.
subclass of: Social Function

Overfalls
type: Class
comment: An area of breaking waves caused by the meeting of currents or by waves moving against the current. NIMA GNS designator H.OVF.
subclass of: Water Region

Paintball League
type: Class
comment: Any Paintball league
subclass of: Sports League

painting
type: Class
comment: Any painting, the results of a practice of applying paint, pigment, color or other medium[1] to a surface (support base). (Wikipedia)
subclass of: Piece of Art

Parish
type: Class
comment: A district of religious land. NIMA GNS designator A.PRSH.
subclass of: Populated Place

Park
type: Class
comment: (ADL FT) Places or areas developed for public use or recreation. [USGS Circ 1048] We use this category for arboretums; for botanical gardens; for commemorative areas; for commons; for gardens; for marine parks; for national forests; for national parks; for national seashores; for park gates; for picnic areas; for playgrounds; for provincial parks; for public use areas; for recreation areas; for rest areas; for scenic areas; for state forests; for state parks; for urban parks; for village squares; for wilderness areas; for zoological gardens; and for zoos. Omitted sub-classes: Viewing locations. NIMA GNS designators PRK, PRKHQ, PRKGT
subclass of: Facility

Parliament
type: Class
comment: A legislative assembly representative at national or regional level. It can also be called Senate, etc.
subclass of: Political Entity

Patent
type: Class
comment: A registered (or awaiting registration) patent for specific invention or design.
subclass of: InformationResource

Peninsula
type: Class
comment: A land region surrounded by water from most sides, but having land connect to bigger land region. NIMA GNS designator PEN, PENX.
subclass of: Land Region

Percent
type: Class
comment: A specific percent value
subclass of: Number

Performance Site
type: Class
comment: Buildings where cultural events are presented before an audience. We use this category for amphitheaters; for amphitheatres; for auditoriums; for bowls (performance); for coliseums; for concert halls; for opera houses; for playhouses; for recital halls; for stages (performance); for symphony halls; for theaters; and for theatres. NIMA GNS designator AMTH.
subclass of: Recreational Facility
subclass of: Building

Periodical Publication
type: Class
comment: A periodical publication, disregarding its specific issues, numbers, volumes, etc.
subclass of: Media Brand

Petroleum Basin
type: Class
comment: An area underlain by an oil-rich structural basin. NIMA GNS designator L.BSNP.
subclass of: Oil Field

Phone Number
type: Class
comment: A sequence of digits which represents an address of a telephone device within a telephone net.
subclass of: ContactInformation

Piece of Art
type: Class
comment: An artifact, namely a piece of art, usually, matterial object. Typical instances are paintings and sculptures. Corresponds to the Wordnet 1.7.1 synset "art, fine art - the products of human creativity; works of art collectively; "an art exhibition"@en ; "a fine collection of art")"
subclass of: Object

Pipeline
type: Class
comment: (ADL FT) Tubular conduits of substantial length, with pumps, valves, and control devices, for conveying fluids, gases, or finely divided solids. [USGS Circ 1048] We use this category for compressor stations; for gas pipelines; for oil pipeline junctions; for oil pipeline terminals; for oil pipelines; for oil pumping stations; for pump houses; for pumphouses; for pumping stations; and for water pumping stations. NIMA GNS designators OILP, OILJ, TRMO, PMPO, PMPW.
subclass of: Transport Facility

Plain
type: Class
comment: (ADL FT) Regions of general uniform slope, comparatively level and of considerable extent. [USGS Circ 1048] We use this category for interfluves; and for llanos. NIMA GNS designators PLN, PLNU, PLNX, INTF.
subclass of: Land Region

Planet
type: Class
comment: Any of the celestial bodies (other than comets or satellites) that revolve around the sun in the solar system. Definition partly derived from WordNet 1.7
subclass of: Astronomical Object

Plant
type: Class
comment: Plants are living organisms. They include familiar organisms such as trees, flowers, herbs, bushes, grasses, vines, ferns, mosses, and green algae. (Wikipedia)
subclass of: Living Object

Plateau
type: Class
comment: (ADL FT) Comparatively flat areas of great extent and elevation; specif. extensive land regions considerably above the adjacent country or above sea level; commonly limited on at least one side by an abrupt descent, have flat or nearly smooth surfaces but are often dissected by deep valleys and surmounted by high hills or mountains, and have a large part of their total surface at or near the summit level. We use this category for table mountains; and for tablelands. The ADL type Mesas, collapsed here. NIMA GNS designators PLAT, PLTX, PLTU, MESA, MESU, TMSU, TMST.
subclass of: Land Region

Play
type: Class
comment: A play is a form of literature written by a playwright, usually consisting of scripted dialogue between characters, intended for theatrical performance rather than just reading. DBPedia
subclass of: Published Material

Political Entity
type: Class
comment: Any organization which has a political functions.
subclass of: Organization

Political Party
type: Class
comment: An organization to gain political power. Definition taken from WordNet 1.7
subclass of: Political Entity

Political Region
type: Class
comment: (ADL, Political Entity) We use this category for commonwealths; for dependent political entities; for freely associated states; for independent political entities; for oblasts; for political entities; and for semi-independent political entities. Sub-classes omitted: Countries, 4th order divisions. NIMA GNS class: A, Administrative Boundary Features.
subclass of: Location

Polo League
type: Class
comment: Any Polo league
subclass of: Sports League

Pond
type: Class
comment: A pond is a body of standing water, either natural or man-made, that is usually smaller than a lake. (Wikipedia). http://www.eionet.europa.eu/gemet/concept/6507. NIMA GNS designator H.PND, H.PNDI, H.PNDN, H.PNDNI, H.PNDS, H.PNDSF, H.PNDSI, H.PNDSN, H.MFGN.
subclass of: Water Region

Pool
type: Class
comment: A small and comparatively still, deep part of a larger body of water. NIMA GNS designator H.POOL, H.POOLI.
subclass of: Water Region

Populated Place
type: Class
comment: (ADL FT) Places or areas with clustered or scattered buildings and a permanent human population. ... We use this category for agricultural colonies; for communes; for communities; for hamlets; for homesteads; for locales; for localities; for metropolitan areas; for populated localities; for ppl; for pueblos; for settlements; for suburbs; for villages; and with religious facilities for religious populated places. NIMA GNS designator PPL, PPL(x)
subclass of: Location

Village Name
type: Class
comment: Part of a postal address denoting the name of a village, town, city, country, etc.
label: Town Name
label: Name of a Populated Place
label: Country Name
label: City Name
subclass of: ContactInformation

Position in an organization
type: Class
comment: The situation of a job position which is available in a particular organization, such as CEO, CTO, executive assistant, etc.
subclass of: Situation

Possessions
type: Class
comment: Any property, e.g. possessions, the situation of owning an object.
subclass of: Business Abstraction

Postal Address
type: Class
comment: An address of a geographical place - usually a building. A postal address consists, usually, of a country name, zip code, city/village name, street name and number, a person name.
subclass of: Address

Power station
type: Class
comment: Any power station
subclass of: Facility

Profession
type: Class
comment: A profession is a vocation founded upon specialized educational training. Wikipedia.
subclass of: Social Function

Programming language
type: Class
comment: A formal language for encoding of computer programs.
subclass of: Abstract

Project
type: Class
comment: A project is carefully planned event to achieve a particular aim. Based on Wikipedia.
subclass of: Event

Protected Area
type: Class
comment: Any Protected Area, an area which benefits of special attention and is with limited access or protected in other ways.
subclass of: Location of Special Interest

Protein
type: Class
comment: Denotes any protein as a biological substance.
subclass of: Biological Substance

Province
type: Class
comment: (ADL FT: Countries, 1st Order Divisions) First-order divisions of a nation. [USGS Circ 1048] We use this category for cantons; for first-order administrative divisions; for provinces; for states; and for territories. NIMA GNS designator ADM1. Also corresponds to the FIPS 10-4 principal administrative division defined as "an administrative area directly subordinate to the pertinent governing authority " NIMA GNS designator ADM1.
subclass of: Populated Place
subclass of: Political Region

Public Company
type: Class
comment: Company which is publicly traded on a Stock Exchange.
subclass of: Company

Published Material
type: Class
comment: A document that is published or intended for publishing
subclass of: Document
subclass of: Media Product

Publishing Company
type: Class
comment: An organization which main activity is mass publishing of information. Often, the publishers issue periodic and/or non-periodic documents on paper media. While on-line publishing is considered a typical activity for publishers, the streaming electronic media such as TV and Radio Stations are not.
subclass of: Media Company

Quarter
type: Class
comment: A specific quarter of a specific year, such as Q4 1999
subclass of: TimeInterval

Race Course
type: Class
comment: A racecourse is a horse racing track.
subclass of: Sport Facility

Radio company
type: Class
comment: A company that broadcasts audio content.
subclass of: Broadcaster

Radio Controlled Racing League
type: Class
comment: Any Radio Controlled Racing league
subclass of: Sports League

Radio Station
type: Class
comment: A brand of a radio station.
subclass of: Media Brand

Railroad Facility
type: Class
comment: (ADL FT: Railroad Features) We use this category for metro rail stations; for railroad junctions; for railroad sidings; for railroad spurs; for railroad stations; for railroad stops; for railroad switches; for railroad yards; for railways; for subway stations; for switches (railroad); and for tramways. NIMA GNS designator RJCT, RR, RRQ, RSD, RSGNL, RSTN, RSTNQ, RSTP, RSTPQ, RYD.
subclass of: Transport Facility

Railroad Tunnel
type: Class
comment: A tunnel for trains. NIMA GNS designator RTNL.
subclass of: Tunnel
subclass of: Railroad Facility

Ramp
type: Class
comment: A gentle slope connecting areas of different elevations
subclass of: Land Region

Rapids
type: Class
comment: A turbulent section of a stream associated with a steep, irregular stream bed. NIMA GNS designator H.RPDS.
subclass of: Water Region

Recreational Facility
type: Class
comment: (ADL FT) We use this category for access areas; for access sites; for boardwalks; for casinos; for clubs (recreational); for country clubs; for fairgrounds; for fishing areas; for fishing lodges; for fitness centers; for gun clubs; for hunt posts; for hunting lodges; for ice skating rinks; for playgrounds; for recreation sites; for resorts; for riding stables; for spas; for sportsman lodges; for stables; for yacht clubs; for youth centers; and for youth facilities. NIMA GNS designators - no direct equivalents.
subclass of: Facility

Recurring Event
type: Class
comment: Recurring sequence of events, such as Olympic Games, etc..
subclass of: Happening

Reef
type: Class
comment: (ADL FT) Chains of rocks or coral at or near the surface of water. [USGS Circ 1048] We use this category for barrier reefs; and for fringing reefs. Collapsed ADL sub-class: Coral Reefs. NIMA GNS designator RF, RFSU, RFU, RFC, H.RFX.
subclass of: Land Region

Reference Location
type: Class
comment: (ADL FT) We use this category for astronomical stations; for beacons; for bench marks; for boundaries; for boundary markers; for buoys; for control points; for geodectic stations; for geographic centers; for landmarks (reference locations); for light houses; for light stations; for lighthouses; for markers; for milestones; for plaques; for poles (sphere); for triangulation stations; and for walls. NIMNA GNS designators LTHSE, BP, TRIG.
subclass of: Facility

Religious Location
type: Class
comment: Things like Monastery, Church
subclass of: Facility

Religious Organization
type: Class
comment: Organization which offers ideas and opinions about life. Just joking.
subclass of: Organization

Report
type: Class
comment: A document describing the result of some event.
subclass of: Document

Reptile
type: Class
comment: Reptiles are animals in the class Reptilia. They are characterized by breathing air, laying shelled eggs, and having skin covered in scales and/or scutes. Reptiles are classically viewed as having a "cold-blooded" metabolism. They are tetrapods. Modern reptiles inhabit every continent with the exception of Antarctica. Example of an reptile is the crocodile. (Wikipedia)
subclass of: Animal

Research Area
type: Class
comment: Specific research area, topic or field.
subclass of: Social Abstraction

Research Organization
type: Class
comment: An organization performing scientific research.
subclass of: Organization

Reserve
type: Class
comment: (ADL FT) Areas set aside for the preservation of fauna, flora, and their natural habitats. [Macmillan Encyc., 2001] We use this category for agricultural reserves; for conservation areas; for demonstration areas; for environmental areas; for forest reserves; for game management areas; for hunting reserves; for management areas (reserves); for natural areas; for nature reserves; for palm tree reserves; for preserves; for primitive areas; for protected areas; for reservations (nature sites); for road less areas; for sanctuaries (wildlife); for wildlife areas; for wildlife refuges; and for wildlife reserves. NIMA GNS designators RES, RESA, RESF, RESH, RESN, RESP, RESV, RESW.
subclass of: Facility

Reservoir
type: Class
comment: (ADL FT) Artificially impounded bodies of water. We use this category for covered reservoirs; and for intermittent reservoirs. (incl. dams) NIMA GNS designator RSV, RSVI.
subclass of: Lake
subclass of: Hydrographic Structure

Resource Collection
type: Class
comment: A collection is an aggregation of information resources. The term collection means that the resource is described as a group; its parts may be separately described and navigated. (DCMI type Collection)
subclass of: InformationResource

Restaurant
type: Class
comment: Any restaurant, a place where food, drink and dessert to customers is prepared and served in return for money. (Wikipedia)
subclass of: Building

Ridge
type: Class
comment: (ADL FT) Elevations with a narrow, elongated crest which can be part of a hill or mountain. ... We use this category for aretes; for beach ridges; for cuestas; for eskers; for hogbacks; for icecap ridges; for rises (seafloor); and for spurs (physiographic). Omitted ADL sub-classes: Drumlin. NIMA GNS designators RDGB, RDGE, RDGG, RDGU, RISU, SPRU, SPUR.
subclass of: Mountain

River
type: Class
comment: (ADL FT) Natural freshwater surface streams of considerable volume and a permanent or seasonal flow, moving in a definite channel toward a sea, lake, or another river; any large streams, or ones larger than brooks or creeks, such as the trunk stream and larger branches of a drainage system. We use this category for rios. NIM GNS designators ... no direct equivalents!
subclass of: Stream

Cutoff
type: Class
comment: A new channel cut by a river across the neck of an oxbow. NIMA GNS designator H.CUTF.
subclass of: Water Region

Roadway
type: Class
comment: (ADL FT) Open ways for passage of vehicles. [USGS Circ 1048] We use this category for caravan routes; for causeways; for drives; for highways; for intersections; for parkways; for road bends; for road cuts; for road junctions; for roads; for streets; and for traffic circles. NIMA GNS designators CSWY, CSWYQ, RD, RDA, RDB, RDCUT, RDJCT, RDST, RTE, STKR.
subclass of: Transport Facility

Rugby League
type: Class
comment: Any Rugby League
subclass of: Sports League

Saddle
type: Class
comment: A low part, resembling in shape a saddle, in a ridge or between contiguous seamounts
subclass of: Land Region

Saint
type: Class
comment: Any saint, a holy person, in whom Christ dwells, whether in heaven or in earth.
subclass of: Person

Sale
type: Class
comment: Any event in which a participant is receiving a good from another participant of the event on the basis of some payment.
subclass of: Event

Satellite
type: Class
comment: An astronomic object orbiting around a planet or star. Definition partly derived from WordNet 1.7
subclass of: Astronomical Object

School
type: Class
comment: An education organization teaching pupils from first grade to tenth/eleventh/twelfth grade. It could be a primary school, or a secondary school.
subclass of: Educational Organization

Science
type: Class
comment: A well established, big research area
subclass of: Research Area

Scrubland
type: Class
comment: An area of low trees, bushes, and shrubs stunted by some environmental limitation
subclass of: Biogeographic Region

Sculpture
type: Class
comment: Any sculpture, three-dimensional artwork created by shaping or combining hard materials. (Wikipedia)
subclass of: Piece of Art

Sea
type: Class
comment: (ADL FT) Large bodies of salt water. NIMA GNS designator SEA
subclass of: Water Region

Sound
type: Class
comment: A long arm of the sea forming a channel between the mainland and an island or islands; or connecting two larger bodies of water. NIMA GNS designator H.SD.
subclass of: Water Region

Tongue
type: Class
comment: An elongate (tongue-like) extension of a flat sea floor into an adjacent higher feature
subclass of: Land Region

Trench
type: Class
comment: A long, narrow, characteristically very deep and asymmetrical depression of the sea floor, with relatively steep sides
subclass of: Land Region

Trough
type: Class
comment: A long depression of the sea floor characteristically flat bottomed and steep sided, and normally shallower than a trench
subclass of: Land Region

Seachannels
type: Class
comment: Continuously sloping, elongated depressions commonly found in fans or plains and customarily bordered by levees on one or two sides (U.SCSU; U.SCSU)
subclass of: Land Region

Seamount
type: Class
comment: An elevation rising generally more than 1,000 meters and of limited extent across the summit. (U.SMSU; U.SMU)
subclass of: Land Region

Season
type: Class
comment: One of the seasons of the year. In the places with a temperate climate there are four seasons: spring, summer, autumn, and winter.
subclass of: Temporal Abstraction

Settlement
type: Class
comment: Describes a populated place with organisation, like city, village, town
subclass of: Populated Place

Ship
type: Class
comment: A vehicle which moves on water.
subclass of: Vehicle

Shoal
type: Class
comment: Hazards to surface navigation composed of unconsolidated material. (U.SHSU; U.SHLU)
subclass of: Land Region

Shopping Mall
type: Class
comment: Any Shopping Mall, a building which is a shopping mall
subclass of: Building

Single
type: Class
comment: Any Single Album
comment: A representative for a musician album.
subclass of: Single
subclass of: Album

Single
type: Class
comment: A representative for an album or a musician song.
subclass of: Song
subclass of: Single

Single
type: Class
comment: Any Single Song and Album
subclass of: Audio Recording

Site of Special Scientific Interest
type: Class
comment: Any sites of special scientific interest, a place with scientific value, where some scientific activities or experiments are carried out, or which is observed for scientific reasons.
subclass of: Location of Special Interest

Ski Area
type: Class
comment: Any Ski Area, a mounatain area (usually) where there re ski resorts or one can ski.
subclass of: Land Region

Skyscraper
type: Class
comment: Any Skyscraper, a highrise building, usually in downtown city areas.
subclass of: Building

Soccer Club
type: Class
comment: A sport club that organizes the playing of soccer.
comment: A soccer (football) team
subclass of: Sport Club

Soccer League
type: Class
comment: Any Soccer league
subclass of: Sports League

Social Abstraction
type: Class
comment: Any sort of general social phenomenon, such as particular sort of art or science
subclass of: Abstract

Social Function
type: Class
comment: The name of a function a person has in the society like nobely, job title, celebrity, etc.
subclass of: Social Abstraction

Softball League
type: Class
comment: Any Softball league
subclass of: Sports League

Software
type: Class
comment: Software is a collection of computer programs and related data that provide the instructions telling a computer what to do. (Wikipedia)
subclass of: ProductModel

Song
type: Class
comment: An recording of a song.
subclass of: Audio Recording

Space Mission
type: Class
comment: Any Mission in space in which space shuttles or space crafts are involved.
subclass of: Event

Space Shuttle
type: Class
comment: A Spaceshuttle is a reusable launch system and orbital spacecraft operated by the U.S. National Aeronautics and Space Administration (NASA) (Wikipedia).
subclass of: Spacecraft

Space Station
type: Class
comment: Any Spacestation. A space station (also called an orbital station) is a manned satellite designed to remain in space. (Wikipedia)
subclass of: Spacecraft

Spacecraft
type: Class
comment: [WN1.7] Space vehicle - a craft capable of traveling in outer space; technically a satellite around the sun.
subclass of: Vehicle

Speedway League
type: Class
comment: Any Speedway league
subclass of: Sports League

Speedway team
type: Class
comment: Any speedway team
subclass of: Team

Sport
type: Class
comment: A specific type of sport game
subclass of: Social Abstraction

Sport Building
type: Class
comment: A building providing facilities for practice of sport(s).
subclass of: Sport Facility
subclass of: Building

Sport Club
type: Class
comment: An organization arranging the practice of some sports by teams or individuals.
comment: A sports club, football club or F1 team. Those should be considered commercial although in many cases they are not run for profit.
subclass of: Sport Organization
subclass of: Company

Sport Event
type: Class
comment: An event involving use, maintain or improve of physical fitness of its participants. Usually it is organized.
subclass of: Event

Sport Facility
type: Class
comment: (ADL FT) Fields, centers, or open areas maintained for the purpose of holding sporting events and activities. [USGS Circ 1048] We use this category for aquatic centers; for arenas; for athletic complexes; for athletic fields; for ball parks; for baseball fields; for dragways; for equestrian centers; for fields; for football fields; for golf clubs; for golf courses; for gymnasiums; for natatoriums; for physical education facilities; for pistol ranges (sport); for polo fields; for pools, swimming; for race tracks; for racecourses; for racetracks; for raceways; for rifle ranges; for rodeo grounds; for shooting ranges (sport); for skeet shooting ranges; for ski areas; for ski facilities; for ski trails; for speedways; for stadiums; for swim clubs; for swimming pools; for tennis clubs; and for tennis courts. NIMA GNS designators RECG, RECR, STDM, ATHF.
subclass of: Recreational Facility

Sport Game
type: Class
comment: A sport game is any instance of a sport event, where teams or individuals gather to play according to particular predetermined rules, such as soccer match, tennis match, car race, etc. It can also denote the activity of playing a particular sport game.
subclass of: Sport Event
subclass of: Game

Sport Game Point
type: Class
comment: Denotes a point scored in a given sport game.
subclass of: Situation

Sport Organization
type: Class
comment: An organization (local, national or international) which main activity is related to one or more sports. Those could be clubs, as well, as all the sorts of federations.
subclass of: Organization

Sports Federation
type: Class
comment: An organization representing which controls the practice of some sport on national, regional or international level.
subclass of: Sport Organization

Sports League
type: Class
comment: Any sports league, a group of sports teams or individual athletes that compete against each other in a specific sport. (Wikipedia)
subclass of: Sport Organization

Sportsman
type: Class
comment: A profession of a person involved in a sport.
subclass of: Profession

Spring
type: Class
comment: (ADL FT) Places where underground water flows naturally to the surface of the Earth. ... We use this category for mineral springs; and for sulfur springs. NIMA GNS designators SPNG, SPNS, SPNT.
subclass of: Water Region

Stadium
type: Class
comment: A special sort of sport building, usually for open-air sports such as soccer.
subclass of: Sport Building

Star
type: Class
comment: An astronomic object of hot gases that radiates energy derived from thermonuclear reactions in the interior. Definition partly derived from WordNet 1.7
subclass of: Astronomical Object

Station
type: Class
comment: Any station, a place where busses, trains, sheeps, boats, etc. stop, like railway station, bussstop, etc.
subclass of: Building

Stock Exchange
type: Class
comment: Stock Exchange where public companies are traded, e. g. Nasdaq, NYSE, etc.
subclass of: Organization

Stock Exchange Index
type: Class
comment: A stock exchange/market index is a method of measuring a section of the stock market. (Wikipedia)
subclass of: Business Abstraction

Stream
type: Class
comment: (ADL FT) Linear bodies of water flowing on the Earth's surface. We use this category for anabranches; for brooks; for burns (hydrographic); for confluences; for creeks; for distributaries; for dry stream beds; for forks (physiographic features); for intermittent streams; for lost rivers; for meanders; for stream bends; for stream mouths; for tidal creeks; for tributaries; and for watercourses. NIMA GNS designators STM, STMA, STMB, STMC, STMD, STMH, STMI, STMIX, STMM, STMQ, STMS, STMSB, STMX
subclass of: Water Region

Street
type: Class
comment: The general notion for a roadway within a city or village, often, surrounded by buildings. We put here boulevards, streets, avenues, etc. NIMA GNS designator - missing.
subclass of: Roadway

Street Name
type: Class
comment: Part of a postal address denoting the street name.
subclass of: ContactInformation

Street Number
type: Class
comment: Part of a postal address denoting the street number.
subclass of: ContactInformation

TV Channel
type: Class
comment: A brand of a television channel.
subclass of: Media Brand

TV company
type: Class
comment: A company that broadcasts audio and video content.
subclass of: Broadcaster

Team
type: Class
comment: A group of people gathered for some task, say a project. Teams are usually not formally established and not meant to perform as a single agent for purposes outside the scope of their task. Teams may "live" within organizations, spread between multiple organizations, or be independent form any organization.
subclass of: Organization

Telecom
type: Class
comment: A telecommunications company
subclass of: Company

Telecom Facility
type: Class
comment: (ADL FT: Telecommunication Features) We use this category for antenna field sites; for communication centers; for radio stations; for television stations; and for transmission lines. NIMA GNS designators COMC, STNR, STNS.
subclass of: Facility

Television Episode
type: Class
comment: Denotes any episod of any television series.
subclass of: Television Product

Television Product
type: Class
comment: Denotes programms produced in the television and for television airing.
subclass of: Media Product

Television Show
type: Class
comment: Any television show
subclass of: Television Product

Temporal Abstraction
type: Class
comment: Any sort of abstraction used to refer to specific periods of time. Thus, the month of September is an instance of this class, while Sept 1989 is not (it is a specific TimeInterval, and thus not abstract)
subclass of: Abstract

Tennis League
type: Class
comment: Any Tennis league
subclass of: Sports League

Territory
type: Class
comment: Territory a region of land which can be a part of contry that is non-sovereign or a geographic region determined by some charateristics. (Wikipedia) (http://www.eionet.europa.eu/gemet/concept?ns=1&cp=8401. NIMA GNS designator A.TERR.
subclass of: Land Region

Theatre Performance
type: Class
comment: An art performance following a stage play.
subclass of: Art Performance

Time Zone
type: Class
comment: A time zone is a region on Earth that has a uniform standard time for legal, commercial, and social purposes. Wikipedia.
subclass of: Temporal Abstraction

Tournament
type: Class
comment: A Tournament which is held regularly at particular time intervals, every year, every week, etc.
subclass of: Recurring Event

Tournament
type: Class
comment: A Tournament held at a particular time
subclass of: Sport Event

Tower
type: Class
comment: (ADL FT) Manmade structures, higher than their diameter, generally used for observation, storage, or electronic transmission. We use this category for carillons; for fire lookouts; and for pagodas. NIMA GNS designator TOWR.
subclass of: Building

Town
type: Class
comment: Any town
subclass of: Settlement

Trade Union
type: Class
comment: Any Trade Union, an organization of workers that have banded together to achieve common goals such as better working conditions. (Wikipedia)
subclass of: Organization

Transport Facility
type: Class
comment: (ADL FT: Transportation Features) We use this category for air routes; for caravan routes; for corridors; for crossings; for depots; for ferries; for fords (crossings); for fuel depots; for gates (manmade); for halting places (transportation); for highway maintenance sites; for portages; for rest houses; for routes; for ship tracks; for stock routes; for terminals (transportation); and for transit facilities. Omitted sub-classes: Aqueducts, Cableways, Parking Sites. NIMA GNS designator - no direct equivalents.
subclass of: Facility

Tundra
type: Class
comment: (ADL FT) Treeless, level, or gently rolling plains characteristic of arctic or subarctic regions, having a permanently frozen subsoil, and usually supporting low growing vegetation such as lichens, mosses, and stunted shrubs. [USGS Circ 1048] We use this category for Arctic land. NIMA GNS designator TUND, LAND.
subclass of: Biogeographic Region

Tunnel
type: Class
comment: (ADL FT) Underground or underwater passages. [USGS Circ 1048] We use this category for canal tunnels; for railroad tunnels; and for road tunnels. NIMA GNS designator TNL, TNLC, TNLN, TNLRD, TNLS
subclass of: Transport Facility

University
type: Class
comment: An educational organization higher than school.
subclass of: Research Organization
subclass of: Educational Organization

Urban District
type: Class
comment: (ADL FT: Countries, 3rd order divisions) Minor civil units. [USGS Circ 1048] We use this category for barrios; for precincts; for third-order administrative divisions; and for townships. NIMA GNS designator ADM3.
subclass of: Populated Place
subclass of: Political Region

Valley
type: Class
comment: (ADL FT) Low-lying land bordered by higher ground; especially elongate, relatively large gently sloping depressions of the Earth's surface, commonly situated between two mountains or between ranges of hills or mountains, and often containing a stream with an outlet. [Glossary of Geology, 4th ed.] We use this category for forks (physiographic features); for glens; for hanging valleys; for hollows; for median valleys; and for shelf valleys (seafloor). NIMA GNS designators VAL, VALG, VALU, VALS, VALX, VLSU, FRKU, FRSU, MDVU, SHVU.
subclass of: Land Region

Vehicle
type: Class
comment: Any sort of specific vehicle, mean of transportation.
subclass of: Object

Vein
type: Class
comment: Vein is a general concept gathering all veins of a body.
subclass of: Body Part

Video Game
type: Class
comment: Any electronic game that involves interaction with a user interface to generate visual feedback on a video device. (Wikipedia)
subclass of: Software

Videogames League
type: Class
comment: Any Videogames league
subclass of: Sports League

Village
type: Class
comment: Any village
subclass of: Settlement

Vineyard
type: Class
comment: Plantings of grapevines
subclass of: Biogeographic Region

Volcano
type: Class
comment: (ADL FT) Vents in the surface of the Earth through which magma and associated gases erupt; also, the forms or structures, usually conical, that are produced by the erupted material. NIMA GNS designator VLC.
subclass of: Mountain

Volleyball League
type: Class
comment: Any Volleyball league
subclass of: Sports League

Wadi
type: Class
comment: A valley or ravine, bounded by relatively steep banks. NIMA GNS designator H.WAD, H.WADB, H.WADJ, H.WADM, H.WADS, H.WADX.
subclass of: Land Region

Water Bank
type: Class
comment: (ADL FT: Banks) Sloping margins of, or the ground bordering, a stream, and serving to confine the water to the natural channel during the normal course of flow. [Glossary of Geology, 4th ed.] We use this category for stream banks. NIMA GNS designator BKSU, BNK, BNKR, BNKU, BNKX.
subclass of: Land Region

Current
type: Class
comment: A net transport of ocean water along a definable path. http://www.eionet.europa.eu/gemet/concept/5792 NIMA GNS designator H.CRNT.
subclass of: Water Region

Reach
type: Class
comment: A straight section of a navigable stream or channel between two bends. NIMA GNS designator H.RCH.
subclass of: Water Region

Water Region
type: Class
comment: (ADL FT: Hydrographic Features) For natural bodies of water. For constructed waterways, reservoirs, and such, use 'hydrographic structures'. We use this category for bodies of water; for eddies; for fluvial features; for marine features; for overfalls; for upwellings; for water bodies; for waterholes; and for whirlpools. Many of the ADL hydrographic features ignored. NIMA GNS class H.
subclass of: Location

Water Tank
type: Class
comment: A contained pool or tank of water at, below, or above ground level. NIMA GNS designator H.RSVT.
subclass of: Water Region
subclass of: Hydrographic Structure

Watercourse
type: Class
comment: A natural, well-defined channel produced by flowing water, or an artificial channel designed to carry flowing water. NIMA GNS designator H.WTRC.
subclass of: Water Region
subclass of: Hydrographic Structure

Waterfalls
type: Class
comment: (ADL FT) Perpendicular or very steep falls of water in the course of a stream. ... We use this category for cascades; for cataracts; and for falls. NIMA GNS designator FLLS, FLLSX
subclass of: Land Region

Waterhole
type: Class
comment: A natural hole, hollow, or small depression that contains water, used by man and animals, especially in arid areas. NIMA GNS designator H.WTRH.
subclass of: Water Region

Weapon Model or System
type: Class
comment: A concrete model of a weapon that determines its main features. For example, Patriot, SU-28, and Kalashnikov.
subclass of: ProductModel

Web Page
type: Class
comment: The internet address of a web page on the net.
subclass of: Internet Address

Week
type: Class
comment: A specific week of a specific year (say the 41st of 2001)
subclass of: TimeInterval

Well
type: Class
comment: A cylindrical hole, pit, or tunnel drilled or dug down to a depth from which water, oil, or gas can be pumped or brought to the surface. NIMA GNS designator H.WLL, H.WLLQ, H.WLLS.
subclass of: Water Region
subclass of: Hydrographic Structure

Whirlpool
type: Class
comment: A turbulent, rotating movement of water in a stream. NIMA GNS designator H.WHRL.
subclass of: Water Region

Wine Region
type: Class
comment: Any Wine Region, a region where wine is produced.
subclass of: Land Region

Woman
type: Class
comment: A female human.
subclass of: Person
subclass of: Human

World Heritage Site
type: Class
comment: Any world heritage site, a old site with historic value of world magnitude to be preserved.
subclass of: Location of Special Interest

ZipCode
type: Class
comment: Part of a postal address denoting the zip code.
subclass of: ContactInformation

Zone
type: Class
comment: A land region defined to play a role. For example, a buffer between two nations in which military presence is minimal or absent or zone around the site of the Chernobyl disaster to protect people from radiation. (NIMA GNS designator A.ZN, A.ZNB.
subclass of: Land Region

Account Provider
type: ObjectProperty
comment: A relation between an account and an agent (usually organization) providing and managing it
domain: Account
range: Agent

Acquired
type: ObjectProperty
comment: The participant of an acquirement event which became a property of another participant in this event.
domain: Acquirement
range: Organization

Acquirer
type: ObjectProperty
comment: The participant of an acquirement event which became an owner of another participant in this event.
domain: Acquirement
range: Organization

Active in Sector
type: ObjectProperty
comment: Denotes that the organization is active within the industry sector
domain: Commercial Organization
range: Industry Sector
transitive over: Subsector of

Appointed by
type: ObjectProperty
comment: A concrete job position appointed by a given person.
domain: JobPosition
range: Person

Posision
type: ObjectProperty
comment: A concrete job position which is assigned to the position available in a given organization.
domain: JobPosition
range: Position in an organization

Architect
type: ObjectProperty
comment: The relation between a facility and its architect.
domain: Facility
range: Restriction
  has value: Architect
  on property: has Profession
range: Restriction
  has value: Architect
  on property: has Profession

Author
type: ObjectProperty
comment: Any author of a product. Links any object to its author (producer).
domain: Object
range: Agent
inverse of: Author

Author
type: ObjectProperty
comment: Any author of a product. Links an author (producer) to its creation .
domain: Agent
range: Object
inverse of: Author

Birthday
type: DatatypeProperty
comment: The relation between a person and the date he/she is born.
domain: Person

Place of Birth
type: ObjectProperty
comment: The relation between a person and the place he/she is born.
domain: Person
range: Location

Car Assembly in
type: ObjectProperty
comment: The relation between a car model and the country it is assembled in.
domain: Car Model
range: Country

Cause of a Death
type: ObjectProperty
comment: Any cause of death.
domain: Death
range: Event

Combatant from
type: ObjectProperty
comment: the relation between a military unit and the organization it represents in a military conflict.
domain: Military Unit
range: Organization
sub property of: partOf

Compliant with Schema
type: ObjectProperty
comment: It links a dataset with a schema it complies to.
domain: InformationResource
range: Data Schema

Combatant
type: ObjectProperty
comment: The relation between a military organization, which participates as a combatant in a military conflict
domain: Military Conflict
range: Military Organisation
sub property of: hasParticipant

Contains a Location
type: TransitiveProperty
type: ObjectProperty
comment: The relation between a location and another location that is contained by the first one.
domain: Location
range: Location
inverse of: subRegionOf
comment: Relation between two locations where the first contains the other.
inverse of: subРegionOf

Current Frequency
type: DatatypeProperty
comment: The relation between a recurring event and its frequency.
domain: Recurring Event

Date Published
type: DatatypeProperty
comment: Typically, associated with the creation or availability of the resource. Recommended best practice for encoding the date value is defined in a profile of ISO 8601 [W3CDTF] and includes (among others) dates of the form YYYY-MM-DD. This date is related to an event of publishing which here is implicit. If necessary for the task it can be made explicit in an extension of the ontology.
domain: Published Material
sub property of: hasDate

Deathday
type: DatatypeProperty
comment: The relation between a person and the date he/she died.
domain: Person

Place of Death
type: ObjectProperty
comment: The relation between a person and the place he/she died.
domain: Person
range: Location

Designer
type: ObjectProperty
comment: Any author of engineering and architecture designs. The relation between an author and the facility he has designed.
domain: Agent
range: Facility

Represented District
type: ObjectProperty
comment: the relation between an official position, usually political and the location it represents. The district represented by an official position, usually political.
domain: Official Position
range: Location

Date of Last Occurance
type: DatatypeProperty
comment: The date of the last occurrence of a recurring event.
domain: Recurring Event
sub property of: endTime

Date of First Occurance
type: DatatypeProperty
comment: The date of the first occurrence of a recurring event.
domain: Recurring Event
sub property of: startTime

fiscal net income
type: DatatypeProperty
comment: Net Income last year.
domain: Commercial Organization

fiscal sales
type: DatatypeProperty
comment: Sales last year.
domain: Commercial Organization

Genre Of
type: ObjectProperty
comment: The relation between an agent and the genre he is occupied in.
domain: Agent
range: Genre

has Address
type: ObjectProperty
comment: Relates address to an agent. Will be used for URL, email and other addresses.
range: Address
sub property of: hasContactInfo

has Airport
type: ObjectProperty
comment: A relation between a city and an airport near to the city.
domain: City
range: Airport

has Brother
type: ObjectProperty
comment: Relates a person and his/her brother.
range: Man
sub property of: hasSibling

has Capital
type: ObjectProperty
domain: Political Region
range: Capital

has Celebrity Title
type: ObjectProperty
comment: The relation between the status of celebrity and its celebrity title of notoriety in the society.
domain: Celebrity
range: Celebrity
sub property of: has Title

has Cleric Title
type: ObjectProperty
comment: The relation between a Cleric and its cleric title, like Bishop, Pole, etc.
domain: Cleric
range: Cleric
sub property of: has Title

has Code
type: DatatypeProperty
comment: Denotes that the Sector has the specified SIC code
domain: Industry Sector

Commander
type: ObjectProperty
comment: The relation between a military unit and the person who commands it.
domain: Military Unit
range: Person
sub property of: hasLeader

has Currency
type: ObjectProperty
comment: A relation between a country and the currency used within the country
domain: Country
range: Currency

has Daughter
type: ObjectProperty
comment: Relates a person and his/her daughter.
range: Woman
sub property of: hasChild

has E-mail
type: ObjectProperty
comment: Relates an object (usually a person) to its email.
range: E-mail
sub property of: has Internet Address

has Father
type: ObjectProperty
comment: Relates a person and his/her father.
range: Man
sub property of: hasParent

has Fax
type: ObjectProperty
comment: Relates an object (usually an organization) to its fax number.
range: Fax Number
sub property of: hasContactInfo

has Government
type: ObjectProperty
comment: A relation between a country and its government
domain: Country
range: Government Organization

has Husband
type: ObjectProperty
comment: Relates a woman to her spouse.
domain: Woman
range: Man
sub property of: hasSpouse

has Internet Address
type: ObjectProperty
comment: Relates an object to its internet address.
range: Internet Address
sub property of: hasContactInfo

has Minister
type: ObjectProperty
comment: The relation between a minister and his/her ministry.
domain: Ministry
range: Person
sub property of: hasEmployee

has Mobile Phone
type: ObjectProperty
comment: Relates an object (usually a person) to its mobile phone number.
sub property of: has Phone

has Mother
type: ObjectProperty
comment: Relates a person to his/her mother.
range: Woman
sub property of: hasParent

has Nobetlty Title
type: ObjectProperty
comment: The relation between the social position and the social title of nobelty.
domain: Nobelty
range: Nobelty
sub property of: has Title

has OutOfLaws Title
type: ObjectProperty
comment: The relation between the status of a criminal, and title, for instance a prisoner.
domain: OutOfLaws
range: Criminal
sub property of: has Title

has Phone
type: ObjectProperty
comment: Relates an object (usually a person or an organization) to its telephone number.
range: Phone Number
sub property of: hasContactInfo

Point Scorred in a Sport Game
type: ObjectProperty
comment: The relation between a given sport game event and a point scored in it.
domain: Sport Game
range: Sport Game Point

has Prime Minister
type: ObjectProperty
comment: The relation between a government and its head.
sub property of: has Minister

has Profession
type: ObjectProperty
comment: A relation between a person and his/her profession.
domain: Person
range: Profession

has Publisher
type: ObjectProperty
comment: An entity responsible for making the resource available. Examples of Publisher include a person, an organization, or a service. (DC2003ISO)
domain: Published Material
range: Agent

Recurring Event Instance
type: ObjectProperty
comment: The relation between a particular event as an element of a recurring event.
domain: Recurring Event
range: Event

hasRole
type: ObjectProperty
comment: Relates a happening with some of the roles in it
domain: Happening
label: has role
range: Role
inverse of: roleIn
domain: User Profile

has shareholder
type: ObjectProperty
comment: A relation between a commercial organization and a person that owns shares of the organization.
domain: Commercial Organization
sub property of: hasMember

has Sister
type: ObjectProperty
comment: Relates a person to his/her sister.
range: Woman
sub property of: hasSibling

has Title
type: ObjectProperty
comment: Generic property relating a Social Position to its name defined as an instance of a sub-class of pext:SocialFunction
domain: SocialPosition
range: Social Function

has Social Position Celebrity
type: ObjectProperty
comment: The relation between a person and the social position of Celebrity he has.
domain: Person
range: Celebrity
sub property of: hasSocialPosition
inverse of: Social Position Holder Celebrity

has Social Position Cleric
type: ObjectProperty
comment: The relation between a person and the social position of Cleric he has.
domain: Person
range: Cleric
sub property of: hasSocialPosition
inverse of: Social Position Cleric

has Social Position Nobelty
type: ObjectProperty
comment: The relation between a person and the social position of Nobelty he has.
domain: Person
range: Nobelty
sub property of: hasSocialPosition
inverse of: Social Position Holder Nobelty

has Social Position OutOfLaws
type: ObjectProperty
comment: The relation between a person and the social position of OutOfLaws he has.
domain: Person
range: OutOfLaws
sub property of: hasSocialPosition
inverse of: Social Position Holder OutOfLaws

has Son
type: ObjectProperty
comment: Relates a person to his/her son.
range: Man
sub property of: hasChild

has Stationary Phone
type: ObjectProperty
comment: Relates an object (usually a person) to its stationary phone number.
sub property of: has Phone

has Title
type: ObjectProperty
comment: Relates a job position to its title.
domain: JobPosition
range: Job Title
sub property of: has Title

has Unit
type: DatatypeProperty
comment: Relates a currency to its unit. Examples: dollar, euro, etc.
domain: Currency

has Web Page
type: ObjectProperty
comment: Relates an object (usually a person or an organization) to its web page.
range: Web Page
sub property of: has Internet Address

has Wife
type: ObjectProperty
comment: Relates a man to his spouse.
domain: Man
range: Woman
sub property of: hasSpouse

Industry
type: ObjectProperty
comment: The relation between an organization and the industry sector it is active in.
domain: Organization
range: Industry Sector

is a Birth Place of
type: ObjectProperty
comment: A place where a person is born. The relation between a location and a person who is born in this location.
domain: Location
range: Person
inverse of: Place of Birth

RDF document containing the descriptions of locations that share a common border
type: ObjectProperty
comment: The relation between an RDF document containing the descriptions of locations that share a common border
domain: Location
range: Article

Issue of
type: ObjectProperty
comment: A relation of a specific issue, number, and/or volume and a periodical publication.
domain: Issue of Periodical
range: Periodical Publication

Location Map
type: ObjectProperty
comment: The relation between a geographic region and a map depicting its location
domain: Location
range: Map

Name
type: DatatypeProperty
comment: The name of a georgaphic region.
domain: Location
label: Location Name
sub property of: name

Instrument of a Musician
type: ObjectProperty
comment: The relation between a musician and the instrument he plays
domain: Person
range: Musical Instrument

Nationality of a Person
type: ObjectProperty
comment: The nationality of a person. The relation between a person and his nationality.
domain: Person
range: Nationality

Location Nearby another Location
type: ObjectProperty
comment: The relation of a location nearby another location
domain: Location
range: Location

Location Sharing a Common Location with Another Location
type: ObjectProperty
comment: The relation of a location sharing a common location with another location
domain: Location
range: Location

of Country
type: ObjectProperty
comment: The relation between a government organization and its country.
domain: Government Organization
range: Country
sub property of: locatedIn

Official Position in
type: ObjectProperty
comment: This property models the Person->hasPosition->Location.
domain: Official Position
range: Location

within Organization
type: ObjectProperty
comment: The relation between an organization and a concrete job position in it.
domain: Organization
range: JobPosition
inverse of: withinOrganization

Owner
type: ObjectProperty
comment: The relationship between an object and an agent who owns it.
domain: Object
range: Agent

Ownership
type: ObjectProperty
comment: The relationship between an object being a property/possessions of somebody.
domain: Object
range: Possessions

a Part of a Postal Address
type: ObjectProperty
comment: Relation between the part of postal address and a given postal address.
domain: ContactInformation
range: Postal Address
sub property of: partOf

Awarded Sport Club
type: ObjectProperty
comment: The relation between the scored point in a sport game and the sport club who won it.
domain: Sport Game Point
range: Sport Club

Contact Information for a Position within Organization
type: ObjectProperty
comment: The relation between a position and the contact information for it. This contact information can be the postal address of the office for the position or an virtual address in the Internet.
domain: Position in an organization
range: ContactInformation
sub property of: hasParticipatingEntity

Position within Organization
type: ObjectProperty
comment: The relation between the job position and the organization it is available in. The organization where the job position is available.
domain: Position in an organization
range: Organization

Product
type: ObjectProperty
comment: The relation between a producer and the product produced. The producer is restricted to an organization, like Microsoft, Ford, GM, etc.
domain: Organization
range: ProductModel

Published within
type: ObjectProperty
comment: A relation between an article and the colelction within which the article is published.
domain: Article
range: Resource Collection

Social Position Holder Celebrity
type: ObjectProperty
comment: The relation between a social position of Celebrity and the person who has it.
domain: Celebrity
range: Person
sub property of: socialPositionHolder
inverse of: has Social Position Celebrity

Social Position Cleric
type: ObjectProperty
comment: The relation between a social position of Cleric and the person who has it.
domain: Cleric
range: Person
sub property of: socialPositionHolder
inverse of: has Social Position Cleric

Social Position Holder Nobelty
type: ObjectProperty
comment: The relation between a social position of Nobelty and the person who has it.
domain: Nobelty
range: Person
sub property of: socialPositionHolder
inverse of: has Social Position Nobelty

Social Position Holder OutOfLaws
type: ObjectProperty
comment: The relation between a social position of OutOfLaws and the person who has it.
domain: OutOfLaws
range: Person
sub property of: socialPositionHolder
inverse of: has Social Position OutOfLaws

Stock Exchange Index
type: DatatypeProperty
comment: Name of the company on the Stock Exchange, where it is traded. At present, if a company is traded on two SEs with different indices, there is no way to encode which of them is applicable where.
domain: Public Company

Subsector of
type: TransitiveProperty
type: ObjectProperty
comment: The general part-of relation that takes place between a whole and each of its parts. It has number of specializations.
domain: Industry Sector
range: Industry Sector
sub property of: partOf

Traded on
type: ObjectProperty
comment: Relates the Public Company to the Stock Exchange where it is traded
domain: Public Company

transmission
type: DatatypeProperty
comment: Describes the transmission type of a given car model
domain: Car Model

Device
type: Class
subclass of: ProductModel

Image
type: Class
subclass of: Document

Information Space
type: Class
subclass of: Agent

Information Space Profile
type: Class
subclass of: Profile

Profile
type: Class
subclass of: InformationResource

Region Mention
type: Class
subclass of: Section

Section
type: Class
comment: An area of a document that can be considered a mention of something.
subclass of: InformationResource

Section
type: Class
comment: An area of a document that can be considered a document in itself. Compare with pext:Mention, which is also an area of a document. Imported from the iSIM ontology.
subclass of: InformationResource

Software Agent
type: Class
comment: An artificial agent which operates in a software environment.
subclass of: Agent

User
type: Class
subclass of: Agent

User Profile
type: Class
subclass of: Profile

has Bottom Offset
type: DatatypeProperty
domain: Region Mention

hasCapabilities
type: DatatypeProperty
domain: Device

hasDevice
type: ObjectProperty
domain: User Profile
range: Device

hasEndOffset
type: DatatypeProperty
domain: Section

hasISProfile
type: ObjectProperty
comment: a relation between an Information Space and its Profile
domain: Information Space
range: Information Space Profile

has Left Offset
type: DatatypeProperty
domain: Region Mention
sub property of: hasStartOffset

hasLocation
type: ObjectProperty
domain: User Profile
range: Location

has Right Offset
type: DatatypeProperty
domain: Region Mention
sub property of: hasEndOffset

has Section
type: ObjectProperty
comment: Natural relation between documents and sections. Imported from the iSIM ontology.
domain: Document
range: Section

hasStartOffset
type: DatatypeProperty
domain: Section

hasString
type: DatatypeProperty
domain: Section

has Top Offset
type: DatatypeProperty
domain: Region Mention

hasUserProfile
type: ObjectProperty
comment: a relation between an User and its Profile
domain: User
range: User Profile

isCurrentlyInterestedIn
type: ObjectProperty
domain: User Profile
range: Topic

isInterestedIn
type: ObjectProperty
domain: User Profile
domain: Information Space Profile
range: Topic

Actor
type: Sportsman
comment: Any actor acts in a dramatic production and who works in film, television, theatre, or radio in that capacity. (Wikipedia)

Ambassador
type: Job Title
comment: Any ambassador, a title of a position of representing a country abroad

American Football Player
type: Sportsman
comment: Any player of American football.

Architect
type: Profession
comment: Any architect, a profession of planning, design and oversight of the construction of buildings. (Wikipedia)

Artist
type: Sportsman
comment: Any artist a profession engaging in a broad spectrum of activities related to creating art, practicing the arts and/or demonstrating an art. (Wikipedia)

Astronaut
type: Profession
comment: Any astronaut, a profession allowing to command, pilot, or serve as a crew member of a spacecraft. (Wikipedia)

Athlete
type: Sportsman
comment: Any athlete, a profession involving sport activities.

Australian rules football player
type: Sportsman
comment: The profession of an australian rules football player

Badminton player
type: Sportsman
comment: The profession of badminton player

Baseball player
type: Sportsman
comment: The profession of baseball player

Basketball player
type: Sportsman
comment: The profession of basketball player

Bishop
type: Cleric
comment: Any bishop, an official in the Roman-Catholic church.

Board Member
type: Job Title
comment: Any board member, a title of the member of the board of any board

Boxer
type: Sportsman
comment: The profession of boxer

British Royalty
type: Nobelty
comment: Any British Royalty, a title of a memebr of the British royal family.

CEO
type: Job Title
comment: Any CEO, a title of a chief executive officer of an organization.

Canadian Football Player
type: Profession
comment: Any player of Canadian football.

Cardinal
type: Cleric
comment: Any Cardinal, a high official in the Roman-Catholic church.

Chancellor
type: Job Title
comment: Any Chancellor, a title of various official positions in the governments of many nations. (Wikipedia)

Chess player
type: Sportsman
comment: The profession of a chess player

Comedian
type: Sportsman
comment: The profession of a comedian

Comics creator
type: Sportsman
comment: The profession of comics creator

Commander
type: Job Title
comment: Any commander, title of being commander or having a leading role in a military unit or other organization.

Congressman
type: Job Title
comment: Any Congressman, a title of a position in congress.

Cricketer
type: Profession
comment: The profession of cricketer

Deputy
type: Job Title
comment: The occupation of deputy

Model
type: Profession
comment: Any model, a profession involving posing to draw attention to a particualr object or cause.

Figure skater
type: Sportsman
comment: The profession of figure skater

Formula one racer
type: Sportsman
comment: The profession of formula one racer

Gaelic games player
type: Sportsman
comment: The profession of gaelic games player

Golf Player
type: Sportsman
comment: Any player of Golf.

Governor
type: Job Title
comment: Any Governor, a title of Governor of a district.

Gridilon Football Player
type: Sportsman
comment: Any player of a gridilon football.

Ice hockey player
type: Sportsman
comment: The profession of ice hockey player
label: Hockey player

Journalist
type: Profession
comment: Any journalist, a profession of collecting and disseminating information about current events, people, trends, and issues. (Wikipedia)

Judge
type: Profession
comment: Any judge, a profession of presiding over a court of law, either alone or as part of a panel of judges. (Wikipedia)

Lawyer
type: Profession
comment: Any lawyer, a profession of according to Black's Law Dictionary, is a person learned in the law; as an attorney, counsel or solicitor; a person who is practicing law. of judges. (Wikipedia)

Lieutenant
type: Job Title
comment: Any lieutenant, title in a military unit.

Manager
type: Job Title
comment: Any manager, the title of a management position in an organization.

Martial artist
type: Sportsman
comment: The profession of a martial artist

Mayor
type: Job Title
comment: Any Mayor, a title of the head of a municipality.

Member of Parliament
type: Job Title
comment: Any member of parliament, a title of a member of parliament.

Military Person
type: Profession
comment: Any occupation involving service in the military.

Monarch
type: Nobelty
comment: Any Monarch, a title of a head of state in a monarchy.

Musician
type: Sportsman
comment: Any musician, a profession of writing, performing, or making music. (Wikipedia)

Nascar driver
type: Sportsman
comment: The profession of nascar driver

National collegiate athletic association athlete
type: Sportsman
comment: The profession of national collegiate athletic association athlete

Philosopher
type: Profession
comment: Any philosopher, a profession of studying of general and fundamental problems, such as those connected with existence, knowledge, values, reason, mind, and language.

Playboy playmate
type: Job Title
comment: The occupation of playboy playmate

Poker player
type: Profession
comment: The profession of a poker player

Polish king
type: Nobelty
comment: A title of Polish kings.

Politician
type: Profession
comment: Any Politician, a profession of participating in the political life of a given society.

Pope
type: Cleric
comment: Any Pope. the head of the Roman-Catholic church.

President
type: Job Title
comment: Any president, a title of a president of a country or an organization.

Priest
type: Profession
comment: Any priest, a professsion of a person who is authorized to perform the sacred rites of a religion. (Wikipedia)

Prime Minister
type: Job Title
comment: Any prime minister, a title Prime minister of a country.

Rugby player
type: Sportsman
comment: The profession of rugby player

Scientist
type: Profession
comment: Any scientist, a profession of studying and making research on a particualr subject.

Senator
type: Job Title
comment: Any Senator, a title of the member of the senat.

Snooker player
type: Sportsman
comment: A profession of a sportsman that plays snooker, which is a billiard derivate. From DBPedia

Soccer Manager
type: Job Title
comment: Any soccer manager, the title of a manager of a soccer team.

Soccer player
type: Sportsman
comment: The profession of soccer player

Tennis player
type: Sportsman
comment: The profession of tennis player

Vice President
type: Job Title
comment: Any Vice President, the title of a vice president in a country or in an organization.

Vice Prime Minister
type: Job Title
comment: Any Vice Prime Minister, the title of a vice prime minister in a country.

Snooker player
type: Sportsman
comment: A profession of a volleyball player.

Wrestler
type: Sportsman
comment: The profession of wrestler

Writer
type: Sportsman
comment: Any writer, a profession of producing literary content. (Wikipedia)

Bull Fighter
type: Sportsman
comment: Professional toreros (also called matadors) who execute various formal moves which can be interpreted and innovated according to the bullfighter's style or school. Wikipedia
label: BullFighter

Swimmer
type: Sportsman
comment: The profession of swimmer

Christian Patriarch
type: Cleric
comment: Any Christian Patriarch.
label: Patriarch

Referee
type: Profession
comment: A referee is the person of authority, in a variety of sports, who is responsible for presiding over the game from a neutral point of view. (Wikipedia)

Baseball Team
type: Class
comment: Any Baseball team
subclass of: Team

Rugby Club
type: Class
comment: A sport club that organizes the playing of rugby.
comment: A rugby team
subclass of: Sport Club

Lighthouse
type: Class
comment: A tower, building, or other type of structure designed to emit light from a system of lamps and lenses and used as an aid to navigation for maritime pilots at sea or on inland waterways
subclass of: Reference Location