DPV-PD: Personal Data Extension for DPV
type: Ontology
abstract: DPV-PD is an extension to the Data Privacy Vocabulary that provides additional terms related to Personal Data categories.
contributor: Axel Polleres
contributor: Beatriz Esteves
contributor: Bert Bos
contributor: Bud Bruegger
contributor: David Hickey
contributor: Elmar Kiesling
contributor: Eva Schlehahn
contributor: Fajar J. Ekaputra
contributor: Georg P Krog
contributor: Harshvardhan J. Pandit
contributor: Javier D. Fernández
contributor: Julian Flake
contributor: Mark Lizar
contributor: Paul Ryan
contributor: Piero Bonatti
contributor: Ramisa Gachpaz Hamed
contributor: Rigo Wenning
contributor: Rob Brennan
contributor: Simon Steyskal
created: 2022-04-02
creator: Axel Polleres
creator: Harshvardhan J. Pandit
license: doc-license
modified: 2022-12-05
source: dpvcg
preferred namespace prefix: dpv-pd
preferred namespace uri: https://w3id.org/dpv/dpv-pd#
version info: 1

Personal Data Concepts
type: Collection
member: Accent
member: Account Identifier
member: Acquantaince
member: Age
member: Age Exact
member: Age Range
member: Apartment Owned
member: Association
member: Attitude
member: Authenticating
member: Authentication History
member: Bank Account
member: Behavioral
member: Biometric
member: Birth Date
member: Birth Place
member: Blood Type
member: Browser Fingerprint
member: Browser History
member: Browsing Behavior
member: Browsing Referral
member: Call Log
member: Car Owned
member: Character
member: Communication
member: Communications Metadata
member: Connection
member: Contact
member: Country
member: Credit
member: Credit Capacity
member: Credit Card Number
member: Credit Record
member: Credit Score
member: Credit Standing
member: Credit Worthiness
member: Criminal
member: Criminal Charge
member: Criminal Conviction
member: Criminal Offense
member: Criminal Pardon
member: Current Employment
member: DNA Code
member: Demeanor
member: Demographic
member: Device Applications
member: Device Based
member: Device Operating System
member: Device Software
member: Dialect
member: Digital Fingerprint
member: Disability
member: Disciplinary Action
member: Dislike
member: Divorce
member: Drug Test Result
member: Education
member: Education Experience
member: Education Qualification
member: Email Address
member: Email Address Personal
member: Email Address Work
member: Email Content
member: Employment History
member: Ethnic Origin
member: Ethnicity
member: External
member: Facial Print
member: Family
member: Family Health History
member: Family Structure
member: Favorite
member: Favorite Color
member: Favorite Food
member: Favorite Music
member: Fetish
member: Financial
member: Financial Account
member: Financial Account Number

Accent
type: Concept
created: 2019-06-04
creator: Elmar Kiesling; Harshvardhan J. Pandit
creator: Fajar Ekaputra
source: Categories-of-Personal-Information.pdf
term status: accepted
broader: Language
definition: Information about linguistic and speech accents.
is sub type of: Language

Acquantaince
type: Concept
created: 2019-06-04
creator: Elmar Kiesling; Harshvardhan J. Pandit
creator: Fajar Ekaputra
source: Categories-of-Personal-Information.pdf
term status: accepted
broader: Social Network
definition: Information about acquaintainces in a social network.
is sub type of: Social Network

Age Exact
type: Concept
created: 2022-04-20
creator: Harshvardhan J. Pandit
term status: accepted
broader: Age Range
definition: Information about the exact age (i.e. to some degree within a year, month, or day)
is sub type of: Age Range

Apartment Owned
type: Concept
created: 2019-06-04
creator: Elmar Kiesling; Harshvardhan J. Pandit
creator: Fajar Ekaputra
source: Categories-of-Personal-Information.pdf
term status: accepted
broader: House Owned
definition: Information about apartment(s) owned and its history
is sub type of: House Owned

Association
type: Concept
created: 2019-06-04
creator: Elmar Kiesling; Harshvardhan J. Pandit
creator: Fajar Ekaputra
source: Categories-of-Personal-Information.pdf
term status: accepted
broader: Social Network
definition: Information about associations in a social network with other individuals, groups, or entities e.g. friend of a friend
is sub type of: Social Network

Attitude
type: Concept
created: 2019-06-04
creator: Elmar Kiesling; Harshvardhan J. Pandit
creator: Fajar Ekaputra
source: Categories-of-Personal-Information.pdf
term status: accepted
broader: Behavioral
definition: Information about attitude.
is sub type of: Behavioral

Authentication History
type: Concept
created: 2020-11-04
creator: Georg P Krog
source: dpvcg
term status: accepted
broader: Behavioral
definition: Information about prior authentication and its outcomes such as login attempts or location.
is sub type of: Behavioral

Bank Account
type: Concept
created: 2019-06-04
creator: Elmar Kiesling; Harshvardhan J. Pandit
creator: Fajar Ekaputra
source: Categories-of-Personal-Information.pdf
term status: accepted
broader: Financial Account
definition: Information about bank accounts.
is sub type of: Financial Account

Birth Date
type: Concept
created: 2022-04-20
creator: Harshvardhan J. Pandit
term status: accepted
broader: Age
definition: Information about birth date
is sub type of: Age

Birth Place
type: Concept
created: 2022-04-20
creator: Harshvardhan J. Pandit
term status: accepted
broader: Location
definition: Information about birth place
is sub type of: Location

Blood Type
type: Concept
created: 2019-06-04
creator: Elmar Kiesling; Harshvardhan J. Pandit
creator: Fajar Ekaputra
source: Categories-of-Personal-Information.pdf
term status: accepted
broader: Medical Health
definition: Information about blood type.
is sub type of: Medical Health

Browser Fingerprint
type: Concept
created: 2019-06-04
creator: Elmar Kiesling; Harshvardhan J. Pandit
creator: Fajar Ekaputra
source: Categories-of-Personal-Information.pdf
term status: accepted
broader: Device Based
definition: Information about the web browser which is used as a 'fingerprint'
is sub type of: Device Based

Browser History
type: Concept
created: 2022-06-15
creator: Harshvardhan J. Pandit
term status: accepted
broader: Browsing Behavior
definition: Information about and including web browsing history
is sub type of: Browsing Behavior

Browsing Referral
type: Concept
created: 2020-11-04
creator: Georg P Krog
source: dpvcg
term status: accepted
broader: Browsing Behavior
definition: Information about web browsing referrer or referral, which can be based on location, targeted referrals, direct, organic search, social media or actions, campaigns.
is sub type of: Browsing Behavior

Call Log
type: Concept
created: 2019-06-04
creator: Elmar Kiesling; Harshvardhan J. Pandit
creator: Fajar Ekaputra
source: Categories-of-Personal-Information.pdf
term status: accepted
broader: Behavioral
definition: Information about the calls that an individual has made.
is sub type of: Behavioral

Car Owned
type: Concept
created: 2019-06-04
creator: Elmar Kiesling; Harshvardhan J. Pandit
creator: Fajar Ekaputra
source: Categories-of-Personal-Information.pdf
term status: accepted
broader: Ownership
definition: Information about cars ownership and ownership history.
is sub type of: Ownership

Character
type: Concept
created: 2019-06-04
creator: Elmar Kiesling; Harshvardhan J. Pandit
creator: Fajar Ekaputra
source: Categories-of-Personal-Information.pdf
term status: accepted
broader: Public Life
definition: Information about character in the public sphere
is sub type of: Public Life

Communications Metadata
type: Concept
created: 2019-06-04
creator: Elmar Kiesling; Harshvardhan J. Pandit
creator: Fajar Ekaputra
source: Categories-of-Personal-Information.pdf
term status: accepted
broader: Public Life
definition: Information about communication metadata in the public sphere
related: Interactive
is sub type of: Public Life

Connection
type: Concept
created: 2019-06-04
creator: Elmar Kiesling; Harshvardhan J. Pandit
creator: Fajar Ekaputra
source: Categories-of-Personal-Information.pdf
term status: accepted
broader: Social Network
definition: Information about and including connections in a social network
is sub type of: Social Network

Country
type: Concept
created: 2019-06-04
creator: Elmar Kiesling; Harshvardhan J. Pandit
creator: Fajar Ekaputra
source: Categories-of-Personal-Information.pdf
term status: accepted
broader: Location
definition: Information about country e.g. residence, travel.
is sub type of: Location

Credit Capacity
type: Concept
created: 2019-06-04
creator: Elmar Kiesling; Harshvardhan J. Pandit
creator: Fajar Ekaputra
source: Categories-of-Personal-Information.pdf
term status: accepted
broader: Credit
definition: Information about credit capacity.
is sub type of: Credit

Credit Card Number
type: Concept
created: 2019-06-04
creator: Elmar Kiesling; Harshvardhan J. Pandit
creator: Fajar Ekaputra
source: Categories-of-Personal-Information.pdf
term status: accepted
broader: Payment Card Number
definition: Information about credit card number
is sub type of: Payment Card Number

Credit Record
type: Concept
created: 2019-06-04
creator: Elmar Kiesling; Harshvardhan J. Pandit
creator: Fajar Ekaputra
source: Categories-of-Personal-Information.pdf
term status: accepted
broader: Credit
definition: Information about credit record.
is sub type of: Credit

Credit Score
type: Concept
created: 2019-06-04
creator: Elmar Kiesling; Harshvardhan J. Pandit
creator: Fajar Ekaputra
source: Categories-of-Personal-Information.pdf
term status: accepted
broader: Credit Worthiness
definition: Information about credit score.
is sub type of: Credit Worthiness

Credit Standing
type: Concept
created: 2019-06-04
creator: Elmar Kiesling; Harshvardhan J. Pandit
creator: Fajar Ekaputra
source: Categories-of-Personal-Information.pdf
term status: accepted
broader: Credit
definition: Information about credit standing.
is sub type of: Credit

Criminal Charge
type: Concept
created: 2019-06-04
creator: Elmar Kiesling; Harshvardhan J. Pandit
creator: Fajar Ekaputra
source: Categories-of-Personal-Information.pdf
term status: accepted
broader: Criminal
definition: Information about criminal charges.
is sub type of: Criminal

Criminal Conviction
type: Concept
created: 2019-06-04
creator: Elmar Kiesling; Harshvardhan J. Pandit
creator: Fajar Ekaputra
source: Categories-of-Personal-Information.pdf
term status: accepted
broader: Criminal
definition: Information about criminal convictions.
is sub type of: Criminal

Criminal Offense
type: Concept
created: 2022-10-22
creator: Georg P Krog
term status: accepted
broader: Criminal
definition: Information about criminal offenses
is sub type of: Criminal

Criminal Pardon
type: Concept
created: 2019-06-04
creator: Elmar Kiesling; Harshvardhan J. Pandit
creator: Fajar Ekaputra
source: Categories-of-Personal-Information.pdf
term status: accepted
broader: Criminal
definition: Information about criminal pardons.
is sub type of: Criminal

Current Employment
type: Concept
created: 2022-04-20
creator: Harshvardhan J. Pandit
term status: accepted
broader: Employment History
definition: Information about current employment
is sub type of: Employment History

DNA Code
type: Concept
created: 2019-06-04
creator: Elmar Kiesling; Harshvardhan J. Pandit
creator: Fajar Ekaputra
source: Categories-of-Personal-Information.pdf
term status: accepted
broader: Medical Health
definition: Information about DNA.
is sub type of: Medical Health

Demeanor
type: Concept
created: 2019-06-04
creator: Elmar Kiesling; Harshvardhan J. Pandit
creator: Fajar Ekaputra
source: Categories-of-Personal-Information.pdf
term status: accepted
broader: Behavioral
definition: Information about demeanor.
is sub type of: Behavioral

Device Applications
type: Concept
created: 2020-11-04
creator: Beatriz Esteves
creator: Georg P Krog
creator: Harshvardhan J. Pandit
creator: Paul Ryan
source: dpvcg
term status: accepted
broader: Device Software
definition: Information about applications or application-like software on a device.
is sub type of: Device Software

Device Operating System
type: Concept
created: 2020-11-04
creator: Beatriz Esteves
creator: Georg P Krog
creator: Harshvardhan J. Pandit
creator: Paul Ryan
source: dpvcg
term status: accepted
broader: Device Software
definition: Information about the operating system (OS) or system software that manages hardware or software resources.
is sub type of: Device Software

Dialect
type: Concept
created: 2019-06-04
creator: Elmar Kiesling; Harshvardhan J. Pandit
creator: Fajar Ekaputra
source: Categories-of-Personal-Information.pdf
term status: accepted
broader: Language
definition: Information about linguistic dialects.
is sub type of: Language

Digital Fingerprint
type: Concept
created: 2022-06-15
creator: Harshvardhan J. Pandit
term status: accepted
broader: Tracking
definition: Information about a 'digital fingerprint' created for identification
is sub type of: Tracking

Disability
type: Concept
created: 2019-06-04
creator: Elmar Kiesling; Harshvardhan J. Pandit
creator: Fajar Ekaputra
source: Categories-of-Personal-Information.pdf
term status: accepted
broader: Medical Health
definition: Information about disabilities.
is sub type of: Medical Health

Disciplinary Action
type: Concept
created: 2019-06-04
creator: Elmar Kiesling; Harshvardhan J. Pandit
creator: Fajar Ekaputra
source: Categories-of-Personal-Information.pdf
term status: accepted
broader: Professional
definition: Information about disciplinary actions and its history
is sub type of: Professional

Dislike
type: Concept
created: 2019-06-04
creator: Elmar Kiesling; Harshvardhan J. Pandit
creator: Fajar Ekaputra
source: Categories-of-Personal-Information.pdf
term status: accepted
broader: Interest
definition: Information about dislikes or preferences regarding repulsions.
is sub type of: Interest

Divorce
type: Concept
created: 2019-06-04
creator: Elmar Kiesling; Harshvardhan J. Pandit
creator: Fajar Ekaputra
source: Categories-of-Personal-Information.pdf
term status: accepted
broader: Family Structure
definition: Information about divorce(s).
is sub type of: Family Structure

Drug Test Result
type: Concept
created: 2019-06-04
creator: Elmar Kiesling; Harshvardhan J. Pandit
creator: Fajar Ekaputra
source: Categories-of-Personal-Information.pdf
term status: accepted
broader: Medical Health
definition: Information about drug test results.
is sub type of: Medical Health

Education Experience
type: Concept
created: 2022-04-20
creator: Harshvardhan J. Pandit
term status: accepted
broader: Education
definition: Information about education experience e.g. attending a university
is sub type of: Education

Education Qualification
type: Concept
created: 2022-04-20
creator: Harshvardhan J. Pandit
term status: accepted
broader: Education
definition: Information about educational qualifications
is sub type of: Education

Email Address Personal
type: Concept
created: 2022-04-20
creator: Harshvardhan J. Pandit
term status: accepted
broader: Email Address
definition: Information about Email address used in Personal capacity
is sub type of: Email Address

Email Address Work
type: Concept
created: 2022-04-20
creator: Harshvardhan J. Pandit
term status: accepted
broader: Email Address
definition: Information about Email address used for Work or in Professional capacity
is sub type of: Email Address

Email Content
type: Concept
created: 2019-06-04
creator: Elmar Kiesling; Harshvardhan J. Pandit
creator: Fajar Ekaputra
source: Categories-of-Personal-Information.pdf
term status: accepted
broader: Communication
definition: Information about the contents of Emails sent or received
is sub type of: Communication

Facial Print
type: Concept
created: 2022-06-15
creator: Harshvardhan J. Pandit
term status: accepted
broader: Biometric
definition: Information about facial print or pattern
is sub type of: Biometric

Family Health History
type: Concept
created: 2019-06-04
creator: Elmar Kiesling; Harshvardhan J. Pandit
creator: Fajar Ekaputra
source: Categories-of-Personal-Information.pdf
term status: accepted
broader: Health History
definition: Information about family health history.
is sub type of: Health History

Favorite Color
type: Concept
created: 2019-06-04
creator: Elmar Kiesling; Harshvardhan J. Pandit
creator: Fajar Ekaputra
source: Categories-of-Personal-Information.pdf
term status: accepted
broader: Favorite
definition: Information about favorite color.
is sub type of: Favorite

Favorite Food
type: Concept
created: 2019-06-04
creator: Elmar Kiesling; Harshvardhan J. Pandit
creator: Fajar Ekaputra
source: Categories-of-Personal-Information.pdf
term status: accepted
broader: Favorite
definition: Information about favorite food.
is sub type of: Favorite

Favorite Music
type: Concept
created: 2019-06-04
creator: Elmar Kiesling; Harshvardhan J. Pandit
creator: Fajar Ekaputra
source: Categories-of-Personal-Information.pdf
term status: accepted
broader: Favorite
definition: Information about favorite music.
is sub type of: Favorite

Fetish
type: Concept
created: 2019-06-04
creator: Elmar Kiesling; Harshvardhan J. Pandit
creator: Fajar Ekaputra
source: Categories-of-Personal-Information.pdf
term status: accepted
broader: Sexual
definition: Information about an individual's sexual fetishes
is sub type of: Sexual

Financial Account Number
type: Concept
created: 2019-06-04
creator: Elmar Kiesling; Harshvardhan J. Pandit
creator: Fajar Ekaputra
source: Categories-of-Personal-Information.pdf
term status: accepted
broader: Account Identifier
definition: Information about financial account number
is sub type of: Account Identifier

Financial Status
type: Concept
created: 2022-06-15
creator: Harshvardhan J. Pandit
term status: accepted
broader: Financial
definition: Information about financial status or standing
is sub type of: Financial

Fingerprint
type: Concept
created: 2019-06-04
creator: Elmar Kiesling; Harshvardhan J. Pandit
creator: Fajar Ekaputra
source: Categories-of-Personal-Information.pdf
term status: accepted
broader: Biometric
definition: Information about fingerprint used for biometric purposes.
is sub type of: Biometric

Friend
type: Concept
created: 2019-06-04
creator: Elmar Kiesling; Harshvardhan J. Pandit
creator: Fajar Ekaputra
source: Categories-of-Personal-Information.pdf
term status: accepted
broader: Social Network
definition: Information about friends in a social network, including aspects of friendships such as years together or nature of friendship.
is sub type of: Social Network

GPS Coordinate
type: Concept
created: 2019-06-04
creator: Elmar Kiesling; Harshvardhan J. Pandit
creator: Fajar Ekaputra
source: Categories-of-Personal-Information.pdf
term status: accepted
broader: Location
definition: Information about location expressed using Global Position System coordinates (GPS)
is sub type of: Location

Gender
type: Concept
created: 2019-06-04
creator: Elmar Kiesling; Harshvardhan J. Pandit
creator: Fajar Ekaputra
source: Categories-of-Personal-Information.pdf
term status: accepted
broader: Physical Characteristic
definition: Information about gender
is sub type of: Physical Characteristic

General Reputation
type: Concept
created: 2019-06-04
creator: Elmar Kiesling; Harshvardhan J. Pandit
creator: Fajar Ekaputra
source: Categories-of-Personal-Information.pdf
term status: accepted
broader: Public Life
definition: Information about reputation in the public sphere
is sub type of: Public Life

Genetic
type: Concept
created: 2022-05-18
creator: Harshvardhan J. Pandit
term status: accepted
broader: Health
definition: Information about inherited or acquired genetic characteristics
is sub type of: Health

Geographic
type: Concept
created: 2019-06-04
creator: Elmar Kiesling; Harshvardhan J. Pandit
creator: Fajar Ekaputra
source: Categories-of-Personal-Information.pdf
term status: accepted
broader: Demographic
definition: Information about location or based on geography (e.g. home address)
is sub type of: Demographic

Hair Color
type: Concept
created: 2019-06-04
creator: Elmar Kiesling; Harshvardhan J. Pandit
creator: Fajar Ekaputra
source: Categories-of-Personal-Information.pdf
term status: accepted
broader: Physical Characteristic
definition: Information about hair color
is sub type of: Physical Characteristic

Health Record
type: Concept
created: 2019-06-04
creator: Elmar Kiesling; Harshvardhan J. Pandit
creator: Fajar Ekaputra
source: Categories-of-Personal-Information.pdf
term status: accepted
broader: Medical Health
definition: Information about health record.
is sub type of: Medical Health

Height
type: Concept
created: 2019-06-04
creator: Elmar Kiesling; Harshvardhan J. Pandit
creator: Fajar Ekaputra
source: Categories-of-Personal-Information.pdf
term status: accepted
broader: Physical Characteristic
definition: Information about physical height
is sub type of: Physical Characteristic

Household
type: Concept
created: 2022-06-15
creator: Harshvardhan J. Pandit
term status: accepted
broader: PersonalData
definition: Information about personal or household activities
is sub type of: PersonalData

IP Address
type: Concept
created: 2019-06-04
creator: Elmar Kiesling; Harshvardhan J. Pandit
creator: Fajar Ekaputra
source: Categories-of-Personal-Information.pdf
term status: accepted
broader: Device Based
definition: Information about the Internet Protocol (IP) address of a device
is sub type of: Device Based

Identifier
type: Concept
created: 2022-06-15
creator: Harshvardhan J. Pandit
term status: accepted
broader: Tracking
definition: Information about an identifier or name used for identification
is sub type of: Tracking

Income
type: Concept
created: 2019-06-04
creator: Elmar Kiesling; Harshvardhan J. Pandit
creator: Fajar Ekaputra
source: Categories-of-Personal-Information.pdf
term status: accepted
broader: Transactional
definition: Information about financial income e.g. for individual or household or family
is sub type of: Transactional

Income Bracket
type: Concept
created: 2019-06-04
creator: Elmar Kiesling; Harshvardhan J. Pandit
creator: Fajar Ekaputra
source: Categories-of-Personal-Information.pdf
term status: accepted
broader: Demographic
definition: Information about income bracket.
is sub type of: Demographic

Individual Health History
type: Concept
created: 2019-06-04
creator: Elmar Kiesling; Harshvardhan J. Pandit
creator: Fajar Ekaputra
source: Categories-of-Personal-Information.pdf
term status: accepted
broader: Health History
definition: Information about information health history.
is sub type of: Health History

Insurance
type: Concept
created: 2022-04-20
creator: Harshvardhan J. Pandit
term status: accepted
broader: Financial
definition: Information about Insurance
is sub type of: Financial

Intention
type: Concept
created: 2019-06-04
creator: Elmar Kiesling; Harshvardhan J. Pandit
creator: Fajar Ekaputra
source: Categories-of-Personal-Information.pdf
term status: accepted
broader: Preference
definition: Information about intentions
is sub type of: Preference

Interaction
type: Concept
created: 2019-06-04
creator: Elmar Kiesling; Harshvardhan J. Pandit
creator: Fajar Ekaputra
source: Categories-of-Personal-Information.pdf
term status: accepted
broader: Public Life
definition: Information about interactions in the public sphere
is sub type of: Public Life

Job
type: Concept
created: 2019-06-04
creator: Elmar Kiesling; Harshvardhan J. Pandit
creator: Fajar Ekaputra
source: Categories-of-Personal-Information.pdf
term status: accepted
broader: Professional
definition: Information about professional jobs
is sub type of: Professional

Life History
type: Concept
created: 2019-06-04
creator: Elmar Kiesling; Harshvardhan J. Pandit
creator: Fajar Ekaputra
source: Categories-of-Personal-Information.pdf
term status: accepted
broader: Historical
definition: Information about personal history regarding events or activities - including their occurrences that might be directly related or have had an influence (e.g. World War, 9/11)
is sub type of: Historical

Like
type: Concept
created: 2019-06-04
creator: Elmar Kiesling; Harshvardhan J. Pandit
creator: Fajar Ekaputra
source: Categories-of-Personal-Information.pdf
term status: accepted
broader: Interest
definition: Information about likes or preferences regarding attractions.
is sub type of: Interest

Link Clicked
type: Concept
created: 2019-06-04
creator: Elmar Kiesling; Harshvardhan J. Pandit
creator: Fajar Ekaputra
source: Categories-of-Personal-Information.pdf
term status: accepted
broader: Behavioral
definition: Information about the links that an individual has clicked.
related: Navigation
is sub type of: Behavioral

Loan Record
type: Concept
created: 2019-06-04
creator: Elmar Kiesling; Harshvardhan J. Pandit
creator: Fajar Ekaputra
source: Categories-of-Personal-Information.pdf
term status: accepted
broader: Transactional
definition: Information about loans, whether applied, provided or rejected, and its history
is sub type of: Transactional

MAC Address
type: Concept
created: 2019-06-04
creator: Elmar Kiesling; Harshvardhan J. Pandit
creator: Fajar Ekaputra
source: Categories-of-Personal-Information.pdf
term status: accepted
broader: Device Based
definition: Information about the Media Access Control (MAC) address of a device
is sub type of: Device Based

Marital Status
type: Concept
created: 2019-06-04
creator: Elmar Kiesling; Harshvardhan J. Pandit
creator: Fajar Ekaputra
source: Categories-of-Personal-Information.pdf
term status: accepted
broader: Public Life
definition: Information about marital status and history
is sub type of: Public Life

Marriage
type: Concept
created: 2019-06-04
creator: Elmar Kiesling; Harshvardhan J. Pandit
creator: Fajar Ekaputra
source: Categories-of-Personal-Information.pdf
term status: accepted
broader: Family Structure
definition: Information about marriage(s).
is sub type of: Family Structure

Mental Health
type: Concept
created: 2019-06-04
creator: Elmar Kiesling; Harshvardhan J. Pandit
creator: Fajar Ekaputra
source: Categories-of-Personal-Information.pdf
term status: accepted
broader: Health
definition: Information about mental health.
is sub type of: Health

Name
type: Concept
created: 2019-06-04
creator: Elmar Kiesling; Harshvardhan J. Pandit
creator: Fajar Ekaputra
source: Categories-of-Personal-Information.pdf
term status: accepted
broader: Identifying
definition: Information about names associated or used as given name or nickname.
is sub type of: Identifying

Nationality
type: Concept
created: 2022-04-20
creator: https://www.w3.org/2022/04/20-dpvcg-minutes.html
term status: accepted
broader: External
definition: Information about nationality
is sub type of: External

Offspring
type: Concept
created: 2019-06-04
creator: Elmar Kiesling; Harshvardhan J. Pandit
creator: Fajar Ekaputra
source: Categories-of-Personal-Information.pdf
term status: accepted
broader: Family Structure
definition: Information about offspring(s).
is sub type of: Family Structure

Opinion
type: Concept
created: 2019-06-04
creator: Elmar Kiesling; Harshvardhan J. Pandit
creator: Fajar Ekaputra
source: Categories-of-Personal-Information.pdf
term status: accepted
broader: Preference
definition: Information about opinions
is sub type of: Preference

PIN Code
type: Concept
created: 2019-06-04
creator: Elmar Kiesling; Harshvardhan J. Pandit
creator: Fajar Ekaputra
source: Categories-of-Personal-Information.pdf
term status: accepted
broader: Authenticating
definition: Information about Personal identification number (PIN), which is usually used in the process of authenticating the individual as an user accessing a system.
is sub type of: Authenticating

Parent
type: Concept
created: 2019-06-04
creator: Elmar Kiesling; Harshvardhan J. Pandit
creator: Fajar Ekaputra
source: Categories-of-Personal-Information.pdf
term status: accepted
broader: Family Structure
definition: Information about parent(s).
is sub type of: Family Structure

Passport
type: Concept
created: 2022-04-20
creator: Harshvardhan J. Pandit
term status: accepted
broader: Official ID
definition: Information about passport
is sub type of: Official ID

Password
type: Concept
created: 2019-06-04
creator: Elmar Kiesling; Harshvardhan J. Pandit
creator: Fajar Ekaputra
source: Categories-of-Personal-Information.pdf
term status: accepted
broader: Authenticating
definition: Information about password used in the process of authenticating the individual as an user accessing a system.
is sub type of: Authenticating

Past Employment
type: Concept
created: 2022-04-20
creator: Harshvardhan J. Pandit
term status: accepted
broader: Employment History
definition: Information about past employment
is sub type of: Employment History

Payment Card Expiry
type: Concept
created: 2020-11-04
creator: Georg P Krog
source: dpvcg
term status: accepted
broader: Payment Card
definition: Information about payment card expiry such as a date.
is sub type of: Payment Card

Personal Documents
type: Concept
created: 2022-06-15
creator: Harshvardhan J. Pandit
term status: accepted
broader: External
definition: Information about and including personal documents e.g. diaries or journals
is sub type of: External

Personal Possession
type: Concept
created: 2019-06-04
creator: Elmar Kiesling; Harshvardhan J. Pandit
creator: Fajar Ekaputra
source: Categories-of-Personal-Information.pdf
term status: accepted
broader: Ownership
definition: Information about personal possessions.
is sub type of: Ownership

Personality
type: Concept
created: 2019-06-04
creator: Elmar Kiesling; Harshvardhan J. Pandit
creator: Fajar Ekaputra
source: Categories-of-Personal-Information.pdf
term status: accepted
broader: Behavioral
definition: Information about personality (e.g., categorization in terms of the Big Five personality traits)
is sub type of: Behavioral

Physical Address
type: Concept
created: 2019-06-04
creator: Elmar Kiesling; Harshvardhan J. Pandit
creator: Fajar Ekaputra
source: Categories-of-Personal-Information.pdf
term status: accepted
broader: Contact
definition: Information about physical address.
is sub type of: Contact

Physical Health
type: Concept
created: 2019-06-04
creator: Elmar Kiesling; Harshvardhan J. Pandit
creator: Fajar Ekaputra
source: Categories-of-Personal-Information.pdf
term status: accepted
broader: Health
definition: Information about physical health.
is sub type of: Health

Physical Trait
type: Concept
created: 2019-06-04
creator: Elmar Kiesling; Harshvardhan J. Pandit
creator: Fajar Ekaputra
source: Categories-of-Personal-Information.pdf
term status: accepted
broader: Demographic
definition: Information about defining traits or features regarding the body.
is sub type of: Demographic

Picture
type: Concept
created: 2019-06-04
creator: Elmar Kiesling; Harshvardhan J. Pandit
creator: Fajar Ekaputra
source: Categories-of-Personal-Information.pdf
term status: accepted
broader: Identifying
definition: Information about visual representation or image e.g. profile photo.
is sub type of: Identifying

Piercing
type: Concept
created: 2019-06-04
creator: Elmar Kiesling; Harshvardhan J. Pandit
creator: Fajar Ekaputra
source: Categories-of-Personal-Information.pdf
term status: accepted
broader: Physical Characteristic
definition: Information about piercings
is sub type of: Physical Characteristic

Prescription
type: Concept
created: 2019-06-04
creator: Elmar Kiesling; Harshvardhan J. Pandit
creator: Fajar Ekaputra
source: Categories-of-Personal-Information.pdf
term status: accepted
broader: Medical Health
definition: Information about medical and pharmaceutical prescriptions
is sub type of: Medical Health

Privacy Preference
type: Concept
created: 2019-06-04
creator: Elmar Kiesling; Harshvardhan J. Pandit
creator: Fajar Ekaputra
source: Categories-of-Personal-Information.pdf
term status: accepted
broader: Preference
definition: Information about privacy preferences
is sub type of: Preference

Proclivitie
type: Concept
created: 2019-06-04
creator: Elmar Kiesling; Harshvardhan J. Pandit
creator: Fajar Ekaputra
source: Categories-of-Personal-Information.pdf
term status: accepted
broader: Sexual
definition: Information about proclivities in a sexual context
is sub type of: Sexual

Professional Certification
type: Concept
created: 2019-06-04
creator: Elmar Kiesling; Harshvardhan J. Pandit
creator: Fajar Ekaputra
source: Categories-of-Personal-Information.pdf
term status: accepted
broader: Professional
definition: Information about professional certifications
is sub type of: Professional

Professional Evaluation
type: Concept
created: 2019-06-04
creator: Elmar Kiesling; Harshvardhan J. Pandit
creator: Fajar Ekaputra
source: Categories-of-Personal-Information.pdf
term status: accepted
broader: Professional
definition: Information about professional evaluations
is sub type of: Professional

Professional Interview
type: Concept
created: 2019-06-04
creator: Elmar Kiesling; Harshvardhan J. Pandit
creator: Fajar Ekaputra
source: Categories-of-Personal-Information.pdf
term status: accepted
broader: Professional
definition: Information about professional interviews
is sub type of: Professional

Profile
type: Concept
created: 2022-06-15
creator: Harshvardhan J. Pandit
term status: accepted
broader: PersonalData
definition: Profile or user profile is information and representation of characteristics associated with person(s) or group(s)
is sub type of: PersonalData

Publicly Available Social Media
type: Concept
created: 2022-06-15
creator: Harshvardhan J. Pandit
term status: accepted
broader: Social Media
definition: Information about social media that is publicly available
is sub type of: Social Media

Purchase
type: Concept
created: 2019-06-04
creator: Elmar Kiesling; Harshvardhan J. Pandit
creator: Fajar Ekaputra
source: Categories-of-Personal-Information.pdf
term status: accepted
broader: Transactional
definition: Information about purchases such as items bought e.g. grocery or clothing
related: Purchase
is sub type of: Transactional

Purchases and Spending Habit
type: Concept
created: 2019-06-04
creator: Elmar Kiesling; Harshvardhan J. Pandit
creator: Fajar Ekaputra
source: Categories-of-Personal-Information.pdf
term status: accepted
broader: Transactional
definition: Information about analysis of purchases made and money spent expressed as a habit e.g. monthly shopping trends
is sub type of: Transactional

Reference
type: Concept
created: 2019-06-04
creator: Elmar Kiesling; Harshvardhan J. Pandit
creator: Fajar Ekaputra
source: Categories-of-Personal-Information.pdf
term status: accepted
broader: Professional
definition: Information about references in the professional context
is sub type of: Professional

Relationship
type: Concept
created: 2019-06-04
creator: Elmar Kiesling; Harshvardhan J. Pandit
creator: Fajar Ekaputra
source: Categories-of-Personal-Information.pdf
term status: accepted
broader: Family
definition: Information about relationships and relationship history.
is sub type of: Family

Reliability
type: Concept
created: 2022-06-15
creator: Harshvardhan J. Pandit
term status: accepted
broader: Behavioral
definition: Information about reliability (e.g. of a person)
is sub type of: Behavioral

Retina
type: Concept
created: 2019-06-04
creator: Elmar Kiesling; Harshvardhan J. Pandit
creator: Fajar Ekaputra
source: Categories-of-Personal-Information.pdf
term status: accepted
broader: Biometric
definition: Information about retina and the retinal patterns.
is sub type of: Biometric

Room Number
type: Concept
created: 2019-06-04
creator: Elmar Kiesling; Harshvardhan J. Pandit
creator: Fajar Ekaputra
source: Categories-of-Personal-Information.pdf
term status: accepted
broader: Location
definition: Information about location expressed as Room number or similar numbering systems
is sub type of: Location

Salary
type: Concept
created: 2019-06-04
creator: Elmar Kiesling; Harshvardhan J. Pandit
creator: Fajar Ekaputra
source: Categories-of-Personal-Information.pdf
term status: accepted
broader: Professional
definition: Information about salary
is sub type of: Professional

Sale
type: Concept
created: 2019-06-04
creator: Elmar Kiesling; Harshvardhan J. Pandit
creator: Fajar Ekaputra
source: Categories-of-Personal-Information.pdf
term status: accepted
broader: Transactional
definition: Information about sales e.g. selling of goods or services
is sub type of: Transactional

School
type: Concept
created: 2019-06-04
creator: Elmar Kiesling; Harshvardhan J. Pandit
creator: Fajar Ekaputra
source: Categories-of-Personal-Information.pdf
term status: accepted
broader: Professional
definition: Information about school such as name of school, conduct, or grades obtained.
is sub type of: Professional

Secret Text
type: Concept
created: 2019-06-04
creator: Elmar Kiesling; Harshvardhan J. Pandit
creator: Fajar Ekaputra
source: Categories-of-Personal-Information.pdf
term status: accepted
broader: Authenticating
definition: Information about secret text used in the process of authenticating the individual as an user accessing a system, e.g., when recovering a lost password.
is sub type of: Authenticating

Sexual History
type: Concept
created: 2019-06-04
creator: Elmar Kiesling; Harshvardhan J. Pandit
creator: Fajar Ekaputra
source: Categories-of-Personal-Information.pdf
term status: accepted
broader: Sexual
definition: Information about sexual history
is sub type of: Sexual

Sexual Preference
type: Concept
created: 2019-06-04
creator: Elmar Kiesling; Harshvardhan J. Pandit
creator: Fajar Ekaputra
source: Categories-of-Personal-Information.pdf
term status: accepted
broader: Sexual
definition: Information about sexual preferences
is sub type of: Sexual

Sibling
type: Concept
created: 2019-06-04
creator: Elmar Kiesling; Harshvardhan J. Pandit
creator: Fajar Ekaputra
source: Categories-of-Personal-Information.pdf
term status: accepted
broader: Family Structure
definition: Information about sibling(s).
is sub type of: Family Structure

Skin Tone
type: Concept
created: 2019-06-04
creator: Elmar Kiesling; Harshvardhan J. Pandit
creator: Fajar Ekaputra
source: Categories-of-Personal-Information.pdf
term status: accepted
broader: Physical Characteristic
definition: Information about skin tone
is sub type of: Physical Characteristic

Social Media Communication
type: Concept
created: 2019-06-04
creator: Elmar Kiesling; Harshvardhan J. Pandit
creator: Fajar Ekaputra
source: Categories-of-Personal-Information.pdf
term status: accepted
broader: Communication
definition: Information about social media communication, including the communication itself and metadata.
related: Social
is sub type of: Communication

Social Status
type: Concept
created: 2019-06-04
creator: Elmar Kiesling; Harshvardhan J. Pandit
creator: Fajar Ekaputra
source: Categories-of-Personal-Information.pdf
term status: accepted
broader: Public Life
definition: Information about social status
is sub type of: Public Life

TV Viewing Behavior
type: Concept
created: 2019-11-26
creator: Harshvardhan J. Pandit
creator: Rudy Jacob
source: specialprivacy.ercim.eu
term status: accepted
broader: Service Consumption Behavior
definition: Information about TV viewing Behavior, such as timestamps of channel change, duration of viewership, content consumed
is sub type of: Service Consumption Behavior

Tattoo
type: Concept
created: 2019-06-04
creator: Elmar Kiesling; Harshvardhan J. Pandit
creator: Fajar Ekaputra
source: Categories-of-Personal-Information.pdf
term status: accepted
broader: Physical Characteristic
definition: Information about tattoos
is sub type of: Physical Characteristic

Tax
type: Concept
created: 2019-06-04
creator: Elmar Kiesling; Harshvardhan J. Pandit
creator: Fajar Ekaputra
source: Categories-of-Personal-Information.pdf
term status: accepted
broader: Transactional
definition: Information about financial tax e.g. tax records or tax due
is sub type of: Transactional

Telephone Number
type: Concept
created: 2019-06-04
creator: Elmar Kiesling; Harshvardhan J. Pandit
creator: Fajar Ekaputra
source: Categories-of-Personal-Information.pdf
term status: accepted
broader: Contact
definition: Information about telephone number.
is sub type of: Contact

Thought
type: Concept
created: 2019-06-04
creator: Elmar Kiesling; Harshvardhan J. Pandit
creator: Fajar Ekaputra
source: Categories-of-Personal-Information.pdf
term status: accepted
broader: Knowledge and Beliefs
definition: Information about thoughts
is sub type of: Knowledge and Beliefs

Transaction
type: Concept
created: 2019-06-04
creator: Elmar Kiesling; Harshvardhan J. Pandit
creator: Fajar Ekaputra
source: Categories-of-Personal-Information.pdf
term status: accepted
broader: Transactional
definition: Information about financial transactions e.g. bank transfers
is sub type of: Transactional

Travel History
type: Concept
created: 2022-04-20
creator: Harshvardhan J. Pandit
term status: accepted
broader: Location
definition: Information about travel history
is sub type of: Location

UID
type: Concept
created: 2019-06-04
creator: Elmar Kiesling; Harshvardhan J. Pandit
creator: Fajar Ekaputra
source: Categories-of-Personal-Information.pdf
term status: accepted
broader: Identifying
definition: Information about unique identifiers.
related: UniqueId
is sub type of: Identifying

User agent
type: Concept
created: 2022-06-15
creator: Georg P Krog
term status: accepted
broader: Tracking
definition: Information about software acting on behalf of users e.g. web browser
is sub type of: Tracking

Username
type: Concept
created: 2019-06-04
creator: Elmar Kiesling; Harshvardhan J. Pandit
creator: Fajar Ekaputra
source: Categories-of-Personal-Information.pdf
term status: accepted
broader: Identifying
definition: Information about usernames.
is sub type of: Identifying

Vehicle License Number
type: Concept
created: 2022-06-15
creator: Harshvardhan J. Pandit
term status: accepted
broader: Vehicle License
definition: Information about vehicle license number
is sub type of: Vehicle License

Vehicle License Registration
type: Concept
created: 2022-06-15
creator: Harshvardhan J. Pandit
term status: accepted
broader: Vehicle License
definition: Information about vehicle license registration
is sub type of: Vehicle License

Voice Communication Recording
type: Concept
created: 2019-06-04
creator: Elmar Kiesling; Harshvardhan J. Pandit
creator: Fajar Ekaputra
source: Categories-of-Personal-Information.pdf
term status: accepted
broader: Communication
definition: Information about vocal recorded communication (e.g. telephony, VoIP)
is sub type of: Communication

Voice Mail
type: Concept
created: 2019-06-04
creator: Elmar Kiesling; Harshvardhan J. Pandit
creator: Fajar Ekaputra
source: Categories-of-Personal-Information.pdf
term status: accepted
broader: Communication
definition: Information about voice mail messages.
is sub type of: Communication

Weight
type: Concept
created: 2019-06-04
creator: Elmar Kiesling; Harshvardhan J. Pandit
creator: Fajar Ekaputra
source: Categories-of-Personal-Information.pdf
term status: accepted
broader: Physical Characteristic
definition: Information about physical weight
is sub type of: Physical Characteristic

Work Environment
type: Concept
created: 2022-06-15
creator: Harshvardhan J. Pandit
term status: accepted
broader: Professional
definition: Information about work environments
is sub type of: Professional

Work History
type: Concept
created: 2019-06-04
creator: Elmar Kiesling; Harshvardhan J. Pandit
creator: Fajar Ekaputra
source: Categories-of-Personal-Information.pdf
term status: accepted
broader: Professional
definition: Information about work history in a professional context
is sub type of: Professional

Ethnic Origin
type: Concept
created: 2019-06-04
creator: Elmar Kiesling; Harshvardhan J. Pandit
creator: Fajar Ekaputra
source: Categories-of-Personal-Information.pdf
term status: accepted
broader: SpecialCategoryPersonalData
broader: Ethnicity
definition: Information about ethnic origin
is sub type of: SpecialCategoryPersonalData
is sub type of: Ethnicity

Performance at Work
type: Concept
created: 2022-06-15
creator: Harshvardhan J. Pandit
term status: accepted
broader: Behavioral
broader: Professional
definition: Information about performance at work or within work environments
is sub type of: Behavioral
is sub type of: Professional

Philosophical Belief
type: Concept
created: 2019-06-04
creator: Elmar Kiesling; Harshvardhan J. Pandit
creator: Fajar Ekaputra
source: Categories-of-Personal-Information.pdf
term status: accepted
broader: SpecialCategoryPersonalData
broader: Knowledge and Beliefs
definition: Information about philosophical beliefs.
is sub type of: SpecialCategoryPersonalData
is sub type of: Knowledge and Beliefs

Political Affiliation
type: Concept
created: 2019-06-04
creator: Elmar Kiesling; Harshvardhan J. Pandit
creator: Fajar Ekaputra
source: Categories-of-Personal-Information.pdf
term status: accepted
broader: SpecialCategoryPersonalData
broader: Public Life
definition: Information about political affiliation and history
related: Political
is sub type of: SpecialCategoryPersonalData
is sub type of: Public Life

Political Opinion
type: Concept
created: 2022-05-18
creator: Harshvardhan J. Pandit
term status: accepted
broader: SpecialCategoryPersonalData
broader: Public Life
definition: Information about opinions regarding politics and political topics
is sub type of: SpecialCategoryPersonalData
is sub type of: Public Life

Race
type: Concept
created: 2019-06-04
creator: Elmar Kiesling; Harshvardhan J. Pandit
creator: Fajar Ekaputra
source: Categories-of-Personal-Information.pdf
term status: accepted
broader: SpecialCategoryPersonalData
broader: Ethnicity
definition: Information about race or racial history.
is sub type of: SpecialCategoryPersonalData
is sub type of: Ethnicity

Religion
type: Concept
created: 2019-06-04
creator: Elmar Kiesling; Harshvardhan J. Pandit
creator: Fajar Ekaputra
source: Categories-of-Personal-Information.pdf
term status: accepted
broader: SpecialCategoryPersonalData
broader: Public Life
definition: Information about religion, religious inclinations, and religious history.
is sub type of: SpecialCategoryPersonalData
is sub type of: Public Life

Religious Belief
type: Concept
created: 2019-06-04
creator: Elmar Kiesling; Harshvardhan J. Pandit
creator: Fajar Ekaputra
source: Categories-of-Personal-Information.pdf
term status: accepted
broader: SpecialCategoryPersonalData
broader: Knowledge and Beliefs
definition: Information about religion and religious beliefs.
is sub type of: SpecialCategoryPersonalData
is sub type of: Knowledge and Beliefs

Trade Union Membership
type: Concept
created: 2022-05-18
creator: Harshvardhan J. Pandit
term status: accepted
broader: SpecialCategoryPersonalData
broader: Group Membership
definition: Information about trade union memberships and related topics
is sub type of: SpecialCategoryPersonalData
is sub type of: Group Membership

Vehicle Usage
type: Concept
created: 2022-06-15
creator: Harshvardhan J. Pandit
term status: accepted
broader: Behavioral
broader: Vehicle
definition: Information about usage of vehicles, e.g. driving statistics
is sub type of: Behavioral
is sub type of: Vehicle

Age Range
type: Concept
created: 2022-04-20
creator: Harshvardhan J. Pandit
term status: accepted
broader: Age
definition: Information about age range i.e. inexact age to some degree (i.e. some years)
narrower: Age Exact
is sub type of: Age

Credit Worthiness
type: Concept
created: 2019-06-04
creator: Elmar Kiesling; Harshvardhan J. Pandit
creator: Fajar Ekaputra
source: Categories-of-Personal-Information.pdf
term status: accepted
broader: Credit
definition: Information about credit worthiness.
narrower: Credit Score
is sub type of: Credit

Group Membership
type: Concept
created: 2019-06-04
creator: Elmar Kiesling; Harshvardhan J. Pandit
creator: Fajar Ekaputra
source: Categories-of-Personal-Information.pdf
term status: accepted
broader: Social Network
definition: Information about groups and memberships included or associated with a social network
narrower: Trade Union Membership
is sub type of: Social Network

Historical
type: Concept
created: 2019-06-04
creator: Elmar Kiesling; Harshvardhan J. Pandit
creator: Fajar Ekaputra
source: Categories-of-Personal-Information.pdf
term status: accepted
broader: PersonalData
definition: Information about historical data related to or relevant regarding history or past events
narrower: Life History
is sub type of: PersonalData

House Owned
type: Concept
created: 2019-06-04
creator: Elmar Kiesling; Harshvardhan J. Pandit
creator: Fajar Ekaputra
source: Categories-of-Personal-Information.pdf
term status: accepted
broader: Ownership
definition: Information about house(s) owned and ownership history.
narrower: Apartment Owned
is sub type of: Ownership

Official ID
type: Concept
created: 2019-06-04
creator: Elmar Kiesling; Harshvardhan J. Pandit
creator: Fajar Ekaputra
source: Categories-of-Personal-Information.pdf
term status: accepted
broader: Identifying
definition: Information about an official identifier or identification document
narrower: Passport
related: Government
is sub type of: Identifying

Service Consumption Behavior
type: Concept
created: 2019-11-26
creator: Harshvardhan J. Pandit
creator: Rudy Jacob
source: specialprivacy.ercim.eu
term status: accepted
broader: Behavioral
definition: Information about the consumption of a service, e.g. time and duration of consumption.
narrower: TV Viewing Behavior
is sub type of: Behavioral

Social Media
type: Concept
created: 2022-06-15
creator: Harshvardhan J. Pandit
term status: accepted
broader: Communication
definition: Information about social media
narrower: Publicly Available Social Media
is sub type of: Communication

Payment Card Number
type: Concept
created: 2020-11-04
creator: Georg P Krog
source: dpvcg
term status: accepted
broader: Account Identifier
broader: Payment Card
definition: Information about payment card number.
narrower: Credit Card Number
is sub type of: Account Identifier
is sub type of: Payment Card

Account Identifier
type: Concept
created: 2019-06-04
creator: Elmar Kiesling; Harshvardhan J. Pandit
creator: Fajar Ekaputra
source: Categories-of-Personal-Information.pdf
term status: accepted
broader: Financial Account
definition: Information about financial account identifier.
narrower: Financial Account Number
narrower: Payment Card Number
is sub type of: Financial Account

Age
type: Concept
created: 2019-06-04
creator: Elmar Kiesling; Harshvardhan J. Pandit
creator: Fajar Ekaputra
source: Categories-of-Personal-Information.pdf
term status: accepted
broader: Physical Characteristic
definition: Information about age
narrower: Age Range
narrower: Birth Date
is sub type of: Physical Characteristic

Browsing Behavior
type: Concept
created: 2019-06-04
creator: Elmar Kiesling; Harshvardhan J. Pandit
creator: Fajar Ekaputra
source: Categories-of-Personal-Information.pdf
term status: accepted
broader: Behavioral
definition: Information about browsing Behavior.
narrower: Browser History
narrower: Browsing Referral
related: OnlineActivity
is sub type of: Behavioral

Device Software
type: Concept
created: 2020-11-04
creator: Beatriz Esteves
creator: Georg P Krog
creator: Harshvardhan J. Pandit
creator: Paul Ryan
source: dpvcg
term status: accepted
broader: Device Based
definition: Information about software on or related to a device.
narrower: Device Applications
narrower: Device Operating System
is sub type of: Device Based

Education
type: Concept
created: 2022-04-20
creator: Harshvardhan J. Pandit
term status: accepted
broader: Professional
definition: Information about education
narrower: Education Experience
narrower: Education Qualification
is sub type of: Professional

Email Address
type: Concept
created: 2019-06-04
creator: Elmar Kiesling; Harshvardhan J. Pandit
creator: Fajar Ekaputra
source: Categories-of-Personal-Information.pdf
term status: accepted
broader: Contact
definition: Information about Email address.
narrower: Email Address Personal
narrower: Email Address Work
is sub type of: Contact

Employment History
type: Concept
created: 2019-06-04
creator: Elmar Kiesling; Harshvardhan J. Pandit
creator: Fajar Ekaputra
source: Categories-of-Personal-Information.pdf
term status: accepted
broader: Professional
definition: Information about employment history
narrower: Current Employment
narrower: Past Employment
is sub type of: Professional

Ethnicity
type: Concept
created: 2019-06-04
creator: Elmar Kiesling; Harshvardhan J. Pandit
creator: Fajar Ekaputra
source: Categories-of-Personal-Information.pdf
term status: accepted
broader: External
definition: Information about ethnic origins and lineage
narrower: Ethnic Origin
narrower: Race
is sub type of: External

Family
type: Concept
created: 2019-06-04
creator: Elmar Kiesling; Harshvardhan J. Pandit
creator: Fajar Ekaputra
source: Categories-of-Personal-Information.pdf
term status: accepted
broader: Social
definition: Information about family and relationships
narrower: Family Structure
narrower: Relationship
is sub type of: Social

Health History
type: Concept
created: 2019-06-04
creator: Elmar Kiesling; Harshvardhan J. Pandit
creator: Fajar Ekaputra
source: Categories-of-Personal-Information.pdf
term status: accepted
broader: Medical Health
definition: Information about health history.
narrower: Family Health History
narrower: Individual Health History
is sub type of: Medical Health

Interest
type: Concept
created: 2019-06-04
creator: Elmar Kiesling; Harshvardhan J. Pandit
creator: Fajar Ekaputra
source: Categories-of-Personal-Information.pdf
term status: accepted
broader: Preference
definition: Information about interests
narrower: Dislike
narrower: Like
is sub type of: Preference

Language
type: Concept
created: 2019-06-04
creator: Elmar Kiesling; Harshvardhan J. Pandit
creator: Fajar Ekaputra
modified: 2022-04-20
source: Categories-of-Personal-Information.pdf
term status: changed
broader: External
definition: Information about language and lingual history.
narrower: Accent
narrower: Dialect
is sub type of: External

Payment Card
type: Concept
created: 2020-11-04
creator: Harshvardhan J. Pandit
source: dpvcg
term status: accepted
broader: Financial Account
definition: Information about payment card such as Credit Card, Debit Card.
narrower: Payment Card Expiry
narrower: Payment Card Number
is sub type of: Financial Account

Vehicle
type: Concept
created: 2022-06-15
creator: Harshvardhan J. Pandit
term status: accepted
broader: External
definition: Information about vehicles
narrower: Vehicle License
narrower: Vehicle Usage
is sub type of: External

Vehicle License
type: Concept
created: 2022-06-15
creator: Harshvardhan J. Pandit
term status: accepted
broader: Identifying
broader: Vehicle
definition: Information about vehicle license
narrower: Vehicle License Number
narrower: Vehicle License Registration
is sub type of: Identifying
is sub type of: Vehicle

Authenticating
type: Concept
created: 2019-06-04
creator: Elmar Kiesling; Harshvardhan J. Pandit
creator: Fajar Ekaputra
source: Categories-of-Personal-Information.pdf
term status: accepted
broader: Internal
definition: Information about authentication and information used for authenticating
narrower: PIN Code
narrower: Password
narrower: Secret Text
is sub type of: Internal

Contact
type: Concept
created: 2019-06-04
creator: Elmar Kiesling; Harshvardhan J. Pandit
creator: Fajar Ekaputra
source: Categories-of-Personal-Information.pdf
term status: accepted
broader: Tracking
definition: Information about contacts or used for contacting e.g. email address or phone number
narrower: Email Address
narrower: Physical Address
narrower: Telephone Number
related: Physical
is sub type of: Tracking

Demographic
type: Concept
created: 2019-06-04
creator: Elmar Kiesling; Harshvardhan J. Pandit
creator: Fajar Ekaputra
source: Categories-of-Personal-Information.pdf
term status: accepted
broader: External
definition: Information about demography and demographic characteristics
narrower: Geographic
narrower: Income Bracket
narrower: Physical Trait
is sub type of: External

Favorite
type: Concept
created: 2019-06-04
creator: Elmar Kiesling; Harshvardhan J. Pandit
creator: Fajar Ekaputra
source: Categories-of-Personal-Information.pdf
term status: accepted
broader: Preference
definition: Information about favorites
narrower: Favorite Color
narrower: Favorite Food
narrower: Favorite Music
is sub type of: Preference

Financial Account
type: Concept
created: 2019-06-04
creator: Elmar Kiesling; Harshvardhan J. Pandit
creator: Fajar Ekaputra
source: Categories-of-Personal-Information.pdf
term status: accepted
broader: Financial
definition: Information about financial accounts.
narrower: Account Identifier
narrower: Bank Account
narrower: Payment Card
is sub type of: Financial

Health
type: Concept
created: 2019-06-04
creator: Elmar Kiesling; Harshvardhan J. Pandit
creator: Fajar Ekaputra
source: Categories-of-Personal-Information.pdf
term status: accepted
broader: Medical Health
definition: Information about health.
narrower: Genetic
narrower: Mental Health
narrower: Physical Health
related: Health
is sub type of: Medical Health

Internal
type: Concept
created: 2019-06-04
creator: Elmar Kiesling; Harshvardhan J. Pandit
creator: Fajar Ekaputra
source: Categories-of-Personal-Information.pdf
term status: accepted
broader: PersonalData
definition: Informatoin about internal characteristics that cannot be seen or observed
narrower: Authenticating
narrower: Knowledge and Beliefs
narrower: Preference
is sub type of: PersonalData

Knowledge and Beliefs
type: Concept
created: 2019-06-04
creator: Elmar Kiesling; Harshvardhan J. Pandit
creator: Fajar Ekaputra
source: Categories-of-Personal-Information.pdf
term status: accepted
broader: Internal
definition: Information about knowledge and beliefs
narrower: Philosophical Belief
narrower: Religious Belief
narrower: Thought
is sub type of: Internal

Ownership
type: Concept
created: 2019-06-04
creator: Elmar Kiesling; Harshvardhan J. Pandit
creator: Fajar Ekaputra
source: Categories-of-Personal-Information.pdf
term status: accepted
broader: Financial
definition: Information about ownership and history, including renting, borrowing, possessions.
narrower: Car Owned
narrower: House Owned
narrower: Personal Possession
is sub type of: Financial

Biometric
type: Concept
created: 2019-06-04
creator: Elmar Kiesling; Harshvardhan J. Pandit
creator: Fajar Ekaputra
source: Categories-of-Personal-Information.pdf
term status: accepted
broader: SpecialCategoryPersonalData
broader: Identifying
definition: Information about biometrics and biometric characteristics.
narrower: Facial Print
narrower: Fingerprint
narrower: Retina
is sub type of: SpecialCategoryPersonalData
is sub type of: Identifying

Credit
type: Concept
created: 2019-06-04
creator: Elmar Kiesling; Harshvardhan J. Pandit
creator: Fajar Ekaputra
source: Categories-of-Personal-Information.pdf
term status: accepted
broader: Transactional
definition: Information about reputation with regards to money
narrower: Credit Capacity
narrower: Credit Record
narrower: Credit Standing
narrower: Credit Worthiness
is sub type of: Transactional

Criminal
type: Concept
created: 2019-06-04
creator: Elmar Kiesling; Harshvardhan J. Pandit
creator: Fajar Ekaputra
source: Categories-of-Personal-Information.pdf
term status: accepted
broader: Social
definition: Information about criminal activity e.g. criminal convictions or jail time
narrower: Criminal Charge
narrower: Criminal Conviction
narrower: Criminal Offense
narrower: Criminal Pardon
related: Judicial
is sub type of: Social

Device Based
type: Concept
created: 2019-06-04
creator: Elmar Kiesling; Harshvardhan J. Pandit
creator: Fajar Ekaputra
source: Categories-of-Personal-Information.pdf
term status: accepted
broader: Tracking
definition: Information about devices
narrower: Browser Fingerprint
narrower: Device Software
narrower: IP Address
narrower: MAC Address
related: Computer
is sub type of: Tracking

Sexual
type: Concept
created: 2019-06-04
creator: Elmar Kiesling; Harshvardhan J. Pandit
creator: Fajar Ekaputra
source: Categories-of-Personal-Information.pdf
term status: accepted
broader: SpecialCategoryPersonalData
broader: External
definition: Information about sexuality and sexual history
narrower: Fetish
narrower: Proclivitie
narrower: Sexual History
narrower: Sexual Preference
is sub type of: SpecialCategoryPersonalData
is sub type of: External

Communication
type: Concept
created: 2019-06-04
creator: Elmar Kiesling; Harshvardhan J. Pandit
creator: Fajar Ekaputra
source: Categories-of-Personal-Information.pdf
term status: accepted
broader: Social
definition: Information communicated from or to an individual
narrower: Email Content
narrower: Social Media
narrower: Social Media Communication
narrower: Voice Communication Recording
narrower: Voice Mail
is sub type of: Social

Family Structure
type: Concept
created: 2019-06-04
creator: Elmar Kiesling; Harshvardhan J. Pandit
creator: Fajar Ekaputra
source: Categories-of-Personal-Information.pdf
term status: accepted
broader: Family
definition: Information about family and familial structure.
narrower: Divorce
narrower: Marriage
narrower: Offspring
narrower: Parent
narrower: Sibling
is sub type of: Family

Financial
type: Concept
created: 2019-06-04
creator: Elmar Kiesling; Harshvardhan J. Pandit
creator: Fajar Ekaputra
source: Categories-of-Personal-Information.pdf
term status: accepted
broader: PersonalData
definition: Information about finance including monetary characteristics and transactions
narrower: Financial Account
narrower: Financial Status
narrower: Insurance
narrower: Ownership
narrower: Transactional
related: Financial
is sub type of: PersonalData

Location
type: Concept
created: 2019-06-04
creator: Elmar Kiesling; Harshvardhan J. Pandit
creator: Fajar Ekaputra
source: Categories-of-Personal-Information.pdf
term status: accepted
broader: Tracking
definition: Information about location
narrower: Birth Place
narrower: Country
narrower: GPS Coordinate
narrower: Room Number
narrower: Travel History
related: Location
is sub type of: Tracking

Preference
type: Concept
created: 2019-06-04
creator: Elmar Kiesling; Harshvardhan J. Pandit
creator: Fajar Ekaputra
source: Categories-of-Personal-Information.pdf
term status: accepted
broader: Internal
definition: Information about preferences or interests
narrower: Favorite
narrower: Intention
narrower: Interest
narrower: Opinion
narrower: Privacy Preference
related: Preference
is sub type of: Internal

Social Network
type: Concept
created: 2019-06-04
creator: Elmar Kiesling; Harshvardhan J. Pandit
creator: Fajar Ekaputra
source: Categories-of-Personal-Information.pdf
term status: accepted
broader: Social
definition: Information about friends or connections expressed as a social network
narrower: Acquantaince
narrower: Association
narrower: Connection
narrower: Friend
narrower: Group Membership
is sub type of: Social

Social
type: Concept
created: 2019-06-04
creator: Elmar Kiesling; Harshvardhan J. Pandit
creator: Fajar Ekaputra
source: Categories-of-Personal-Information.pdf
term status: accepted
broader: PersonalData
definition: Information about social aspects such as family, public life, or professional networks.
narrower: Communication
narrower: Criminal
narrower: Family
narrower: Professional
narrower: Public Life
narrower: Social Network
is sub type of: PersonalData

Tracking
type: Concept
created: 2019-06-04
creator: Elmar Kiesling; Harshvardhan J. Pandit
creator: Fajar Ekaputra
source: Categories-of-Personal-Information.pdf
term status: accepted
broader: PersonalData
definition: Information used to track an individual or group e.g. location or email
narrower: Contact
narrower: Device Based
narrower: Digital Fingerprint
narrower: Identifier
narrower: Location
narrower: User agent
is sub type of: PersonalData

Identifying
type: Concept
created: 2019-06-04
creator: Elmar Kiesling; Harshvardhan J. Pandit
creator: Fajar Ekaputra
source: Categories-of-Personal-Information.pdf
term status: accepted
broader: External
definition: Information that uniquely or semi-uniquely identifies an individual or a group
narrower: Biometric
narrower: Name
narrower: Official ID
narrower: Picture
narrower: UID
narrower: Username
narrower: Vehicle License
is sub type of: External

Physical Characteristic
type: Concept
created: 2019-06-04
creator: Elmar Kiesling; Harshvardhan J. Pandit
creator: Fajar Ekaputra
source: Categories-of-Personal-Information.pdf
term status: accepted
broader: External
definition: Information about physical characteristics
narrower: Age
narrower: Gender
narrower: Hair Color
narrower: Height
narrower: Piercing
narrower: Skin Tone
narrower: Tattoo
narrower: Weight
related: Demographic
is sub type of: External

Transactional
type: Concept
created: 2019-06-04
creator: Elmar Kiesling; Harshvardhan J. Pandit
creator: Fajar Ekaputra
source: Categories-of-Personal-Information.pdf
term status: accepted
broader: Financial
definition: Information about a purchasing, spending or income
narrower: Credit
narrower: Income
narrower: Loan Record
narrower: Purchase
narrower: Purchases and Spending Habit
narrower: Sale
narrower: Tax
narrower: Transaction
is sub type of: Financial

Medical Health
type: Concept
created: 2019-06-04
creator: Elmar Kiesling; Harshvardhan J. Pandit
creator: Fajar Ekaputra
source: Categories-of-Personal-Information.pdf
term status: accepted
broader: SpecialCategoryPersonalData
broader: External
definition: Information about health, medical conditions or health care
narrower: Blood Type
narrower: DNA Code
narrower: Disability
narrower: Drug Test Result
narrower: Health
narrower: Health History
narrower: Health Record
narrower: Prescription
is sub type of: SpecialCategoryPersonalData
is sub type of: External

Public Life
type: Concept
created: 2019-06-04
creator: Elmar Kiesling; Harshvardhan J. Pandit
creator: Fajar Ekaputra
source: Categories-of-Personal-Information.pdf
term status: accepted
broader: Social
definition: Information about public life
narrower: Character
narrower: Communications Metadata
narrower: General Reputation
narrower: Interaction
narrower: Marital Status
narrower: Political Affiliation
narrower: Political Opinion
narrower: Religion
narrower: Social Status
is sub type of: Social

Behavioral
type: Concept
created: 2019-06-04
creator: Elmar Kiesling; Harshvardhan J. Pandit
creator: Fajar Ekaputra
source: Categories-of-Personal-Information.pdf
term status: accepted
broader: External
definition: Information about Behavior or activity
narrower: Attitude
narrower: Authentication History
narrower: Browsing Behavior
narrower: Call Log
narrower: Demeanor
narrower: Link Clicked
narrower: Performance at Work
narrower: Personality
narrower: Reliability
narrower: Service Consumption Behavior
narrower: Vehicle Usage
related: Activity
is sub type of: External

External
type: Concept
created: 2019-06-04
creator: Elmar Kiesling; Harshvardhan J. Pandit
creator: Fajar Ekaputra
source: Categories-of-Personal-Information.pdf
term status: accepted
broader: PersonalData
definition: Information about external characteristics that can be observed
narrower: Behavioral
narrower: Demographic
narrower: Ethnicity
narrower: Identifying
narrower: Language
narrower: Medical Health
narrower: Nationality
narrower: Personal Documents
narrower: Physical Characteristic
narrower: Sexual
narrower: Vehicle
is sub type of: PersonalData

Professional
type: Concept
created: 2019-06-04
creator: Elmar Kiesling; Harshvardhan J. Pandit
creator: Fajar Ekaputra
source: Categories-of-Personal-Information.pdf
term status: accepted
broader: Social
definition: Information about educational or professional career
narrower: Disciplinary Action
narrower: Education
narrower: Employment History
narrower: Job
narrower: Performance at Work
narrower: Professional Certification
narrower: Professional Evaluation
narrower: Professional Interview
narrower: Reference
narrower: Salary
narrower: School
narrower: Work Environment
narrower: Work History
is sub type of: Social