FridgeFreezer
label: Frigorífico/Congelador @es
category: Home and Garden Kitchen and Dining KitchenAppliances Refrigerators
category: Home and Garden Kitchen and Dining KitchenAppliances Freezers
type: Class
alternative label: Refrigerator/Freezer
comment: A generic Fridge/Freezer as a product type
alternative label: Heladera/Congelador @es
alternative label: Refrigerador/Congelador @es
label: Kühlschrank @de
alternative label: Nevera/Congelador @es
subclass of: ProductOrService

Right
type: RelativeDirection
comment: It represents the relative direction: right.

Number of front drawers
is configured by: MetadataContainer
  ranking direction: DESC
  example of usage: The value of this property is an integer (xsd:integer).
  priority: 0
  attribute position: 0
  in profile: DefaultProfile
min cardinality: 0
max cardinality: 1
comment: This property specifies the number of front drawers that the fridge is equipped with.
domain: FridgeFreezer
range: integer
type: DatatypeProperty
recommended range of measure: QuantitativeValue
  has max value: 3
  has min value: 0
sub property of: datatypeProductOrServiceProperty
is configured by: MetadataContainer
  ranking direction: DESC
  example of usage: The value of this property is an integer (xsd:integer).
  priority: 0
  attribute position: 0
  in profile: DefaultProfile
recommended range of measure: QuantitativeValue
  has max value: 3
  has min value: 0

Rating of stars
domain: FridgeFreezer
comment: This property specifies the maximum temperature that the freezer unit can reach. The temperature is indicated using a number of stars. Each star corresponds to a -6 degree celsius increment.
min cardinality: 0
max cardinality: 1
range: integer
is configured by: MetadataContainer
  priority: 0
  ranking direction: DESC
  example of usage: The value of this property is an integer (xsd:integer).
  attribute position: 0
  in profile: DefaultProfile
type: DatatypeProperty
recommended range of measure: QuantitativeValue
  has min value: 1
  has max value: 4
sub property of: datatypeProductOrServiceProperty
is configured by: MetadataContainer
  priority: 0
  ranking direction: DESC
  example of usage: The value of this property is an integer (xsd:integer).
  attribute position: 0
  in profile: DefaultProfile
recommended range of measure: QuantitativeValue
  has min value: 1
  has max value: 4

Left
comment: It represents the relative direction: left.
type: RelativeDirection

F Rating
type: EnergyRatingEU
comment: This concept represents the F energy efficiency rating in the European Union labelling scheme

Rating of energy EU
range: EnergyRatingEU
max cardinality: 1
type: ObjectProperty
domain: FridgeFreezer
sub property of: qualitativeProductOrServiceProperty
is configured by: MetadataContainer
  attribute position: 0
  ranking direction: DESC
  example of usage: The value of this property is an individual of the ofrd:EnergyRatingEU class.
  in profile: DefaultProfile
  priority: 0
comment: The rating of energy efficiency in the European Union that the fridge/freezer operates at.
min cardinality: 0
is configured by: MetadataContainer
  attribute position: 0
  ranking direction: DESC
  example of usage: The value of this property is an individual of the ofrd:EnergyRatingEU class.
  in profile: DefaultProfile
  priority: 0

Volume of unit gross
is configured by: MetadataContainer
  example of usage: The value of this property is an individual of the gr:QuantitativeValue class.
  in profile: DefaultProfile
  priority: 0
  attribute position: 0
  ranking direction: DESC
recommended range of measure: QuantitativeValue
  has max value: 0
  has min value: 0
comment: The gross volume in liters of the total unit.
min cardinality: 0
max cardinality: 1
type: ObjectProperty
range: QuantitativeValue
recommended unit of measure: LTR
domain: FridgeFreezer
sub property of: quantitativeProductOrServiceProperty
is configured by: MetadataContainer
  example of usage: The value of this property is an individual of the gr:QuantitativeValue class.
  in profile: DefaultProfile
  priority: 0
  attribute position: 0
  ranking direction: DESC
recommended range of measure: QuantitativeValue
  has max value: 0
  has min value: 0

A+++ Rating
type: EnergyRatingEU
comment: This concept represents the A+++ energy efficiency rating in the European Union labelling scheme

Fridge and Freezer Vocabulary
creator: Laszlo Torok
creator: opdm-project.org
imports: v1
comment: Vocabulary to describe fridges and freezers
contributor: www.wikipedia.org
creator: ebusiness
creator: Bene Rodriguez-Castro
contributor: 146650.php
imports: utility#
type: Ontology
subject: refrigerator fridge freezer
creator: Martin Hepp

FreezerlessDoor
type: StyleOfUnit
comment: It represents a freezer-less door type of fridge.

BuiltIn
type: TypeOfBody
comment: It represents a bult-in type of body frame for a fridge/freezer.

A+ Rating
comment: This concept represents the A+ energy efficiency rating in the European Union labelling scheme
type: EnergyRatingEU

ST Rating
comment: This concept represents the ST climate class rating. The fridge/freezer can operate between 18 - 38 degree celsius of room temperature
type: ClimateClass

C Rating
comment: This concept represents the C energy efficiency rating in the European Union labelling scheme
type: EnergyRatingEU

Display
sub property of: datatypeProductOrServiceProperty
is configured by: MetadataContainer
  in profile: DefaultProfile
  ranking direction: DESC
  priority: 0
  example of usage: The value of this property is a boolean (true/false - xsd:boolean).
  attribute position: 0
type: DatatypeProperty
min cardinality: 0
domain: FridgeFreezer
comment: This property specifies whether the fridge/freezer is equipped with an electronic display system or not.
range: boolean
max cardinality: 1
is configured by: MetadataContainer
  in profile: DefaultProfile
  ranking direction: DESC
  priority: 0
  example of usage: The value of this property is a boolean (true/false - xsd:boolean).
  attribute position: 0

Power supply
min cardinality: 0
range: QuantitativeValue
type: ObjectProperty
comment: The power supply requirements in volts of the fridge/freezer unit (UN/CEFACT common code: VLT). Optionally, this property can be complemented with a gr:valueReference property to indicate the frecuency that the power supply operates at in Hertz (UN/CEFACT common code: HTZ).
recommended unit of measure: VLT
domain: FridgeFreezer
is configured by: MetadataContainer
  priority: 0
  in profile: DefaultProfile
  ranking direction: DESC
  example of usage: The value of this property is an individual of the gr:QuantitativeValue class.
  attribute position: 0
recommended range of measure: QuantitativeValue
  has min value: 100
  has max value: 300
sub property of: quantitativeProductOrServiceProperty
max cardinality: 1
is configured by: MetadataContainer
  priority: 0
  in profile: DefaultProfile
  ranking direction: DESC
  example of usage: The value of this property is an individual of the gr:QuantitativeValue class.
  attribute position: 0
recommended range of measure: QuantitativeValue
  has min value: 100
  has max value: 300

Type of body
range: TypeOfBody
sub property of: qualitativeProductOrServiceProperty
min cardinality: 0
max cardinality: 1
comment: The type of body frame that the fridge/freezer is equipped with.
is configured by: MetadataContainer
  attribute position: 0
  example of usage: The value of this property is an individual of the ofrd:TypeOfBody class.
  priority: 0
  in profile: DefaultProfile
  ranking direction: DESC
domain: FridgeFreezer
type: ObjectProperty
is configured by: MetadataContainer
  attribute position: 0
  example of usage: The value of this property is an individual of the ofrd:TypeOfBody class.
  priority: 0
  in profile: DefaultProfile
  ranking direction: DESC

T Rating
type: ClimateClass
comment: This concept represents the T climate class rating. The fridge/freezer can operate between 18 - 43 degree celsius of room temperature

Position of door hinge
range: RelativeDirection
max cardinality: 1
comment: The position of the door hinge of the fridge/freezer unit.
sub property of: qualitativeProductOrServiceProperty
type: ObjectProperty
min cardinality: 0
is configured by: MetadataContainer
  in profile: DefaultProfile
  example of usage: The value of this property is an individual of the ofrd:RelativeDirection class.
  priority: 0
  ranking direction: DESC
  attribute position: 0
domain: FridgeFreezer
is configured by: MetadataContainer
  in profile: DefaultProfile
  example of usage: The value of this property is an individual of the ofrd:RelativeDirection class.
  priority: 0
  ranking direction: DESC
  attribute position: 0

Chest
comment: It represents a chest type of body frame for a fridge/freezer.
type: TypeOfBody

Ice dispenser
domain: FridgeFreezer
type: DatatypeProperty
is configured by: MetadataContainer
  in profile: DefaultProfile
  priority: 0
  example of usage: The value of this property is a boolean (true/false - xsd:boolean).
  attribute position: 0
  ranking direction: DESC
comment: This property specifies whether the fridge/freezer is equipped with an ice dispenser system or not.
max cardinality: 1
range: boolean
min cardinality: 0
sub property of: datatypeProductOrServiceProperty
is configured by: MetadataContainer
  in profile: DefaultProfile
  priority: 0
  example of usage: The value of this property is a boolean (true/false - xsd:boolean).
  attribute position: 0
  ranking direction: DESC

Style of unit
sub property of: qualitativeProductOrServiceProperty
is configured by: MetadataContainer
  priority: 0
  ranking direction: DESC
  attribute position: 0
  in profile: DefaultProfile
  example of usage: The value of this property is an individual of the ofrd:StyleOfUnit class.
max cardinality: 1
range: StyleOfUnit
comment: The type of door that the fridge/freezer is equipped with.
type: ObjectProperty
min cardinality: 0
domain: FridgeFreezer
is configured by: MetadataContainer
  priority: 0
  ranking direction: DESC
  attribute position: 0
  in profile: DefaultProfile
  example of usage: The value of this property is an individual of the ofrd:StyleOfUnit class.

Water dispenser
type: DatatypeProperty
is configured by: MetadataContainer
  ranking direction: DESC
  attribute position: 0
  priority: 0
  example of usage: The value of this property is a boolean (true/false - xsd:boolean).
  in profile: DefaultProfile
sub property of: datatypeProductOrServiceProperty
domain: FridgeFreezer
range: boolean
min cardinality: 0
comment: This property specifies whether the fridge/freezer is equipped with a water dispenser system or not.
max cardinality: 1
is configured by: MetadataContainer
  ranking direction: DESC
  attribute position: 0
  priority: 0
  example of usage: The value of this property is a boolean (true/false - xsd:boolean).
  in profile: DefaultProfile

FrenchDoor
type: StyleOfUnit
comment: It represents a french-door type of fridge.

Remote control
range: boolean
min cardinality: 0
max cardinality: 1
type: DatatypeProperty
domain: FridgeFreezer
is configured by: MetadataContainer
  ranking direction: DESC
  priority: 0
  attribute position: 0
  example of usage: The value of this property is a boolean (true/false - xsd:boolean).
  in profile: DefaultProfile
sub property of: datatypeProductOrServiceProperty
comment: This property specifies whether the fridge/freezer can be controlled remotely via an external electronic device (smartphone, computer, etc.) system or not.
is configured by: MetadataContainer
  ranking direction: DESC
  priority: 0
  attribute position: 0
  example of usage: The value of this property is a boolean (true/false - xsd:boolean).
  in profile: DefaultProfile

Freezer
subclass of: FridgeFreezer
category: Home and Garden Kitchen and Dining KitchenAppliances Freezers
type: Class
comment: A generic dedicated Freezer (with no Fridge unit) as a product type
label: Congelador @es

Frost free
min cardinality: 0
type: DatatypeProperty
max cardinality: 1
sub property of: datatypeProductOrServiceProperty
domain: FridgeFreezer
is configured by: MetadataContainer
  attribute position: 0
  ranking direction: DESC
  in profile: DefaultProfile
  priority: 0
  example of usage: The value of this property is a boolean (true/false - xsd:boolean).
range: boolean
comment: This property specifies whether the fridge/freezer is equipped with a frost-free system or not.
is configured by: MetadataContainer
  attribute position: 0
  ranking direction: DESC
  in profile: DefaultProfile
  priority: 0
  example of usage: The value of this property is a boolean (true/false - xsd:boolean).

BottomFreezerDoor
comment: It represents a bottom freezer door type of fridge.
type: StyleOfUnit

Water filtration
domain: FridgeFreezer
type: DatatypeProperty
max cardinality: 1
is configured by: MetadataContainer
  ranking direction: DESC
  attribute position: 0
  priority: 0
  example of usage: The value of this property is a boolean (true/false - xsd:boolean).
  in profile: DefaultProfile
range: boolean
min cardinality: 0
comment: This property specifies whether the fridge/freezer is equipped with a water filtration system or not.
sub property of: datatypeProductOrServiceProperty
is configured by: MetadataContainer
  ranking direction: DESC
  attribute position: 0
  priority: 0
  example of usage: The value of this property is a boolean (true/false - xsd:boolean).
  in profile: DefaultProfile

RelativeDirection
contributor: Relative direction
comment: Class to represent the most common relative directions. Possible values include: left, right, forward, backward, up, down.
type: Class
subclass of: QualitativeValue

G Rating
comment: This concept represents the G energy efficiency rating in the European Union labelling scheme
type: EnergyRatingEU

Consumption of energy
sub property of: quantitativeProductOrServiceProperty
max cardinality: 1
min cardinality: 0
recommended range of measure: QuantitativeValue
  has min value: 0
  has max value: 0
type: ObjectProperty
recommended unit of measure: KWH
is configured by: MetadataContainer
  attribute position: 0
  example of usage: The value of this property is an individual of the gr:QuantitativeValue class.
  ranking direction: DESC
  in profile: DefaultProfile
  priority: 0
domain: FridgeFreezer
range: QuantitativeValue
comment: The consumption of energy of the fridge/freezer in kilowatt hour (in a year) - UN/CEFACT common code: KWH.
recommended range of measure: QuantitativeValue
  has min value: 0
  has max value: 0
is configured by: MetadataContainer
  attribute position: 0
  example of usage: The value of this property is an individual of the gr:QuantitativeValue class.
  ranking direction: DESC
  in profile: DefaultProfile
  priority: 0

SN Rating
type: ClimateClass
comment: This concept represents the SN climate class rating. The fridge/freezer can operate between 10 - 32 degree celsius of room temperature

Antibacterial
comment: This property specifies whether the fridge/freezer is equipped with an antibacterial detector system or not.
domain: FridgeFreezer
sub property of: datatypeProductOrServiceProperty
min cardinality: 0
max cardinality: 1
is configured by: MetadataContainer
  ranking direction: DESC
  priority: 0
  attribute position: 0
  example of usage: The value of this property is a boolean (true/false - xsd:boolean).
  in profile: DefaultProfile
type: DatatypeProperty
range: boolean
is configured by: MetadataContainer
  ranking direction: DESC
  priority: 0
  attribute position: 0
  example of usage: The value of this property is a boolean (true/false - xsd:boolean).
  in profile: DefaultProfile

Fridge
label: Frigorífico @es
comment: A generic Fridge with no Freezer unit as a product type
subclass of: FridgeFreezer
alternative label: Nevera @es
type: Class
alternative label: Refrigerator
alternative label: Heladera @es
label: Kühlschrank @de
category: Home and Garden Kitchen and Dining KitchenAppliances Refrigerators
alternative label: Refrigerador @es

FreeStanding
type: TypeOfBody
comment: It represents a free-standing type of body frame for a fridge/freezer.

Volume of unit net
sub property of: quantitativeProductOrServiceProperty
recommended range of measure: QuantitativeValue
  has min value: 0
  has max value: 0
max cardinality: 1
is configured by: MetadataContainer
  example of usage: The value of this property is an individual of the gr:QuantitativeValue class.
  attribute position: 0
  priority: 0
  in profile: DefaultProfile
  ranking direction: DESC
domain: FridgeFreezer
comment: The net volume in liters of the total unit. The value of this property usually is equal to the sum of the value of the properties ofrd:volumeOfFridge and ofrd:volumeOfFreezer
type: ObjectProperty
recommended unit of measure: LTR
min cardinality: 0
range: QuantitativeValue
recommended range of measure: QuantitativeValue
  has min value: 0
  has max value: 0
is configured by: MetadataContainer
  example of usage: The value of this property is an individual of the gr:QuantitativeValue class.
  attribute position: 0
  priority: 0
  in profile: DefaultProfile
  ranking direction: DESC

A++ Rating
comment: This concept represents the A++ energy efficiency rating in the European Union labelling scheme
type: EnergyRatingEU

B Rating
comment: This concept represents the B energy efficiency rating in the European Union labelling scheme
type: EnergyRatingEU

Door open alarm
sub property of: datatypeProductOrServiceProperty
type: DatatypeProperty
is configured by: MetadataContainer
  ranking direction: DESC
  attribute position: 0
  priority: 0
  example of usage: The value of this property is a boolean (true/false - xsd:boolean).
  in profile: DefaultProfile
comment: This property specifies whether the fridge/freezer is equipped with a door-open alarm system or not.
max cardinality: 1
min cardinality: 0
range: boolean
domain: FridgeFreezer
is configured by: MetadataContainer
  ranking direction: DESC
  attribute position: 0
  priority: 0
  example of usage: The value of this property is a boolean (true/false - xsd:boolean).
  in profile: DefaultProfile

EnergyRatingEU
subclass of: QualitativeValue
comment: Class to represent the European Union energy label codas of a fridge. Possible values go from A+++ to G.
type: Class

Energy Star US
domain: FridgeFreezer
type: DatatypeProperty
is configured by: MetadataContainer
  example of usage: The value of this property is a boolean (true/false - xsd:boolean).
  in profile: DefaultProfile
  ranking direction: DESC
  attribute position: 0
  priority: 0
max cardinality: 1
comment: This property specifies whether the fridge/freezer is certified with the Energy Star label awarded by the Department of Energy and Enviromental Protection Agency of the US, or not.
range: boolean
min cardinality: 0
sub property of: datatypeProductOrServiceProperty
is configured by: MetadataContainer
  example of usage: The value of this property is a boolean (true/false - xsd:boolean).
  in profile: DefaultProfile
  ranking direction: DESC
  attribute position: 0
  priority: 0

ClimateClass
type: Class
comment: Class to represent the range of room temperatures that a fridge/freezer can operate. Possible values include: N, SN, ST, T.
subclass of: QualitativeValue

SideBySideDoor
type: StyleOfUnit
comment: It represents a side-by-side door type of fridge.

Child lock
domain: FridgeFreezer
comment: This property specifies whether the fridge/freezer is equipped with a child lock system or not.
max cardinality: 1
sub property of: datatypeProductOrServiceProperty
range: boolean
min cardinality: 0
is configured by: MetadataContainer
  attribute position: 0
  ranking direction: DESC
  in profile: DefaultProfile
  priority: 0
  example of usage: The value of this property is a boolean (true/false - xsd:boolean).
type: DatatypeProperty
is configured by: MetadataContainer
  attribute position: 0
  ranking direction: DESC
  in profile: DefaultProfile
  priority: 0
  example of usage: The value of this property is a boolean (true/false - xsd:boolean).

D Rating
comment: This concept represents the D energy efficiency rating in the European Union labelling scheme
type: EnergyRatingEU

Reversible door
range: boolean
comment: This property specifies whether the fridge/freezer is equipped with doors that can be mounted on either side of the unit or not.
min cardinality: 0
sub property of: datatypeProductOrServiceProperty
domain: FridgeFreezer
is configured by: MetadataContainer
  priority: 0
  in profile: DefaultProfile
  ranking direction: DESC
  attribute position: 0
  example of usage: The value of this property is a boolean (true/false - xsd:boolean).
type: DatatypeProperty
max cardinality: 1
is configured by: MetadataContainer
  priority: 0
  in profile: DefaultProfile
  ranking direction: DESC
  attribute position: 0
  example of usage: The value of this property is a boolean (true/false - xsd:boolean).

Number of freezer compartments
min cardinality: 0
max cardinality: 1
domain: FridgeFreezer
comment: This property specifies the number of compartments that the freezer is equipped with.
sub property of: datatypeProductOrServiceProperty
range: integer
type: DatatypeProperty
is configured by: MetadataContainer
  attribute position: 0
  example of usage: The value of this property is an integer (xsd:integer).
  in profile: DefaultProfile
  ranking direction: DESC
  priority: 0
is configured by: MetadataContainer
  attribute position: 0
  example of usage: The value of this property is an integer (xsd:integer).
  in profile: DefaultProfile
  ranking direction: DESC
  priority: 0

TypeOfBody
subclass of: QualitativeValue
comment: Class to represent the different types of body frames of a fridge/freezer. Possible values include: built-in, free-standing.
type: Class

Volume of fridge
domain: FridgeFreezer
sub property of: quantitativeProductOrServiceProperty
type: ObjectProperty
max cardinality: 1
comment: The volume in liters of the fresh goods compartment built-into the full fridge/freezer unit.
is configured by: MetadataContainer
  in profile: DefaultProfile
  attribute position: 0
  example of usage: The value of this property is an individual of the gr:QuantitativeValue class.
  priority: 0
  ranking direction: DESC
range: QuantitativeValue
recommended unit of measure: LTR
min cardinality: 0
recommended range of measure: QuantitativeValue
  has min value: 0
  has max value: 0
is configured by: MetadataContainer
  in profile: DefaultProfile
  attribute position: 0
  example of usage: The value of this property is an individual of the gr:QuantitativeValue class.
  priority: 0
  ranking direction: DESC
recommended range of measure: QuantitativeValue
  has min value: 0
  has max value: 0

Volume of freezer
type: ObjectProperty
domain: FridgeFreezer
recommended unit of measure: LTR
sub property of: quantitativeProductOrServiceProperty
range: QuantitativeValue
comment: The volume in liters of the frozen goods compartment built-into the full fridge/freezer unit.
recommended range of measure: QuantitativeValue
  has max value: 0
  has min value: 0
max cardinality: 1
is configured by: MetadataContainer
  example of usage: The value of this property is an individual of the gr:QuantitativeValue class.
  attribute position: 0
  in profile: DefaultProfile
  priority: 0
  ranking direction: DESC
min cardinality: 0
recommended range of measure: QuantitativeValue
  has max value: 0
  has min value: 0
is configured by: MetadataContainer
  example of usage: The value of this property is an individual of the gr:QuantitativeValue class.
  attribute position: 0
  in profile: DefaultProfile
  priority: 0
  ranking direction: DESC

Level of noise
type: ObjectProperty
range: QuantitativeValue
recommended unit of measure: 2N
recommended range of measure: QuantitativeValue
  has min value: 0
  has max value: 0
min cardinality: 0
is configured by: MetadataContainer
  example of usage: The value of this property is an individual of the gr:QuantitativeValue class.
  ranking direction: DESC
  attribute position: 0
  in profile: DefaultProfile
  priority: 0
comment: The level of noise in decibels of the fridge/freezer (UN/CEFACT common code: 2N).
sub property of: quantitativeProductOrServiceProperty
max cardinality: 1
domain: FridgeFreezer
recommended range of measure: QuantitativeValue
  has min value: 0
  has max value: 0
is configured by: MetadataContainer
  example of usage: The value of this property is an individual of the gr:QuantitativeValue class.
  ranking direction: DESC
  attribute position: 0
  in profile: DefaultProfile
  priority: 0

N Rating
comment: This concept represents the N climate class rating. The fridge/freezer can operate between 16 - 32 degree celsius of room temperature
type: ClimateClass

Rating of climate class
max cardinality: 1
is configured by: MetadataContainer
  priority: 0
  in profile: DefaultProfile
  ranking direction: DESC
  example of usage: The value of this property is an individual of the ofrd:ClimateClass class.
  attribute position: 0
domain: FridgeFreezer
sub property of: qualitativeProductOrServiceProperty
range: ClimateClass
comment: The climate class rating that the fridge/freezer can operate at.
type: ObjectProperty
min cardinality: 0
is configured by: MetadataContainer
  priority: 0
  in profile: DefaultProfile
  ranking direction: DESC
  example of usage: The value of this property is an individual of the ofrd:ClimateClass class.
  attribute position: 0

Ice maker
max cardinality: 1
comment: This property specifies whether the fridge/freezer is equipped with an ice-maker system or not.
min cardinality: 0
range: boolean
domain: FridgeFreezer
is configured by: MetadataContainer
  ranking direction: DESC
  attribute position: 0
  priority: 0
  example of usage: The value of this property is a boolean (true/false - xsd:boolean).
  in profile: DefaultProfile
sub property of: datatypeProductOrServiceProperty
type: DatatypeProperty
is configured by: MetadataContainer
  ranking direction: DESC
  attribute position: 0
  priority: 0
  example of usage: The value of this property is a boolean (true/false - xsd:boolean).
  in profile: DefaultProfile

Capable of ACS
comment: This property specifies whether the fridge/freezer is equipped with an Advanced Control System (ACS) or not. ACS allows the fridge/freezer to maintain the desired internal temperature safe from variations in the external termperature.
domain: FridgeFreezer
sub property of: datatypeProductOrServiceProperty
min cardinality: 0
max cardinality: 1
type: DatatypeProperty
range: boolean
is configured by: MetadataContainer
  priority: 0
  example of usage: The value of this property is a boolean (true/false - xsd:boolean).
  ranking direction: DESC
  attribute position: 0
  in profile: DefaultProfile
is configured by: MetadataContainer
  priority: 0
  example of usage: The value of this property is a boolean (true/false - xsd:boolean).
  ranking direction: DESC
  attribute position: 0
  in profile: DefaultProfile

StyleOfUnit
comment: Class to represent the different styles of fridge/freezers. Possible values include: french-door, side-by-side, top-freezer, bottom-freezer, single-door.
type: Class
subclass of: QualitativeValue

TopFreezerDoor
comment: It represents a top freezer door type of fridge.
type: StyleOfUnit

Number of fridge shelves
sub property of: datatypeProductOrServiceProperty
is configured by: MetadataContainer
  attribute position: 0
  in profile: DefaultProfile
  priority: 0
  example of usage: The value of this property is an integer (xsd:integer).
  ranking direction: DESC
range: integer
max cardinality: 1
comment: This property specifies the number of shelves or levels that the fridge is equipped with.
type: DatatypeProperty
min cardinality: 0
domain: FridgeFreezer
is configured by: MetadataContainer
  attribute position: 0
  in profile: DefaultProfile
  priority: 0
  example of usage: The value of this property is an integer (xsd:integer).
  ranking direction: DESC

A Rating
type: EnergyRatingEU
comment: This concept represents the A energy efficiency rating in the European Union labelling scheme

Number of front doors
domain: FridgeFreezer
min cardinality: 0
comment: This property specifies the number of front doors that the fridge is equipped with.
max cardinality: 1
range: integer
sub property of: datatypeProductOrServiceProperty
recommended range of measure: QuantitativeValue
  has min value: 1
  has max value: 4
type: DatatypeProperty
is configured by: MetadataContainer
  in profile: DefaultProfile
  priority: 0
  ranking direction: DESC
  attribute position: 0
  example of usage: The value of this property is an integer (xsd:integer).
recommended range of measure: QuantitativeValue
  has min value: 1
  has max value: 4
is configured by: MetadataContainer
  in profile: DefaultProfile
  priority: 0
  ranking direction: DESC
  attribute position: 0
  example of usage: The value of this property is an integer (xsd:integer).

E Rating
comment: This concept represents the E energy efficiency rating in the European Union labelling scheme
type: EnergyRatingEU