regards entity name
type: DatatypeProperty
domain: entity
range: Literal
description: Relates an entity to a literal representing the actual entity name that exists in a gazetteer of the NEE system.

entity
type: Class
subclass of: SemanticTag
description: Represents an identified entity.

confidence
type: DatatypeProperty
domain: entity
range: Literal
description: Relates an entity to a literal representing the confidence of an ambiguous entity.

Named Entity Extraction (NEE)
type: Motivation
type: NamedIndividual
description: Represents the result of the Named Entity Extraction (NEE) process.
broader: tagging
preferred label: Result of Named Entity Extraction (NEE) process.

detected as
type: DatatypeProperty
domain: entity
range: Literal
description: Relates an entity to a literal representing the string in the document that was detected and considered an entity.

belongs to
type: ObjectProperty
domain: entity
range: Category
description: Relates an entity to a category.

Open NEE Model
type: Ontology
comment: The Open NEE Model defines an extension of the Open Annotation Data Model (http://www.openannotation.org/spec/core) that allows describing in RDF the result of a Named Entity Extraction (NEE) process, enabling thereby an application to run advanced (SPARQL) queries over the annotated data. The model also exploits the Open NEE Configuration Model (http://www.ics.forth.gr/isl/oncm) for relating the output of a NEE process with an applied configuration (serving provenance information to the output of the entire NEE process).
contributor: ~tzitzik
creator: ~fafalios
title: Open NEE Model (Open Annotation Extension)
imports: core
imports: oa#
version info: 1.0

position
type: DatatypeProperty
domain: entity
range: Literal
description: Relates an entity to one or more literals representing the positions in the document in which the entity name was detected.

score
type: DatatypeProperty
range: Literal
description: Relates an entity to a literal (or a URI to a literal) representing the score of an entity (or of URI).

has matched URI
type: ObjectProperty
domain: entity
range: Resource
description: Relates an entity to a URI.

using configuration
type: ObjectProperty
domain: Annotation
range: Configuration
description: Relates the annotation process to a configuration.