National Library of Korea Ontology
type: Ontology
type: Vocabulary
preferred namespace prefix: nlon
imports: http://purl.org/dc/elements/1.1/
imports: core
comment: This specification describes National Library of Korea Ontology vocaburaries using W3C's RDF and OWL technology.
description: 이 자료는 국립중앙도서관이 관리, 보존하고 있는 서지 정보와 주제명, 저자명 데이터를 대상으로 기존의 (KOR)MARC 형태 또는 DBMS 형태의 데이터를 RDF로 형식으로 변환하여 웹상에 Linked Open Data 형식으로 발행하고 있는 국립중앙도서관 LOD에서 사용하고 있는 명세서입니다.
contributor: 박설희 (sulhui@korea.kr)
contributor: 박설희
version info: NLK 2015
creator: JoyHong (joyhong@li-st.com)
creator: 허홍수
imports: bibo
imports: dcam
creator: Wonseok Oh (wonseok.oh@li-st.com)
creator: 오원석
issued: 2015-09-08
modified: 2015-11-23
imports: dcmitype
contributor: National Library of Korea and LiST Inc.
contributor: 주식회사 리스트
contributor: 국립중앙도서관
publisher: 국립중앙도서관
imports: http://xmlns.com/foaf/0.1/
rights: Copyright © 2015 National Library of Korea. Some rights reserved.
license: http://creativecommons.org/licenses/by/4.0/

박설희
type: Person
member of: 국립중앙도서관

허홍수
type: Person
member of: 주식회사 리스트
name: JoyHong @en

오원석
type: Person
member of: 주식회사 리스트
name: Wonseok Oh @en

주식회사 리스트
type: Organization
member: 오원석
member: 허홍수
name: LiST Inc. @en

국립중앙도서관
type: Organization
member: 박설희
name: National Library of Korea @en

사서
type: Class
label: librarian @en
subclass of: Person
term status: stable

도서관
type: Class
label: Library @en
subclass of: Organization
term status: stable

장애인대체자료
type: Class
label: Alternative material @en
subclass of: Document
term status: stable

온라인 자료
type: Class
label: Online material @en
subclass of: Thing
term status: stable

복합자료
type: Class
label: Complex document @en
subclass of: Document
term status: stable

자료구분
type: Class
comment: 공통 대상에서 사용하는 자료 구분 부가정보
label: Data type @en
subclass of: 분류
term status: stable

연속자료구분
type: Class
comment: 연속간행물에서 사용하는 연속자료 구분 부가정보
label: Continuous data type @en
subclass of: 분류
term status: stable

간행빈도구분
type: Class
comment: 연속간행물에서 사용하는 간행빈도 구분 부가정보(008태그 18자리)
label: Publication frequency type @en
subclass of: 분류
term status: stable

간행상태구분
type: Class
comment: 연속간행물에서 사용하는 간행상태 구분 부가정보(008태그 6자리)
label: Publication status type @en
subclass of: 분류
term status: stable

분류
type: Class
label: Classification @en
term status: stable

온라인자료 유형
type: Class
subclass of: 분류
label: Online material type @en
term status: stable

오프라인 자료
type: Class
label: Offline material @en
term status: stable

악보
type: Class
label: Score @en
subclass of: Document
term status: stable

국가
type: Class
label: Country @en
subclass of: Thing
term status: stable

고서
type: Class
label: Old book @en
subclass of: Document
term status: stable

저자
type: Class
label: author @en
subclass of: Person
term status: stable

정부기관
type: Class
label: Government @en
subclass of: Organization
term status: stable

도서
type: Class
label: Book @en
subclass of: 오프라인 자료
term status: stable

해외수집기록물
type: Class
label: Archives @en
subclass of: Document
term status: stable

대학
type: Class
label: University @en
subclass of: Organization
term status: stable

전자자료
type: Class
label: Electronic document @en
subclass of: Document
term status: stable

Location
type: Class
subclass of: SpatialThing
comment: 지역
term status: stable

비도서
type: Class
label: Non book @en
subclass of: 오프라인 자료
term status: stable

Concept
type: Class
subclass of: Concept
term status: stable

confirmed by
type: ObjectProperty
range: Person
sub property of: managed by
term status: stable

managed by
type: ObjectProperty
range: Person
term status: stable

inputed by
type: ObjectProperty
range: Person
sub property of: managed by
term status: stable

is geographic area of
type: ObjectProperty
range: Class
  union of: Document
  union of: Collection
domain: Location
comment: 7자리의 지역구분부호를 기술한다. 해당 자료와 관련된 지역구분부호가 둘 이상일 경우에는 식별기호를 반복하여 기술한다.
term status: stable

콘텐츠유형
type: ObjectProperty
range: 온라인자료 유형
domain: 온라인 자료
label: type of resource @en
term status: stable

연속자료유형
type: ObjectProperty
range: 연속자료구분
domain: Collection
label: type of continuous data @en
term status: stable

간행빈도유형
type: ObjectProperty
range: 간행빈도구분
domain: Collection
label: type of publication frequency @en
term status: stable

간행상태유형
type: ObjectProperty
range: 간행상태구분
domain: Collection
label: type of publication status @en
term status: stable

자료유형
type: ObjectProperty
domain: Class
  union of: Document
  union of: Collection
range: 자료구분
label: type of data @en
term status: stable

한국십진분류기호
type: ObjectProperty
range: Concept
label: kdc @en
term status: stable

is subject of
type: ObjectProperty
term status: stable

학위수여 기관
type: ObjectProperty
label: awarded from @en
domain: Thesis
range: Organization
comment: 학위수여대학과 대학원을 기술한다.
term status: stable

발행되다
type: ObjectProperty
domain: Document
label: published in @en
term status: stable

발행
type: ObjectProperty
range: Document
label: publish @en
term status: stable

시군구 레벨
type: ObjectProperty
domain: Location
label: municipal level @en
term status: stable

듀이십진분류기호
type: ObjectProperty
range: Concept
label: ddc @en
term status: stable

modified by
type: ObjectProperty
range: Person
sub property of: managed by
term status: stable

저작하다
type: ObjectProperty
label: create @en
range: Document
term status: stable

광역시도 레벨
type: ObjectProperty
domain: Location
label: provincial level @en
term status: stable

한국십진분류기호
type: Property
label: Korean Decimal Classification Number @en
comment: KDC 분류기호를 기술한다. 복수주제를 다룬 자료로서 분류기호가 2개 이상 부여되는 경우에는 식별기호 ▾a를 반복하여 기술한다.
term status: stable

듀이십진분류기호
type: Property
label: Dewey Decimal Classification Number @en
comment: 듀이십진분류기호를 기술한다. 동일자료에 둘 이상의 분류기호가 부여된 경우에는 청구기호를 구성하는 식별기호(첫번째 ▾a 및 ▾b) 뒤에 ▾a를 반복하여 두 번째 이하 분류기호를 기술한다.
term status: stable

부제목
type: Property
sub property of: title
label: subtitle @en
term status: stable

총서번호
type: DatatypeProperty
range: string
domain: Collection
label: volume of series @en
comment: 총서에 주어진 권차 또는 차례를 나타내는 명칭을 기술한다.
term status: stable

원본주기
type: DatatypeProperty
domain: Class
  union of: Document
  union of: Collection
range: Literal
sub property of: description
label: original version note @en
comment: 해당자료가 영인, 복사, 마이크로형태 등에 의한 복제물이고 복제본을 중심으로 서지정보를 기술한 경우, 그 원본에 관한 사항을 기술한다.
term status: stable

자료형태
type: DatatypeProperty
label: medium @en
comment: 인쇄자료 이외의 각종 형태자료의 자료종별성격을 나타내는 매체 표시를 기술한다. ISBD 원칙에 따라 매체표시는 항상 각괄호([ ])로 묶어 기술한다. 종합표제 대신 개별저작의 표제를 기술할 경우에는 첫 번째 표제 다음에 기재한다. 식별기호 ▾a가 반복될 경우에는 첫 번째 식별기호 ▾a 다음에 기술한다.
term status: stable

학위수여연도
type: DatatypeProperty
range: Literal
domain: Thesis
label: degree year @en
comment: 학위수여연월을 기술한다. 학위논문은 학위청구연도와 학위수여연도가 다른 경우, 학위수여연도를 008/06(발행년 유형) s(단일연도), 260 필드의 발행연도에도 동일하게 적용한다. 학위청구연도가 명확하게 구별되지 않는 경우에는 최근 연도를 적용한다.
term status: stable

후속저록 표제
type: DatatypeProperty
label: title of succeeding @en
comment: 식별기호 ▾t는 관련 레코드의 245(표제와 책임표시사항) 필드 또는 130(기본표목-통일표제) 필드의 식별기호 ▾a, ▾f, ▾g, ▾k, ▾n, ▾p로부터 표제정보를 기술한다. 표제의 개별적인 구성요소들은 별도의 식별기호로 부호화되지 않는다.
term status: stable

전기 또는 역사 관련 주기
type: DatatypeProperty
range: string
domain: Class
  union of: Document
  union of: Collection
label: biographical note @en
comment: 기술대상 자료의 저자명 표목으로 채택된 개인의 전기적 정보나 단체 또는 사건에 대한 역사적인 정보를 기술한다.
term status: stable

상위총서 관계표시
type: DatatypeProperty
range: string
domain: Collection
label: related parts @en
term status: stable

복제기관
type: DatatypeProperty
domain: Class
  union of: Document
  union of: Collection
sub property of: 복제주기
range: Literal
label: reproduction institution @en
comment: 복제기관을 기술한다. 만약에 동일한 복제물에 대하여 복제기관이 하나 이상일 경우 반복하여 기술할 수 있다.
term status: stable

복제주기
type: DatatypeProperty
domain: Class
  union of: Document
  union of: Collection
range: Literal
sub property of: description
label: reproduction note @en
comment: 해당자료가 영인, 복사, 마이크로형태 등에 의한 복제물이고 그 원본을 중심으로 서지정보를 기술한 경우, 복제에 관한 사항을 기술한다. 이 필드에는 원본이 복제된 사항을 기술한다. 서지 레코드를 원본을 중심으로 기술하고 복제와 관련된 정보는 533 필드에 주기로 기술한다. 목록작성기관에서 기술부에 원본을 반영할 것을 선택한 경우, 복제본에 관한 정보를 반영하는 데 사용된다. 복합 자료의 경우, 기관에서 복제물만을 소장할 때, 이 필드에는 복제된 기록물 단위로 기술하고 기술부는 관례에 따라 원본을 기준으로 작성한다. 이 필드는 보통 원본을 소장하고 있는 기관을 나타내는 535(원본/복제본 소재주기) 필드와 관련하여 사용한다.
term status: stable

듀이십진분류기호 판표시
type: DatatypeProperty
domain: Class
  union of: Document
  union of: Collection
range: Literal
label: edition of DDC @en
comment: 분류에 적용한 DDC분류표의 판을 분류기호 뒤에 기술한다. 한 자료에 하나 이상의 분류기호가 서로 판이 다른 경우, 필드를 반복하여 독립된 필드에 기술한다.
term status: stable

기타형태저록 표제
type: DatatypeProperty
label: title of additional physical form @en
comment: 식별기호 ▾t는 관련 레코드의 245(표제와 책임표시사항) 필드 또는 130(기본표목-통일표제) 필드의 식별기호 ▾a, ▾f, ▾g, ▾k, ▾n, ▾p로부터 표제정보를 기술한다. 표제의 개별적인 구성요소들은 별도의 식별기호로 부호화되지 않는다.
term status: stable

통일표제
type: DatatypeProperty
range: string
label: uniform title of series @en
comment: 이 필드는 총서의 부출표목이 서명일 경우를 나타낸다. 830 필드는 보통 총서와 관련된 필드 490 필드의 총서사항이나 500 필드의 일반주기로 판단될 수 있다. 복제물의 경우 533(복제주기) 필드의 ▾f(복제 총서사항)에 기술된 것을 근거로 기술할 수 있다.
term status: stable

소장기관
type: DatatypeProperty
domain: Class
  union of: Document
  union of: Collection
range: Literal
label: holding institution @en
comment: 자료를 소장하고 있는 기관명에 대한 KORMARC의 부호를 기술한다. 관련 KORMARC 부호는 국립중앙도서관에서 제공하는 "부속서 7. 한국도서관부호표"의 부호를 적용한다.
term status: stable

생산처
type: DatatypeProperty
range: string
domain: Class
  union of: Document
  union of: Collection
label: producer @en
comment: 생산처
term status: stable

표제변동 권연차표시
type: DatatypeProperty
range: string
domain: Collection
label: date sequential designation @en
comment: 기술되는 변경 전 표제와 관련된 권·연차를 기술한다.
term status: stable

축약표제
type: DatatypeProperty
domain: Collection
range: string
label: abbreviated title @en
comment: 색인작성이나 식별을 목적으로 축약된 해당자료의 표제를 기술한다. 등록표제(222 필드)에 기초하여 ISSN 센터가 부여하는 축약표제를 말한다. 기타 축약 표제는 목록작성기관에서 제공한다. 여기에는 초록 및 색인 작성도 포함된다. 약어 표제는 이 필드를 제공하는 기관에 의해 작성될 수 있으며 잡지기사에서 채택될 수도 있다.
term status: stable

소장본 주기
type: DatatypeProperty
domain: Class
  union of: Document
  union of: Collection
range: Literal
sub property of: description
label: holding item note @en
comment: 해당기관 소장본의 낙장(落張), 배접(褙接), 보사(補寫), 인문(印文), 장서기(藏書記), 지어(識語), 묵서(墨書)나 열람용 복제본 여부, 소장 원본·복제본의 청구기호 등 소장본 관련 로컬정보를 기술한다.
term status: stable

구성단위저록 표제
type: DatatypeProperty
label: title of constituent unit @en
comment: 식별기호 ▾t는 관련 레코드의 245(표제와 책임표시사항) 필드 또는 130(기본표목-통일표제) 필드의 식별기호 ▾a, ▾f, ▾g, ▾k, ▾n, ▾p로부터 표제정보를 기술한다. 표제의 개별적인 구성요소들은 별도의 식별기호로 부호화되지 않는다.
term status: stable

인용 참고 주기
type: DatatypeProperty
domain: Class
  union of: Document
  union of: Collection
range: Literal
sub property of: description
label: citation reference note @en
comment: 이 필드는 자료의 서평 및 발행된 서지 기술에 대한 인용사항이나 참고문헌 주기를 기술하며 자료가 어디에서 인용되고, 서평 기사를 수록하고 있는지를 상술하는데 적용된다. 인용사항이나 참고문헌은 간략한 형태 즉, 일반적으로 인식할 수 있는 약자 등으로 기술된다. 실제 발행된 기술의 내용은 510 필드에 기술되지 않고, 520(요약 등 주기) 필드에 기술된다. 도서와 녹음자료의 경우, 자료의 출판된 기술사항(예, 간략하고 표준화된 형식으로 기술된 희귀자료 기술) 또는 서평(전문 저술에 관한 비평)에 대한 참고문헌을 주기한다. 연속간행물의 경우, 연속간행물에 대한 색인 또는 요약이 실린 출판물을 상술하고, 알 수 있을 때 수록 날짜 범위까지 상술하는데 적용된다. 참조된 색인과 초록 서비스는 주로 연속간행물로서 발행된 것들이다. 단행본 표제라 할지라도 어떤 주제 분야의 참고자료로 쓰이고, 연속간행물 형식은 아니지만 일정한 기간을 다룬다면 여기서 다룰 수 있다. 집합물로 다루어지는 인쇄물이 아닌 시청각자료나 그래픽 자료인 경우, 이 필드는 작품 또는 작품집에 대한 기술을 수록하고 있는 참고자료들을 기술한다. 복합자료의 경우, 기술된 자료의 초록, 인용, 기술, 색인을 수록한 참고문헌을 기술한다.
term status: stable

학과, 전공
type: DatatypeProperty
range: Literal
domain: Thesis
label: department @en
comment: 논문에 나타나 있는 학과 또는 전공을 기술한다.
term status: stable

폐관여부
type: DatatypeProperty
domain: 도서관
range: boolean
label: is closed @en
term status: stable

복제장소
type: DatatypeProperty
domain: Class
  union of: Document
  union of: Collection
sub property of: 복제주기
range: Literal
label: reproduction place @en
comment: 복제물이 만들어진 장소의 명칭을 기술한다. 복제장소가 한 곳 이상일 때에는 반복하여 기술할 수 있다.
term status: stable

듀이십진분류기호 도서기호
type: DatatypeProperty
sub property of: 도서기호
domain: Class
  union of: Document
  union of: Collection
range: Literal
label: item number of DDC @en
comment: 청구기호 중 도서기호를 기술한다. 이 식별기호에는 자료(또는 세트) 기호를 기술할 수도 있다.
term status: stable

도서기호
type: DatatypeProperty
label: item number @en
term status: stable

미국정부간행물번호
type: DatatypeProperty
domain: Class
  union of: Document
  union of: Collection
range: string
label: gpo @en
comment: GPO자료번호를 기술한다. 마이크로필름인 경우에는 GPO자료번호 뒤에 "MF"를 원괄호로 묶어 기술한다.
term status: stable

복제일자
type: DatatypeProperty
sub property of: 복제주기
range: Literal
domain: Class
  union of: Document
  union of: Collection
label: reproduction date @en
comment: 복제물이 만들어진 일자를 기술한다. 연속간행물일 경우 시작일과 종료일을 기술한다.
term status: stable

사망연도
type: DatatypeProperty
range: int
domain: Person
label: death year @en
comment: 몰년
term status: stable

개관연도
type: DatatypeProperty
range: integer
label: opening year @en
term status: stable

미국국회도서관 청구기호 도서기호
type: DatatypeProperty
sub property of: 도서기호
domain: Class
  union of: Document
  union of: Collection
range: Literal
label: item number of LC @en
comment: 청구기호상의 도서기호를 기술한다.
term status: stable

상위총서 기본표목
type: DatatypeProperty
range: string
domain: Collection
label: main entry heading @en
comment: 식별기호 ▾a는 관련 레코드 100(기본표목-개인명) 필드, 110(기본표목-단체명) 필드, 111(기본표목-회의명) 필드의 기본표목 데이터를 포함한다. 하지만 식별기호에서는 1XX 필드에서 사용하는 개별적인 이름의 요소나 통일표제는 기술되지 않는다.
term status: stable

변경전 표제 설명주기
type: DatatypeProperty
range: string
domain: Collection
label: former title complexity note @en
comment: 변경전 표제 설명주기에 관한 사항을 기술한다.
term status: stable

제작처
type: DatatypeProperty
range: string
domain: Class
  union of: Document
  union of: Collection
label: manufacturer @en
comment: 제작처
term status: stable

제작년
type: DatatypeProperty
domain: Class
  union of: Document
  union of: Collection
label: date of manufacture @en
comment: 제작년 또는 인쇄년을 기술한다. 발행년 식별기호인 ▾c에 제작년 또는 인쇄년을 기술한 경우에는 식별기호 ▾g에는 기술하지 않는다.
term status: stable

관종구분
type: DatatypeProperty
range: string
domain: 도서관
label: library type @en
term status: stable

출판시도서목록 제어번호
type: DatatypeProperty
range: Literal
domain: Document
label: CIP system control number @en
comment: 한 레코드에 하나의 제어번호를 부여한다. 제어번호의 구조는 자료구분부호 3자리, 연도 4자리, 일련번호 6자리로 구성한다. 출판예정도서목록(CIP) 레코드는 CIP를 자료구분부호로 사용한다. CIP 레코드는 자료의 물리적 형태와 관계없이 연도별로 일련번호를 부여한다.
term status: stable

선행저록 표제
type: DatatypeProperty
label: title of preceding @en
comment: 식별기호 ▾t는 관련 레코드의 245(표제와 책임표시사항) 필드 또는 130(기본표목-통일표제) 필드의 식별기호 ▾a, ▾f, ▾g, ▾k, ▾n, ▾p로부터 표제정보를 기술한다. 표제의 개별적인 구성요소들은 별도의 식별기호로 부호화되지 않는다.
term status: stable

연관저록 설명 주기
type: DatatypeProperty
domain: Class
  union of: Document
  union of: Collection
range: Literal
sub property of: description
label: linking entry complexity note @en
comment: 해당자료와 관련 있는 서명 및 관련 있는 기술사항을 기술한다.
term status: stable

수정 날짜
type: DatatypeProperty
range: dateTime
sub property of: date
label: modification date @en
term status: stable

특수한 권차표시주기
type: DatatypeProperty
range: string
domain: Collection
label: numbering peculiarities note @en
comment: 식별기호 ▾a는 특수하거나 예외적인 권차를 기술한다. 식별기호 ▾a 아래 기술하는 특수하거나 예외적인 권차의 유형들은 다음과 같다.
term status: stable

국가디지털콘텐츠식별체계
type: DatatypeProperty
comment: 한국형 URN 식별 체계
label: Universal Content Identifier @en
term status: stable

분류기호 정보원
type: DatatypeProperty
domain: Class
  union of: Document
  union of: Collection
range: Literal
label: source of other number @en
comment: 식별기호 ▾a(분류기호)의 적용 분류표와 판표시를 분류기호 뒤에 기술하되, 분류표는 제1지시기호가 b/(그 외의 분류표)인 경우에만 기술한다. 적용된 분류표의 판이 달라 발생하는 2개 이상의 분류기호의 경우에는 필드를 반복하여 기술하는 것이 바람직하다.
term status: stable

트리플 발행 일시
type: DatatypeProperty
sub property of: date
label: date published @en
term status: stable

전시
type: DatatypeProperty
label: exhibition @en
comment: 전시내용을 기술한다.
term status: stable

발행지
type: DatatypeProperty
domain: Class
  union of: Document
  union of: Collection
range: Literal
label: publication place @en
comment: 발행지
term status: stable

배포년
type: DatatypeProperty
domain: Class
  union of: Document
  union of: Collection
label: date of distribute @en
comment: 배포년
term status: stable

표준기술보고서번호
type: DatatypeProperty
domain: Document
range: Literal
label: Standard Technical Report Number @en
comment: 해당자료의 표준기술보고서번호를 기술한다.
term status: stable

소장사항
type: DatatypeProperty
range: string
domain: Class
  union of: Collection
  union of: Document
label: local holding @en
comment: 이 필드는 각 로컬도서관에서 도서관부호와 소장자료의 등록번호, 권·연차기호, 복본기호, 별치기호 등을 기술한다. 도서관에 따라 소장사항은 049 필드나 090 필드가 아닌 다른 로컬필드(092, 093 필드 등) 또는 소장 MARC의 필드(852 필드 등)를 사용할 수 있다. KORMARC에서 표시기호에 사용된 숫자 "9"는 대체로 로컬 도서관에서 사용하여 내용을 기술하였음을 의미한다. 049 필드는 MARC21이나 다른 나라의 MARC와는 다른 형식이다.
term status: stable

변경전 표제
type: DatatypeProperty
range: string
domain: Collection
label: former title @en
comment: 권차 또는 권차명 표시를 제외한 본표제, 별표제 또는 관제를 포함하는 본표제를 기술한다. 본표제가 반복되는 경우에는 식별기호(▾a)를 반복한다. 두 번째 이하의 식별기호(▾a)는 245 필드에서 직접 부출 되지 않고 740 필드에 자동생성을 위한 용도로 사용된다. 또한 이 식별기호에는 종합 표제가 없는 집서의 경우, 독립된 저작의 첫 번째 표제(동일하거나 다른 저자/작곡가)를 기술한다.
term status: stable

확인자료명
type: DatatypeProperty
range: string
domain: Collection
label: source of information @en
comment: 창간호나 종간호를 소장하지 않아 권·연차를 다른 정보원으로부터 채기한 경우 (제1지시기호가 1) 그 정보원을 참조(Cf.)와 함께 기술한다.
term status: stable

장르
type: DatatypeProperty
range: string
label: genre @en
term status: stable

등급
type: DatatypeProperty
range: string
label: rank @en
term status: stable

발행처주기
type: DatatypeProperty
range: string
domain: Collection
label: issuing body note @en
comment: 발행처주기에 관한 사항을 기술한다.
term status: stable

이전 간행빈도 시행 연월
type: DatatypeProperty
domain: Collection
label: date of former publication frequency @en
comment: 이전의 간행빈도에 해당하는 연·월을 기술한다.
term status: stable

기타 분류기호
type: DatatypeProperty
domain: Class
  union of: Document
  union of: Collection
range: Literal
label: Other Classification Number @en
comment: 제1지시기호에 정의된 분류기호를 기술한다. 복수주제를 다룬 자료로서 분류기호가 2개 이상 부여되는 경우에는 식별기호 ▾a를 반복하여 기술한다.
term status: stable

하위총서저록 기본표목
type: DatatypeProperty
label: subseries entry heading @en
comment: 식별기호 ▾a는 관련 레코드 100(기본표목-개인명) 필드, 110(기본표목-단체명) 필드, 111(기본표목-회의명) 필드의 기본표목 데이터를 포함한다. 하지만 식별기호에서는 1XX 필드에서 사용하는 개별적인 이름의 요소나 통일표제는 기술되지 않는다.
term status: stable

검증부호
type: DatatypeProperty
domain: Class
  union of: Document
  union of: Collection
range: Literal
label: authentication code @en
term status: stable

링크 생성 일시
type: DatatypeProperty
sub property of: date
label: date linked @en
term status: stable

원본/복제본 소재 주기
type: DatatypeProperty
domain: Class
  union of: Document
  union of: Collection
range: Literal
sub property of: description
label: Location of Originals/Duplicates Note @en
comment: 기술대상 자료의 원본이나 복제본이 타기관에 소장되어 있는 경우, 그 원본이나 복제본의 소장처를 기술한다. 이 필드는 원본이나 복제본이 기술된 자료와 다른 곳에 있을 경우에만 기술한다.
term status: stable

현재 간행빈도 시작 연월
type: DatatypeProperty
range: string
domain: Collection
label: date of current publication frequency @en
comment: 현재 간행빈도가 창간호의 간행빈도와 같지 않을 경우 현재 간행빈도 시작 연·월을 기술한다. 이전의 간행빈도는 321 필드에 기술한다.
term status: stable

숫자부호
type: DatatypeProperty
range: string
label: number mark @en
term status: stable

미국국회도서관 청구기호 분류기호
type: DatatypeProperty
domain: Class
  union of: Document
  union of: Collection
range: Literal
sub property of: 분류기호
label: Library of Congress Call Number - Classification Number @en
comment: 청구기호상의 분류기호를 기술한다.
term status: stable

분류기호
type: DatatypeProperty
label: classification number @en
term status: stable

모체레코드저록 표제
type: DatatypeProperty
label: title of supplement parent @en
comment: 식별기호 ▾t는 관련 레코드의 245(표제와 책임표시사항) 필드 또는 130(기본표목-통일표제) 필드의 식별기호 ▾a, ▾f, ▾g, ▾k, ▾n, ▾p로부터 표제정보를 기술한다. 표제의 개별적인 구성요소들은 별도의 식별기호로 부호화되지 않는다.
term status: stable

권,연차 또는 발행년 표시
type: DatatypeProperty
range: string
domain: Collection
label: date of publication sequential designation @en
comment: 이 식별기호에는 창간 권호차와 연월차 뒤에 종간 권호차와 연월차를 기술하되 현재 계속 간행중인 경우에는 창간권·연차 뒤에 짧은 붙임표( - )를 표시한다. 권호차표시는 권차, 판차, 호수, 총서번호 또는 발행처가 관례에 따라 부여한 다른 순차적인 명칭을 기술한다. 연월차는 간행빈도에 따라 "연·월·일"이나 "연과 월 또는 계절", "연"으로 구성된다. 권호차와 연월차가 둘 다 나타나 있는 경우 연월차는 권호차 뒤에 원괄호로 묶어 기술한다.
term status: stable

등록표제
type: DatatypeProperty
domain: Collection
range: string
label: key title @en
comment: 등록표제는 022(ISSN) 필드에 기록된 국제표준연속간행물번호(ISSN)와 관련되어 연속간행물에 부여되는 표제이다. 이 표제는 한 편의 연속간행물에서 그대로 옮겨온 표제정보로 작성되거나, 필요한 경우 유일성을 갖도록 하는 한정어로 구성된다. 등록표제는 국가센터에 의해 부여된 데이터요소이며 ISSN 네트워크에 연결된 국가센터에서 부여한다.
term status: stable

휴관일
type: DatatypeProperty
range: string
label: date of closed @en
term status: stable

한국십진분류기호 도서기호
type: DatatypeProperty
sub property of: 도서기호
range: Literal
domain: Class
  union of: Document
  union of: Collection
label: iterm number of KDC @en
comment: 청구기호 중 도서기호를 기술한다. 이 식별기호에는 자료(또는 세트) 기호를 기술할 수도 있다.
term status: stable

출생연도
type: DatatypeProperty
range: int
domain: Person
label: birth year @en
comment: 생년
term status: stable

입력 날짜
type: DatatypeProperty
sub property of: date
range: dateTime
label: input date @en
term status: stable

국립중앙도서관 청구기호 도서기호
type: DatatypeProperty
domain: Class
  union of: Document
  union of: Collection
sub property of: 도서기호
range: Literal
label: item number of NLK @en
comment: 국립중앙도서관 청구기호상의 도서기호를 기술한다. 적용 도서기호는 국립중앙도서관 동양서 저자기호표, 카터-샌본저자기호표(Cutter-Sanborn Three-Author Table), 수입순기호 등이 있다.
term status: stable

관계 정보
type: DatatypeProperty
label: relationship information @en
term status: stable

확인 날짜
type: DatatypeProperty
sub property of: date
range: dateTime
label: confirm date @en
term status: stable

기본자료저록 표제
type: DatatypeProperty
label: title of host item @en
comment: 식별기호 ▾t는 관련 레코드의 245(표제와 책임표시사항) 필드 또는 130(기본표목-통일표제) 필드의 식별기호 ▾a, ▾f, ▾g, ▾k, ▾n, ▾p로부터 표제정보를 기술한다. 표제의 개별적인 구성요소들은 별도의 식별기호로 부호화되지 않는다.
term status: stable

도법
type: DatatypeProperty
label: projection @en
comment: 전체 도법표시를 기술한다. ISBD의 원칙에 따라 ▾b는 쌍반점(;)을 앞세워 기술한다.
term status: stable

국립중앙도서관 청구기호 권연차기호
type: DatatypeProperty
range: Literal
domain: Document
sub property of: volume
comment: 국립중앙도서관 청구기호상의 권·연차기호를 기술한다. 권·연차가 연속된 경우에는 처음 권·연차와 마지막 권·연차를 붙임표( - )로 연결한다. 단, 현재 계속 간행중인 경우에는 처음 권·연차 뒤에 붙임표( - )까지만 입력한다
label: volume of NLK @en
term status: stable

서지 등 주기
type: DatatypeProperty
domain: Class
  union of: Document
  union of: Collection
range: Literal
sub property of: description
label: bibliography @en
comment: 주기의 전체설명을 해당 면수와 함께 기술한다.
term status: stable

현재 간행빈도
type: DatatypeProperty
range: string
domain: Collection
label: current publication frequency @en
comment: 현행 출판물의 간행빈도를 기술한다.
term status: stable

부록주기
type: DatatypeProperty
domain: Class
  union of: Document
  union of: Collection
range: Literal
sub property of: description
label: supplement note @en
comment: 부록주기를 기술한다. 식별기호 ▾a는 이 주기의 전체 내용을 기술한다.
term status: stable

원저표제
type: DatatypeProperty
range: string
label: title of original language @en
comment: 식별기호 ▾t는 관련 레코드의 245(표제와 책임표시사항) 필드 또는 130(기본표목-통일표제) 필드의 식별기호 ▾a, ▾f, ▾g, ▾k, ▾n, ▾p로부터 표제정보를 기술한다. 표제의 개별적인 구성요소들은 별도의 식별기호로 부호화되지 않는다.
term status: stable

총서표제
type: DatatypeProperty
range: string
domain: Class
  union of: Document
  union of: Collection
label: title of series @en
comment: 이 필드에는 총서사항과 총서표제의 부출표목이 같은 경우에 총서사항을 기술한다. 이 필드는 총서사항이자 총서부출표목이다. 440 필드가 있는 경우, 이에 대응하는 830 필드는 440 필드와 중복되기 때문에 사용되지 않는다. 총서사항은 매체 표시(식별기호 ▾h)를 포함하지 않으므로, 총서부출표목에 매체 표시가 필요한 경우, 490 필드가 총서부출표목에 대응하는 8XX 필드와 함께 총서사항에 사용된다.
term status: stable

원시자료의 정보원
type: DatatypeProperty
label: antecedent source @en
term status: stable

원저 기본표목
type: DatatypeProperty
label: heading of original language @en
comment: 식별기호 ▾a는 관련 레코드 100(기본표목-개인명) 필드, 110(기본표목-단체명) 필드, 111(기본표목-회의명) 필드의 기본표목 데이터를 포함한다. 하지만 식별기호에서는 1XX 필드에서 사용하는 개별적인 이름의 요소나 통일표제는 기술되지 않는다.
term status: stable

표제 관련정보
type: DatatypeProperty
range: string
domain: Collection
label: remainder of title @en
comment: 서지레코드의 표제와 책임표시사항을 기술한다. 이 필드는 본표제를 구성하며 또한 자료유형표시, 표제의 나머지 부분, 기타 표제 관련 정보, 표제지 상의 나머지 부분 전기(轉記)/책임표시로 구성된다. 표제에는 별표제, 편차/권차, 권제/편제가 포함된다.
term status: stable

개관일
type: DatatypeProperty
range: string
label: date of opening @en
term status: stable

번역저 기본표목
type: DatatypeProperty
label: heading of translation @en
comment: 식별기호 ▾a는 관련 레코드 100(기본표목-개인명) 필드, 110(기본표목-단체명) 필드, 111(기본표목-회의명) 필드의 기본표목 데이터를 포함한다. 하지만 식별기호에서는 1XX 필드에서 사용하는 개별적인 이름의 요소나 통일표제는 기술되지 않는다.
term status: stable

국립중앙도서관 청구기호 분류기호
type: DatatypeProperty
domain: Class
  union of: Document
  union of: Collection
range: Literal
sub property of: 분류기호
label: National Library of Korea Call Number - Classification Number @en
comment: 국립중앙도서관 청구기호상의 분류기호를 기술한다. 적용 분류표는 KDC, DDC, KDCP, 조선총독부 신서부·양서부·고서부분류표 등이 있다. 여기에 기술된 분류기호는 분류기호 검색을 위하여 적용분류표에 해당하는 분류기호 필드(KDC는 056, DDC는 082, 그 외는 085)에 다시 기술한다.
term status: stable

배포처
type: DatatypeProperty
range: string
domain: Class
  union of: Document
  union of: Collection
label: distributor @en
comment: 배포처
term status: stable

다른 분류기호 도서기호
type: DatatypeProperty
domain: Class
  union of: Document
  union of: Collection
sub property of: 도서기호
range: Literal
label: item number of other number @en
comment: 청구 기호 중 도서기호를 기술한다.
term status: stable

수상 주기
type: DatatypeProperty
domain: Class
  union of: Document
  union of: Collection
range: Literal
sub property of: description
label: awards note @en
comment: 수상내역을 기술한다.
term status: stable

이용제한사항
type: DatatypeProperty
domain: Class
  union of: Document
  union of: Collection
range: Literal
sub property of: description
label: restriction @en
comment: 자료를 이용하는데 제한이 있는 경우, 그 접근제한에 관한 내용을 기술한다. 출판된 저작의 경우, 이 필드에 배포 제한사항에 대한 정보를 기술한다. 출판물에 접근하는 것을 제한한다는 의미가 아니라 출판물이 특정 이용자층을 대상으로 만들어졌을 경우, 이는 521(이용대상자 주기) 필드에 기술한다. 자료를 접근한 이후 자료를 이용하거나 복제하는 데 대한 제한 내용은 540(이용과 복제 제한에 관한 주기) 필드에 기술한다. 계속자료(serial)의 경우에는 모든 호수에 대해 제한이 적용되는 경우 사용한다
term status: stable

이용과 복제 제한에 관한 주기
type: DatatypeProperty
domain: Class
  union of: Document
  union of: Collection
range: Literal
sub property of: description
label: use and reproduction note @en
comment: 이용과 복제에 관한 사항을 기술한다. 이 사항은 법적인 효력을 가지고 있거나 공식적인 제한규정을 의미하는 것이다.
term status: stable

하절기 개관시간
type: DatatypeProperty
domain: 도서관
range: string
label: summer open time @en
term status: stable

이용가능한 다른 형태자료 주기
type: DatatypeProperty
domain: Class
  union of: Document
  union of: Collection
range: Literal
sub property of: description
label: physical form available note @en
comment: 이용가능한 다른 형태자료에 대하여 기술한다. 또한 다른 식별기호에 해당하지 않는 설명도 포함한다.
term status: stable

언어주기
type: DatatypeProperty
domain: Class
  union of: Document
  union of: Collection
range: Literal
sub property of: description
label: language note @en
comment: 해당자료에 사용된 언어에 관한 사항을 문장으로 기술한다. 이 필드는 또한 해당자료에 기재된 알파벳, 문자 또는 다른 기호 체계를 기술하는 데 사용한다. 언어부호(부호)는 008/35-37(언어)과 041(언어부호) 필드에 기술한다.
term status: stable

하위총서표제
type: DatatypeProperty
label: title of sub series @en
comment: 식별기호 ▾t는 관련 레코드의 245(표제와 책임표시사항) 필드 또는 130(기본표목-통일표제) 필드의 식별기호 ▾a, ▾f, ▾g, ▾k, ▾n, ▾p로부터 표제정보를 기술한다. 표제의 개별적인 구성요소들은 별도의 식별기호로 부호화되지 않는다.
term status: stable

축척
type: DatatypeProperty
label: scale @en
comment: 축척이나 그에 상당하는 축척내용을 기술한다. 수직축척이나 지형모형 또는 다른 삼차원자료의 수직확장표시도 이 식별기호에 기술한다.
term status: stable

생산지
type: DatatypeProperty
range: Literal
domain: Class
  union of: Document
  union of: Collection
label: production place @en
comment: 생산지
term status: stable

키워드
type: DatatypeProperty
label: keyword @en
term status: stable

제작지
type: DatatypeProperty
range: Literal
domain: Class
  union of: Document
  union of: Collection
label: manufacturing place @en
comment: 제작지
term status: stable

동절기 개관시간
type: DatatypeProperty
range: string
domain: 도서관
label: winter open time @en
term status: stable

이판저록 표제
type: DatatypeProperty
label: title of other edition @en
comment: 식별기호 ▾t는 관련 레코드의 245(표제와 책임표시사항) 필드 또는 130(기본표목-통일표제) 필드의 식별기호 ▾a, ▾f, ▾g, ▾k, ▾n, ▾p로부터 표제정보를 기술한다. 표제의 개별적인 구성요소들은 별도의 식별기호로 부호화되지 않는다.
term status: stable

상위총서표제
type: DatatypeProperty
range: string
domain: Class
  union of: Document
  union of: Collection
label: title of main series @en
comment: 식별기호 ▾t는 관련 레코드의 245(표제와 책임표시사항) 필드 또는 130(기본표목-통일표제) 필드의 식별기호 ▾a, ▾f, ▾g, ▾k, ▾n, ▾p로부터 표제정보를 기술한다. 표제의 개별적인 구성요소들은 별도의 식별기호로 부호화되지 않는다.
term status: stable

팩스번호
type: DatatypeProperty
range: string
label: fax @en
term status: stable

한국정부간행물 발간등록번호
type: DatatypeProperty
domain: Class
  union of: Document
  union of: Collection
range: string
label: gprn @en
comment: 한국정부간행물 발간등록번호(GPRN: Government Publications Registration Number)를 기술한다. 마이크로필름인 경우에는 GPRN 자료번호 뒤에 "MF"를 원 괄호에 넣어 기술한다.
term status: stable

한국십진분류기호 판표시
type: DatatypeProperty
domain: Class
  union of: Document
  union of: Collection
range: Literal
label: edition of KDC @en
comment: 분류에 적용한 KDC분류표의 판을 분류기호 뒤에 기술한다. 적용된 분류표의 판이 달라 발생하는 2개 이상의 분류기호의 경우에는 056 필드를 반복하여 기술한다.
term status: stable

번역저록 표제
type: DatatypeProperty
range: string
label: title of translation @en
comment: 식별기호 ▾t는 관련 레코드의 245(표제와 책임표시사항) 필드 또는 130(기본표목-통일표제) 필드의 식별기호 ▾a, ▾f, ▾g, ▾k, ▾n, ▾p로부터 표제정보를 기술한다. 표제의 개별적인 구성요소들은 별도의 식별기호로 부호화되지 않는다.
term status: stable

보유판 및 특별호저록 표제
type: DatatypeProperty
label: title of supplement @en
comment: 식별기호 ▾t는 관련 레코드의 245(표제와 책임표시사항) 필드 또는 130(기본표목-통일표제) 필드의 식별기호 ▾a, ▾f, ▾g, ▾k, ▾n, ▾p로부터 표제정보를 기술한다. 표제의 개별적인 구성요소들은 별도의 식별기호로 부호화되지 않는다.
term status: stable

이전 간행빈도
type: DatatypeProperty
range: string
domain: Collection
label: former publication frequency @en
comment: 이전 간행빈도를 기술한다.
term status: stable

회의 정보
type: DatatypeProperty
label: meeting information @en
term status: stable

배포지
type: DatatypeProperty
range: Literal
domain: Class
  union of: Document
  union of: Collection
label: distribution place @en
comment: 배포지
term status: stable

이용대상자 주기
type: DatatypeProperty
domain: Class
  union of: Document
  union of: Collection
range: Literal
sub property of: description
label: audience note @en
comment: 당자료가 특수한 이용자층을 고려하여 간행된 경우, 그 이용대상자를 기술한다. 이용 대상자에 대한 코드정보는 008/22(이용대상자 수준)에 기술하고, 접근제한에 관한 주기는 506(이용제한주기) 필드에 기술한다. (주의: 전자자료나 시각 자료 레코드에서 읽기 수준과 흥미 연령 및 흥미 수준 정보가 521 필드에 기술될 경우, 008/22 필드는 관심 연령 수준이나 학년에 기준을 둔 관심 수준 정보를 기초로 부호화한다.) 접근 제한을 포함하는 주기는 506(이용제한주기) 필드에 기술한다.
term status: stable

scholarly journal
type: 온라인자료 유형
label: 학술지

electronic journal
type: 온라인자료 유형
label: 전자저널

trade journal
type: 온라인자료 유형
label: 무역신문

image
type: 온라인자료 유형
label: 이미지

web site
type: 온라인자료 유형
label: 웹사이트

sound
type: 온라인자료 유형
label: 사운드

transcript
type: 온라인자료 유형
label: 기록물

newspaper
type: 온라인자료 유형
label: 신문

conference proceeding
type: 온라인자료 유형
label: 컨퍼런스 프로시딩

market research report
type: 온라인자료 유형
label: 시장 조사 보고서

other resource
type: 온라인자료 유형
label: 기타

master
type: ThesisDegree
comment: masters degree

working paper
type: 온라인자료 유형
label: 조사 보고서

magazine
type: 온라인자료 유형
label: 매거진

software
type: 온라인자료 유형
label: 소프트웨어

reports
type: 온라인자료 유형
label: 보고서

disabled alternative material
type: 온라인자료 유형
label: 장애인 대체 자료

company report
type: 온라인자료 유형
label: 회사보고서

text
type: 온라인자료 유형
label: 텍스트

standards
type: 온라인자료 유형
label: 표준

book
type: 온라인자료 유형
label: 일반도서

video
type: 온라인자료 유형
label: 동영상 자료

cp
type: 자료구분
label: 회의자료

dm
type: 자료구분
label: 석사학위논문

rp
type: 자료구분
label: 보고서

dp
type: 자료구분
label: 박사학위논문

jo
type: 자료구분
label: 학술지

np
type: 자료구분
label: 신문

ca
type: 자료구분
label: 만화

zz
type: 자료구분
label: 기타(도자기..)

ma
type: 자료구분
label: 잡지

ha
type: 자료구분
label: 교과서

gm
type: 자료구분
label: 일반자료

hr
type: 자료구분
label: 학습서

rb
type: 자료구분
label: 고서

e
type: 간행빈도구분
label: 격주간

h
type: 간행빈도구분
label: 3년1회간

g
type: 간행빈도구분
label: 격년간

b
type: 간행빈도구분
label: 격월간

a
type: 간행빈도구분
label: 연간

d
type: 간행빈도구분
label: 일간

c
type: 간행빈도구분
label: 주2회간

_
type: 간행빈도구분
label: 부정기간

z
type: 간행빈도구분
label: 기타

w
type: 간행빈도구분
label: 주간

t
type: 간행빈도구분
label: 연3회간

u
type: 간행빈도구분
label: 불명

적용안함
type: 간행빈도구분

s
type: 간행빈도구분
label: 반월간

q
type: 간행빈도구분
label: 계간

m
type: 간행빈도구분
label: 월간

j
type: 간행빈도구분
label: 월3회간

i
type: 간행빈도구분
label: 주3회간

k
type: 간행빈도구분
label: 테스트

f
type: 간행빈도구분
label: 반년간

c
type: 간행상태구분
label: 간행중

d
type: 간행상태구분
label: 폐간

u
type: 간행상태구분
label: 알수없음

s
type: 간행상태구분
label: 휴간

gm
type: 연속자료구분
label: 일반잡지

li
type: 연속자료구분
label: 문헌정보학

bm
type: 연속자료구분
label: 점자잡지

pa
type: 연속자료구분
label: 신문

jm
type: 연속자료구분
label: 아동잡지

sm
type: 연속자료구분
label: 학술지

pm
type: 연속자료구분
label: 공잡지