RegistratieveRuimte
type: Class
comment: Op basis van wet- of regelgeving afgebakende ruimte die als eenheid geldt van politiek-bestuurlijke verantwoordelijkheid of voor bedrijfsvoering.
subclass of: VirtueleRuimte
alias: Registratieve ruimte
datum opname: 20220601
herkomst: nen 3610
herkomst definitie: nen 3610
indicatie abstract object: true
toelichting: Registratieve ruimte omvat objecten die onder de wet- of regelgeving vallen of die voor bedrijfsvoering administratief van belang zijn. In veel gevallen zal een dergelijk gebied ook een registratieve aanduiding of registratief nummer hebben. Voorbeelden zijn: gemeente Delft, postcodegebied 2345, politieregio Haaglanden, veiligheidsregio Gelderland-Midden, Nationaal Park De Hoge Veluwe, kadastraal perceel.
subject: registratieve ruimte
notation: RegistratieveRuimte

Oppervlaktewater
type: Class
comment: Massa van water dat de bodem bedekt of in normale omstandigheden kan bedekken.
subclass of: ReeelObject
alias: Oppervlaktewater
datum opname: 20220601
herkomst: nen 3610
herkomst definitie: nen 3610
indicatie abstract object: true
toelichting: Grondwater maakt geen deel uit van de superklasse.
subject: oppervlaktewater
notation: Oppervlaktewater

Kunstwerk
type: Class
comment: Civiel-technische constructie voor de infrastructuur van wegen, water, spoorbanen, waterkeringen en/of leidingen.
subclass of: Constructie
alias: Kunstwerk
datum opname: 20220601
herkomst: nen 3610
herkomst definitie: nen 3610
indicatie abstract object: true
toelichting: Hieronder vallen overbruggingen, waterstaatkundige werken en waterkerende constructies. Overbruggingen kunnen zijn: brug, viaduct, aquaduct enz. Een voorbeeld van een waterstaatkundig werk is een sluis. Voorbeelden van waterkerende constructies zijn stuw en vaste dam.
subject: kunstwerk
notation: Kunstwerk

Waterverplaatsingsruimte
type: Class
comment: Transportruimte waardoor water zich verplaatst.
subclass of: Transportruimte
datum opname: 20220601
herkomst: nen 3610
herkomst definitie: nen 3610
indicatie abstract object: true
toelichting: Een waterverplaatsingsruimte realiseert het hydrologisch aspect van water en met name de oppervlaktewaterhydrologie. Het benoemt de ruimte die wordt gebruikt voor o.a. afwatering, watertoevoer en drainage.
subject: waterverplaatsingsruimte
notation: Waterverplaatsingsruimte

Spoorverkeerruimte
type: Class
comment: Verkeerruimte voor voertuigen die zich over rails verplaatsen.
subclass of: Verkeerruimte
alias: Spoorverkeerruimte
datum opname: 20220601
herkomst: nen 3610
herkomst definitie: nen 3610
indicatie abstract object: true
toelichting: Spoorverkeerruimte wordt gebruikt door bijvoorbeeld treinen, trams en metro's.
subject: spoorverkeerruimte
notation: Spoorverkeerruimte

Begroeiing
type: NodeShape
comment: Planten die op natuurlijke wijze zijn ontstaan of door mensen zijn aangeplant.
alias: Begroeiing
datum opname: 20220601
herkomst: nen 3610
herkomst definitie: nen 3610
indicatie abstract object: true
toelichting: Begroeiing kan dus spontaan of natuurlijk zijn (vegetatie), maar ook door menselijk toedoen tot stand zijn gekomen (aanplant of beplanting) of combinaties daarvan.
subject: begroeiing
notation: Begroeiing
target class: Begroeiing

IdentificeerbaarObject
type: Class
comment: Klasse opgenomen om identificatie-attributen in te defini�ren.
datum opname: 20221216
herkomst: nen 3610
herkomst definitie: nen 3610
indicatie abstract object: true
toelichting: De klasse wordt als superklasse gebruikt voor alle objecttypen waarvan de instanties identificeerbaar moeten zijn.
notation: IdentificeerbaarObject

Verkeerruimte
type: Class
comment: Transportruimte voor verkeer via land, water of lucht.
subclass of: Transportruimte
datum opname: 20220601
herkomst: nen 3610
herkomst definitie: nen 3610
indicatie abstract object: true
toelichting: Verkeerruimten zijn transportruimten die specifiek bedoeld zijn voor het verplaatsen van mensen of goederen al dan niet met vervoersmiddelen, zoals bijvoorbeeld treinen, schepen en vliegtuigen.
subject: verkeerruimte
notation: Verkeerruimte

beginGeldigheid
type: DatatypeProperty
subject: begin geldigheid

Verharding
type: NodeShape
comment: Een door egaliseren, verstevigen en/of verruwen voor het beoogde gebruik geschikt gemaakt oppervlak, bestaande uit in een of meer lagen over een bodem of onderliggende constructie aangelegd materiaal.
alias: Verharding
datum opname: 20220601
herkomst: nen 3610
herkomst definitie: nen 3610
indicatie abstract object: true
toelichting: Een verharding is fysiek begrensd aanwezig. Het type gebruik van de verharding kan meervoudig zijn en hoeft niet de fysieke begrenzing te volgen.
subject: verharding
notation: Verharding
target class: Verharding

VirtueleRuimte
type: Class
comment: Geo-object dat zich geheel of gedeeltelijk niet-materieel manifesteert en dus slechts in abstracte en/of geregistreerde vorm bestaat.
subclass of: GeoObject
alias: Virtuele ruimte
datum opname: 20220601
herkomst: nen 3610
herkomst definitie: nen 3610
indicatie abstract object: true
toelichting: Virtuele ruimten bevatten geo-objecten waarvan de begrenzing of een gedeelte van de begrenzing niet tastbaar en dus ook niet zichtbaar aanwezig is. Het betreft veelal het administratief of wettelijk benoemen en vastleggen van ruimten. Voorbeelden zijn objecten voor bestuurlijke grenzen, eigendomsbegrenzing, beheerbegrenzingen, ruimtelijk beleid.
subject: virtuele ruimte
notation: VirtueleRuimte

Registratie
type: NodeShape
comment: Vastlegging van een versie van een set gegevens.
datum opname: 20220601
herkomst: nen 3610
herkomst definitie: nen 3610
indicatie abstract object: false
toelichting: Bij het registreren van een object als informatieobject horen een aantal metadata die hier betrekking op hebben, zoals versie en registratie van tijdlijngegevens.
subject: objectregistratie
notation: Registratie
property:
  comment: Tijdsaanduiding waarop het object in de werkelijkheid is ontstaan.
  authentiek: OverigeAuthenticiteit
  datum opname: 20220601
  herkomst: nen 3610
  herkomst definitie: nen 3610
  indicatie formele historie: false
  toelichting: Er zijn verschillende datatypen voor de representatie van een tijdsaanduiding: afhankelijk van de gebruikerswensen m.b.t. granulariteit kan o.a. worden gekozen uit typen TM_Instant, Date of DateTime.
  subject: object begintijd
  datatype: dateTime
  group: Levensduur
  max count: 1
  name: objectBeginTijd
  node kind: Literal
  path: objectBeginTijd
property:
  comment: Tijdsaanduiding van het moment waarop deze versie van het informatieobject is opgenomen in de registratie.
  authentiek: OverigeAuthenticiteit
  datum opname: 20220601
  herkomst: nen 3610
  herkomst definitie: nen 3610
  indicatie formele historie: false
  toelichting: Er zijn verschillende datatypen voor de representatie van een tijdsaanduiding: afhankelijk van de gebruikerswensen m.b.t. granulariteit kan o.a. worden gekozen uit typen TM_Instant, Date of DateTime. Voor tijdstip registratie zal DateTime in vrijwel alle gevallen de beste keuze zijn.
  subject: tijdstip registratie
  datatype: dateTime
  group: TijdlijnRegistratie
  max count: 1
  name: tijdstipRegistratie
  node kind: Literal
  path: tijdstipRegistratie
property:
  comment: Start van de periode waarop deze versie van het informatieobject geldig is.
  authentiek: OverigeAuthenticiteit
  datum opname: 20220601
  herkomst: nen 3610
  herkomst definitie: nen 3610
  indicatie formele historie: false
  toelichting: Er zijn verschillende datatypen voor de representatie van een tijdsaanduiding: afhankelijk van de gebruikerswensen m.b.t. granulariteit kan o.a. worden gekozen uit typen TM_Instant, Date of DateTime. De start van een periode is het begin van de tijdsaanduiding; het ?vanaf-moment'. Bij een datum (date) is dat het begin van die dag.
  subject: begin geldigheid
  datatype: date
  group: TijdlijnGeldigheid
  max count: 1
  name: beginGeldigheid
  node kind: Literal
  path: beginGeldigheid
property:
  comment: Tijdsaanduiding waarop het object in de werkelijkheid niet meer geldig is.
  authentiek: OverigeAuthenticiteit
  datum opname: 20220601
  herkomst: nen 3610
  herkomst definitie: nen 3610
  indicatie formele historie: false
  toelichting: Er zijn verschillende datatypen voor de representatie van een tijdsaanduiding: afhankelijk van de gebruikerswensen m.b.t. granulariteit kan o.a. worden gekozen uit typen TM_Instant, Date of DateTime.
  subject: object eindtijd
  datatype: dateTime
  group: Levensduur
  name: objectEindTijd
  node kind: Literal
  path: objectEindTijd
property:
  comment: Eind van de periode dat deze versie van het informatieobject actueel is in de registratie. De periode is tot aan deze tijdsaanduiding. Wanneer deze waarde niet is ingevuld, is de versie nog actueel.
  authentiek: OverigeAuthenticiteit
  datum opname: 20220601
  herkomst: nen 3610
  herkomst definitie: nen 3610
  indicatie formele historie: false
  toelichting: Vanaf deze tijdsaanduiding is deze versie van het informatieobject niet meer actueel in de registratie. Met actueel wordt bedoeld dat er geen nieuwere versie 4 in de registratie is voor dit informatieobject. Aan een lege eindregistratie is ook te zien dat het de actuele versie betreft. Er zijn verschillende datatypen voor de representatie van een tijdsaanduiding: afhankelijk van de gebruikerswensen m.b.t. granulariteit kan o.a. worden gekozen uit typen TM_Instant, Date of DateTime. Voor tijdstipRegistratie zal DateTime in vrijwel alle gevallen de beste keuze zijn. Wanneer bepaalde gegevens op de tijdlijn geldigheid niet meer geldig zijn, te herkennen aan de eindGeldigheid van een versie, wordt bij het vullen van de eindGeldigheid tegelijkertijd ook altijd de eindRegistratie gevuld zodat het duidelijk is vanaf welk moment op de tijdlijn registratie deze gegevens niet meer actueel zijn. De eindRegistratie geeft dus aan wanneer er geregistreerd is dat deze gegevens niet meer actueel zijn.
  subject: eind registratie
  datatype: dateTime
  group: TijdlijnRegistratie
  max count: 1
  name: eindRegistratie
  node kind: Literal
  path: eindRegistratie
property:
  comment: Versieaanduiding van een informatieobject.
  authentiek: OverigeAuthenticiteit
  datum opname: 20220601
  herkomst: nen 3610
  herkomst definitie: nen 3610
  indicatie formele historie: false
  patroon: Waarde van attribuut versie mag maximaal 50 karakters bevatten.
  toelichting: Een versie van een informatieobject is een toestand van een informatieobject met zijn gegevens op een bepaald moment in de tijd. Het attribuut versie maakt geen deel uit van de identificatie van het object, maar kan worden gebruikt om verschillende instanties van hetzelfde informatieobject te identificeren.
  subject: versie
  datatype: string
  max count: 1
  max length: 50
  min length: 1
  name: versie
  node kind: Literal
  path: versie
property:
  comment: Eind van de periode waarop deze versie van het informatieobject geldig is. De periode is tot aan deze tijdsaanduiding. Wanneer deze waarde niet is ingevuld, is de versie nog geldig.
  authentiek: OverigeAuthenticiteit
  datum opname: 20220601
  herkomst: nen 3610
  herkomst definitie: nen 3610
  indicatie formele historie: false
  toelichting: Vanaf het begin van deze tijdsaanduiding is de instantie niet meer geldig. Er zijn verschillende datatypen voor de representatie van een tijdsaanduiding: afhankelijk van de gebruikerswensen m.b.t. granulariteit kan o.a. worden gekozen uit typen TM_Instant, Date of DateTime. Het eind van de periode is tot het begin van de tijdsaanduiding; het ?tot-moment'.
  subject: eind geldigheid
  datatype: date
  group: TijdlijnGeldigheid
  max count: 1
  name: eindGeldigheid
  node kind: Literal
  path: eindGeldigheid
target class: Registratie

objectBeginTijd
type: DatatypeProperty
subject: object begintijd

Leiding
type: Class
comment: Een geheel van geleiders of een ruimte die voorzien is van ��n ommanteling en bestemd is voor transport van materie, data en/of energie.
subclass of: Constructie
alias: Leiding
datum opname: 20220601
herkomst: nen 3610
herkomst definitie: nen 3610
indicatie abstract object: true
toelichting: Voorbeelden zijn: hoogspanningsleiding, riool, waterleiding, glasvezelkabel, gasleiding.
subject: leiding
notation: Leiding

nen3610
type: Ontology
imports: SemantischModel
imports: Basisinformatie-elementen
imports: Waardelijsten
declare:
  namespace: http://modellen.geostandaarden.nl/def/nen3610#
  prefix: nen3610

Constructie
type: Class
comment: Gebouwd object dat direct of indirect met de bodem is verbonden en bedoeld is om ter plaatse te functioneren.
subclass of: ReeelObject
datum opname: 20220601
herkomst: nen 3610
herkomst definitie: nen 3610
indicatie abstract object: true
toelichting: Constructie kan boven- en ondergrondse objecten betreffen. Voorbeelden zijn: huis, brug, asfalt, waterleiding, fabriek, mijnstelsel.
subject: constructie
notation: Constructie

eindRegistratie
type: DatatypeProperty
subject: eind registratie

TijdlijnRegistratie
type: PropertyGroup

Begroeiing
type: Class
comment: Planten die op natuurlijke wijze zijn ontstaan of door mensen zijn aangeplant.
subclass of: ReeelObject
alias: Begroeiing
datum opname: 20220601
herkomst: nen 3610
herkomst definitie: nen 3610
indicatie abstract object: true
toelichting: Begroeiing kan dus spontaan of natuurlijk zijn (vegetatie), maar ook door menselijk toedoen tot stand zijn gekomen (aanplant of beplanting) of combinaties daarvan.
subject: begroeiing
notation: Begroeiing

GeografischeRuimte
type: NodeShape
comment: Ruimte die bekendstaat onder een vanuit de historie of het gebruik bekende benaming of een fysisch-geografische samenhang, al dan niet met zijn omgeving, kent.
alias: Geografische ruimte
datum opname: 20220601
herkomst: nen 3610
herkomst definitie: nen 3610
indicatie abstract object: true
toelichting: De grenzen zijn niet altijd exact vastgesteld. Voorbeelden zijn: Noordoostpolder, Midden-Nederland, rivierengebied, Veluwe, Zuid-Limburg, kustgebied.
subject: geografische ruimte
notation: GeografischeRuimte
target class: GeografischeRuimte

ReeelObject
type: NodeShape
comment: Geo-object dat zich geheel materieel manifesteert.
alias: Re�el object
datum opname: 20220601
herkomst: nen 3610
herkomst definitie: nen 3610
indicatie abstract object: true
toelichting: Een re�el of fysiek object is een tastbaar begrensd object dat gekenmerkt wordt door zijn materiele samenstelling en structuur.
subject: reeel object
notation: ReeelObject
target class: ReeelObject

eindGeldigheid
type: DatatypeProperty
subject: eind geldigheid

Verkeerruimte
type: NodeShape
comment: Transportruimte voor verkeer via land, water of lucht.
datum opname: 20220601
herkomst: nen 3610
herkomst definitie: nen 3610
indicatie abstract object: true
toelichting: Verkeerruimten zijn transportruimten die specifiek bedoeld zijn voor het verplaatsen van mensen of goederen al dan niet met vervoersmiddelen, zoals bijvoorbeeld treinen, schepen en vliegtuigen.
subject: verkeerruimte
notation: Verkeerruimte
target class: Verkeerruimte

versie
type: DatatypeProperty
subject: versie

RegistratieveRuimte
type: NodeShape
comment: Op basis van wet- of regelgeving afgebakende ruimte die als eenheid geldt van politiek-bestuurlijke verantwoordelijkheid of voor bedrijfsvoering.
alias: Registratieve ruimte
datum opname: 20220601
herkomst: nen 3610
herkomst definitie: nen 3610
indicatie abstract object: true
toelichting: Registratieve ruimte omvat objecten die onder de wet- of regelgeving vallen of die voor bedrijfsvoering administratief van belang zijn. In veel gevallen zal een dergelijk gebied ook een registratieve aanduiding of registratief nummer hebben. Voorbeelden zijn: gemeente Delft, postcodegebied 2345, politieregio Haaglanden, veiligheidsregio Gelderland-Midden, Nationaal Park De Hoge Veluwe, kadastraal perceel.
subject: registratieve ruimte
notation: RegistratieveRuimte
target class: RegistratieveRuimte

tijdstipRegistratie
type: DatatypeProperty
subject: tijdstip registratie

IdentificeerbaarObject
type: NodeShape
comment: Klasse opgenomen om identificatie-attributen in te defini�ren.
datum opname: 20221216
herkomst: nen 3610
herkomst definitie: nen 3610
indicatie abstract object: true
toelichting: De klasse wordt als superklasse gebruikt voor alle objecttypen waarvan de instanties identificeerbaar moeten zijn.
notation: IdentificeerbaarObject
property:
  comment: Aanduiding van het domein waarbinnen de identificatie uniek is.
  authentiek: OverigeAuthenticiteit
  datum opname: 20220601
  herkomst: nen 3610
  herkomst definitie: nen 3610
  identificerend: true
  indicatie formele historie: false
  patroon: Alleen de volgende karakters mogen in een waarde van het attribuut domein voorkomen: {'A' ... 'Z', 'a' ... 'z', '0' ... '9', '_', '-', ',', '.', '/', ':'}
  toelichting: Het attribuut domein is een unieke verwijzing naar de registratie- of ketenprocesverantwoordelijke entiteit die de identificatie uitdeelt of regels daartoe heeft opgesteld. In combinatie met het attribuut identificatie wordt een object hiermee uniek identificeerbaar op het niveau van verschillende registraties en ook mondiaal uniek.
  subject: domein
  datatype: string
  max count: 1
  min count: 1
  name: domein
  node kind: Literal
  path: domein
  pattern: ([a-z]|[A-Z]|[0-9]|\\_|\\-|\\,|\\.|\\:|\\/)+
property:
  comment: Unieke identificatiecode van een informatieobject binnen de context van een registratie. Toelichting: ?identificatie' is de identificatiecode die een object heeft binnen een registratie of binnen een ketenproces voor data-uitwisseling. Binnen de registratie of de data-uitwisseling is het object uniek identificeerbaar. In combinatie met het attribuut domein wordt een object hiermee uniek identificeerbaar op het niveau van verschillende registraties, uitwisselprocessen en ook wereldwijd uniek. De reguliere expressie voor de toegestane tekens is: ([a-z]|[A-Z]|[0-9]|\\_|\\-|\\,|\\.|\\:|\\/)+
  authentiek: OverigeAuthenticiteit
  datum opname: 20220601
  herkomst: nen 3610
  herkomst definitie: nen 3610
  identificerend: true
  indicatie formele historie: false
  patroon: Alleen de volgende karakters mogen in een waarde van het attribuut identificatie voorkomen: {'A' ... 'Z', 'a' ... 'z', '0' ... '9', '_', '-', ',', '.', '/', ':'}
  toelichting: ?identificatie' is de identificatiecode die een object heeft binnen een registratie of binnen een ketenproces voor data-uitwisseling. Binnen de registratie of de data-uitwisseling is het object uniek identificeerbaar. In combinatie met het attribuut domein wordt een object hiermee uniek identificeerbaar op het niveau van verschillende registraties, uitwisselprocessen en ook wereldwijd uniek. De reguliere expressie voor de toegestane tekens is: ([a-z]|[A-Z]|[0-9]|\\_|\\-|\\,|\\.|\\:|\\/)+
  subject: identificatie
  datatype: string
  max count: 1
  min count: 1
  name: identificatie
  node kind: Literal
  path: identificatie
  pattern: ([a-z]|[A-Z]|[0-9]|\\_|\\-|\\,|\\.|\\:|\\/)+
property:
  authentiek: OverigeAuthenticiteit
  datum opname: 20220601
  herkomst: nen 3610
  herkomst definitie: nen 3610
  indicatie formele historie: false
  toelichting: De registratiegegevens zijn de versie en tijdlijngegevens die horen bij het registreren van ��n versie van het informatieobject. Ze horen als metadata bij de gegevensset van het informatieobject.
  class: Registratie
  max count: 1
  name: registratiegegevens
  node kind: IRI
  path: registratiegegevens
target class: IdentificeerbaarObject

domein
type: DatatypeProperty
subject: domein

FunctioneleRuimte
type: Class
comment: Ruimte met een specifieke functie.
subclass of: VirtueleRuimte
alias: Functionele ruimte
datum opname: 20220601
herkomst: nen 3610
herkomst definitie: nen 3610
indicatie abstract object: true
toelichting: Een functionele ruimte wordt gebruikt om een (gebruiks)functie aan een ruimte toe te kennen. Het functionele gebruik van de ruimte volgt niet altijd de fysieke begrenzing van re�le objecten.
subject: functionele ruimte
notation: FunctioneleRuimte

TijdlijnGeldigheid
type: PropertyGroup

GeoObject
type: Class
comment: Een fenomeen in de werkelijkheid dat direct of indirect is geassocieerd met een locatie relatief ten opzichte van de aarde.
alias: Geo-object
datum opname: 20220601
herkomst: nen 3610
herkomst definitie: nen 3610
indicatie abstract object: true
toelichting: Van dit objecttype worden geen directe instanties gemaakt. Indien een object een geo-object is, is het altijd een instantie van een subklasse van GeoObject. Alle subklassen van GeoObject hebben conform MIM het stereotype �Objecttype�. Voor publicatie conform NEN-EN-ISO 19109:2015 is het stereotype �FeatureType� verplicht. Binnen de context van NEN 3610 is �Objecttype� het equivalent van �FeatureType�.
subject: geo-object
notation: GeoObject

FunctioneleRuimte
type: NodeShape
comment: Ruimte met een specifieke functie.
alias: Functionele ruimte
datum opname: 20220601
herkomst: nen 3610
herkomst definitie: nen 3610
indicatie abstract object: true
toelichting: Een functionele ruimte wordt gebruikt om een (gebruiks)functie aan een ruimte toe te kennen. Het functionele gebruik van de ruimte volgt niet altijd de fysieke begrenzing van re�le objecten.
subject: functionele ruimte
notation: FunctioneleRuimte
target class: FunctioneleRuimte

Transportruimte
type: NodeShape
comment: Natuurlijke of aangelegde transportlijnen of verbindingen met knooppunten waarlangs stromen zich kunnen verplaatsen.
datum opname: 20220601
herkomst: nen 3610
herkomst definitie: nen 3610
indicatie abstract object: true
toelichting: Transportlijnen worden onder andere gerealiseerd door wegen, spoorwegen, waterwegen, luchtverbindingen.
subject: transportruimte
notation: Transportruimte
target class: Transportruimte

Registratie
type: Class
comment: Vastlegging van een versie van een set gegevens.
datum opname: 20220601
herkomst: nen 3610
herkomst definitie: nen 3610
indicatie abstract object: false
toelichting: Bij het registreren van een object als informatieobject horen een aantal metadata die hier betrekking op hebben, zoals versie en registratie van tijdlijngegevens.
subject: objectregistratie
notation: Registratie

Waterverplaatsingsruimte
type: NodeShape
comment: Transportruimte waardoor water zich verplaatst.
datum opname: 20220601
herkomst: nen 3610
herkomst definitie: nen 3610
indicatie abstract object: true
toelichting: Een waterverplaatsingsruimte realiseert het hydrologisch aspect van water en met name de oppervlaktewaterhydrologie. Het benoemt de ruimte die wordt gebruikt voor o.a. afwatering, watertoevoer en drainage.
subject: waterverplaatsingsruimte
notation: Waterverplaatsingsruimte
target class: Waterverplaatsingsruimte

objectEindTijd
type: DatatypeProperty
subject: object eindtijd

GeografischeRuimte
type: Class
comment: Ruimte die bekendstaat onder een vanuit de historie of het gebruik bekende benaming of een fysisch-geografische samenhang, al dan niet met zijn omgeving, kent.
subclass of: VirtueleRuimte
alias: Geografische ruimte
datum opname: 20220601
herkomst: nen 3610
herkomst definitie: nen 3610
indicatie abstract object: true
toelichting: De grenzen zijn niet altijd exact vastgesteld. Voorbeelden zijn: Noordoostpolder, Midden-Nederland, rivierengebied, Veluwe, Zuid-Limburg, kustgebied.
subject: geografische ruimte
notation: GeografischeRuimte

GeoObject
type: NodeShape
comment: Een fenomeen in de werkelijkheid dat direct of indirect is geassocieerd met een locatie relatief ten opzichte van de aarde.
alias: Geo-object
datum opname: 20220601
herkomst: nen 3610
herkomst definitie: nen 3610
indicatie abstract object: true
toelichting: Van dit objecttype worden geen directe instanties gemaakt. Indien een object een geo-object is, is het altijd een instantie van een subklasse van GeoObject. Alle subklassen van GeoObject hebben conform MIM het stereotype �Objecttype�. Voor publicatie conform NEN-EN-ISO 19109:2015 is het stereotype �FeatureType� verplicht. Binnen de context van NEN 3610 is �Objecttype� het equivalent van �FeatureType�.
subject: geo-object
notation: GeoObject
target class: GeoObject

Wegverkeerruimte
type: NodeShape
comment: Verkeerruimte voor weggebruikers die zich over wegen verplaatsen.
datum opname: 20220601
herkomst: nen 3610
herkomst definitie: nen 3610
indicatie abstract object: true
toelichting: Wegverkeerruimten worden gebruikt door bijvoorbeeld voetgangers, fietsers en autoverkeer.
subject: wegverkeerruimte
notation: Wegverkeerruimte
target class: Wegverkeerruimte

Gebouw
type: NodeShape
comment: Overdekte en geheel of gedeeltelijk met wanden omsloten constructie bedoeld voor het in een afgeschermde omgeving onderbrengen van mensen, dieren of voorwerpen of voor de productie van goederen.
alias: Gebouw
datum opname: 20220601
herkomst: nen 3610
herkomst definitie: nen 3610
indicatie abstract object: true
toelichting: Voorbeelden zijn: huis, schuur, flatgebouw, huizenblok, fabriek.
subject: gebouw
notation: Gebouw
target class: Gebouw

Oppervlaktewater
type: NodeShape
comment: Massa van water dat de bodem bedekt of in normale omstandigheden kan bedekken.
alias: Oppervlaktewater
datum opname: 20220601
herkomst: nen 3610
herkomst definitie: nen 3610
indicatie abstract object: true
toelichting: Grondwater maakt geen deel uit van de superklasse.
subject: oppervlaktewater
notation: Oppervlaktewater
target class: Oppervlaktewater

VoidReasonValue
type: NodeShape
comment: Reden waarom een 'nil'-waarde is ingevuld.
datum opname: 20220601
herkomst: nen 3610
herkomst definitie: nen 3610
indicatie abstract object: false
toelichting: Deze codelijst moet extern worden gepubliceerd.
subject: mogelijk geen waarde
notation: VoidReasonValue
property:
  has value: mogelijk geen waarde
  path:
    inverse path: member
target class: VoidReasonValue

VirtueleRuimte
type: NodeShape
comment: Geo-object dat zich geheel of gedeeltelijk niet-materieel manifesteert en dus slechts in abstracte en/of geregistreerde vorm bestaat.
alias: Virtuele ruimte
datum opname: 20220601
herkomst: nen 3610
herkomst definitie: nen 3610
indicatie abstract object: true
toelichting: Virtuele ruimten bevatten geo-objecten waarvan de begrenzing of een gedeelte van de begrenzing niet tastbaar en dus ook niet zichtbaar aanwezig is. Het betreft veelal het administratief of wettelijk benoemen en vastleggen van ruimten. Voorbeelden zijn objecten voor bestuurlijke grenzen, eigendomsbegrenzing, beheerbegrenzingen, ruimtelijk beleid.
subject: virtuele ruimte
notation: VirtueleRuimte
target class: VirtueleRuimte

Verharding
type: Class
comment: Een door egaliseren, verstevigen en/of verruwen voor het beoogde gebruik geschikt gemaakt oppervlak, bestaande uit in een of meer lagen over een bodem of onderliggende constructie aangelegd materiaal.
subclass of: Constructie
alias: Verharding
datum opname: 20220601
herkomst: nen 3610
herkomst definitie: nen 3610
indicatie abstract object: true
toelichting: Een verharding is fysiek begrensd aanwezig. Het type gebruik van de verharding kan meervoudig zijn en hoeft niet de fysieke begrenzing te volgen.
subject: verharding
notation: Verharding

Transportruimte
type: Class
comment: Natuurlijke of aangelegde transportlijnen of verbindingen met knooppunten waarlangs stromen zich kunnen verplaatsen.
subclass of: FunctioneleRuimte
datum opname: 20220601
herkomst: nen 3610
herkomst definitie: nen 3610
indicatie abstract object: true
toelichting: Transportlijnen worden onder andere gerealiseerd door wegen, spoorwegen, waterwegen, luchtverbindingen.
subject: transportruimte
notation: Transportruimte

ReeelObject
type: Class
comment: Geo-object dat zich geheel materieel manifesteert.
subclass of: GeoObject
alias: Re�el object
datum opname: 20220601
herkomst: nen 3610
herkomst definitie: nen 3610
indicatie abstract object: true
toelichting: Een re�el of fysiek object is een tastbaar begrensd object dat gekenmerkt wordt door zijn materiele samenstelling en structuur.
subject: reeel object
notation: ReeelObject

Levensduur
type: PropertyGroup

Luchtvaartruimte
type: NodeShape
comment: Verkeerruimte voor voertuigen die zich door de lucht verplaatsen.
datum opname: 20220601
herkomst: nen 3610
herkomst definitie: nen 3610
indicatie abstract object: true
toelichting: Luchtvaartruimte wordt bijvoorbeeld gebruikt door allerlei soorten vliegtuigen en helikopters.
subject: luchtvaartruimte
notation: Luchtvaartruimte
target class: Luchtvaartruimte

Luchtvaartruimte
type: Class
comment: Verkeerruimte voor voertuigen die zich door de lucht verplaatsen.
subclass of: Verkeerruimte
datum opname: 20220601
herkomst: nen 3610
herkomst definitie: nen 3610
indicatie abstract object: true
toelichting: Luchtvaartruimte wordt bijvoorbeeld gebruikt door allerlei soorten vliegtuigen en helikopters.
subject: luchtvaartruimte
notation: Luchtvaartruimte

Leiding
type: NodeShape
comment: Een geheel van geleiders of een ruimte die voorzien is van ��n ommanteling en bestemd is voor transport van materie, data en/of energie.
alias: Leiding
datum opname: 20220601
herkomst: nen 3610
herkomst definitie: nen 3610
indicatie abstract object: true
toelichting: Voorbeelden zijn: hoogspanningsleiding, riool, waterleiding, glasvezelkabel, gasleiding.
subject: leiding
notation: Leiding
target class: Leiding

Spoorverkeerruimte
type: NodeShape
comment: Verkeerruimte voor voertuigen die zich over rails verplaatsen.
alias: Spoorverkeerruimte
datum opname: 20220601
herkomst: nen 3610
herkomst definitie: nen 3610
indicatie abstract object: true
toelichting: Spoorverkeerruimte wordt gebruikt door bijvoorbeeld treinen, trams en metro's.
subject: spoorverkeerruimte
notation: Spoorverkeerruimte
target class: Spoorverkeerruimte

Bodem
type: NodeShape
comment: Bovenste deel van de aarde, exclusief oppervlaktewater.
alias: Bodem
datum opname: 20220601
herkomst: nen 3610
herkomst definitie: nen 3610
indicatie abstract object: true
toelichting: Bodem verwijst naar een typering en/of benoeming van het aardoppervlak, waarbij de bodem doorloopt onder het oppervlaktewater. Bodem omvat ook de daaronder liggende bodemmaterialen met indelingen die kunnen verschillen per vakgebied zoals bijvoorbeeld bodemkunde, geologie, geohydrologie en geomorfologie.
subject: bodem
notation: Bodem
target class: Bodem

Scheepvaartruimte
type: Class
comment: Verkeerruimte voor voertuigen die zich over water verplaatsen.
subclass of: Verkeerruimte
datum opname: 20220601
herkomst: nen 3610
herkomst definitie: nen 3610
indicatie abstract object: true
toelichting: Scheepvaartruimte wordt gebruikt door allerlei soorten schepen.
subject: scheepvaartruimte
notation: Scheepvaartruimte

Bodem
type: Class
comment: Bovenste deel van de aarde, exclusief oppervlaktewater.
subclass of: ReeelObject
alias: Bodem
datum opname: 20220601
herkomst: nen 3610
herkomst definitie: nen 3610
indicatie abstract object: true
toelichting: Bodem verwijst naar een typering en/of benoeming van het aardoppervlak, waarbij de bodem doorloopt onder het oppervlaktewater. Bodem omvat ook de daaronder liggende bodemmaterialen met indelingen die kunnen verschillen per vakgebied zoals bijvoorbeeld bodemkunde, geologie, geohydrologie en geomorfologie.
subject: bodem
notation: Bodem

identificatie
type: DatatypeProperty
subject: identificatie

Scheepvaartruimte
type: NodeShape
comment: Verkeerruimte voor voertuigen die zich over water verplaatsen.
datum opname: 20220601
herkomst: nen 3610
herkomst definitie: nen 3610
indicatie abstract object: true
toelichting: Scheepvaartruimte wordt gebruikt door allerlei soorten schepen.
subject: scheepvaartruimte
notation: Scheepvaartruimte
target class: Scheepvaartruimte

VoidReasonValue
type: Class
comment: Reden waarom een 'nil'-waarde is ingevuld.
subclass of: Concept
datum opname: 20220601
herkomst: nen 3610
herkomst definitie: nen 3610
indicatie abstract object: false
toelichting: Deze codelijst moet extern worden gepubliceerd.
subject: mogelijk geen waarde
notation: VoidReasonValue

Gebouw
type: Class
comment: Overdekte en geheel of gedeeltelijk met wanden omsloten constructie bedoeld voor het in een afgeschermde omgeving onderbrengen van mensen, dieren of voorwerpen of voor de productie van goederen.
subclass of: Constructie
alias: Gebouw
datum opname: 20220601
herkomst: nen 3610
herkomst definitie: nen 3610
indicatie abstract object: true
toelichting: Voorbeelden zijn: huis, schuur, flatgebouw, huizenblok, fabriek.
subject: gebouw
notation: Gebouw

Kunstwerk
type: NodeShape
comment: Civiel-technische constructie voor de infrastructuur van wegen, water, spoorbanen, waterkeringen en/of leidingen.
alias: Kunstwerk
datum opname: 20220601
herkomst: nen 3610
herkomst definitie: nen 3610
indicatie abstract object: true
toelichting: Hieronder vallen overbruggingen, waterstaatkundige werken en waterkerende constructies. Overbruggingen kunnen zijn: brug, viaduct, aquaduct enz. Een voorbeeld van een waterstaatkundig werk is een sluis. Voorbeelden van waterkerende constructies zijn stuw en vaste dam.
subject: kunstwerk
notation: Kunstwerk
target class: Kunstwerk

registratiegegevens
type: ObjectProperty

JuridischeRuimte
type: NodeShape
comment: Ruimte waar een juridisch instrument beleid of regelgeving toepast.
alias: Juridische ruimte
datum opname: 20220601
herkomst: nen 3610
herkomst definitie: nen 3610
indicatie abstract object: true
toelichting: Juridische ruimte omvat objecten die zijn gekoppeld aan wet- en beleidsinformatie die aangeeft wat waar krachtens wetgeving of wettelijk beleid is geformuleerd. Voorbeelden zijn: benoeming van ruimten en gebieden in bijvoorbeeld omgevingsvisie, omgevingsverordening, waterschapsverordening, projectbesluit.
subject: juridische ruimte
notation: JuridischeRuimte
target class: JuridischeRuimte

JuridischeRuimte
type: Class
comment: Ruimte waar een juridisch instrument beleid of regelgeving toepast.
subclass of: VirtueleRuimte
alias: Juridische ruimte
datum opname: 20220601
herkomst: nen 3610
herkomst definitie: nen 3610
indicatie abstract object: true
toelichting: Juridische ruimte omvat objecten die zijn gekoppeld aan wet- en beleidsinformatie die aangeeft wat waar krachtens wetgeving of wettelijk beleid is geformuleerd. Voorbeelden zijn: benoeming van ruimten en gebieden in bijvoorbeeld omgevingsvisie, omgevingsverordening, waterschapsverordening, projectbesluit.
subject: juridische ruimte
notation: JuridischeRuimte

Constructie
type: NodeShape
comment: Gebouwd object dat direct of indirect met de bodem is verbonden en bedoeld is om ter plaatse te functioneren.
datum opname: 20220601
herkomst: nen 3610
herkomst definitie: nen 3610
indicatie abstract object: true
toelichting: Constructie kan boven- en ondergrondse objecten betreffen. Voorbeelden zijn: huis, brug, asfalt, waterleiding, fabriek, mijnstelsel.
subject: constructie
notation: Constructie
target class: Constructie

Wegverkeerruimte
type: Class
comment: Verkeerruimte voor weggebruikers die zich over wegen verplaatsen.
subclass of: Verkeerruimte
datum opname: 20220601
herkomst: nen 3610
herkomst definitie: nen 3610
indicatie abstract object: true
toelichting: Wegverkeerruimten worden gebruikt door bijvoorbeeld voetgangers, fietsers en autoverkeer.
subject: wegverkeerruimte
notation: Wegverkeerruimte