has unit
type: Concept
definition: Het hebben van een eenheid @nl
definition: The possession of a unit
preferred label: heeft eenheid @nl

connects object
type: ObjectProperty
type: Property
domain: Class
  union of: Connection
  union of: Interface
range: Physical object
definition: The physical objects connected by a connection or interface

executes
type: Concept
definition: De activiteit uitgevoerd door een fysiek object @nl
definition: The activity executed by a physical object
preferred label: voert uit @nl

Objectification
type: NodeShape
type: Class
subclass of: Abstract concept
subclass of: Restriction
  max cardinality: 1
  on property: value
definition: An attribute (quality or quantity) or relation represented as an individual defined by a concept
property:
  max count: 1
  path: value

transfer type
type: ObjectProperty
type: Property
domain: Interaction
range: Transfer type
definition: The possession of a transfer type by an interaction

State
type: Class
type: NodeShape
subclass of: Concrete concept
subclass of: Restriction
  all values from: State
  on property: has part
definition: Temporal part of an entity during a period between two events. A state is characterized by the properties and relations of the entity
property:
  class: Geometric entity
  path: has boundary
property:
  class: Temporal entity
  path: hasPeriod
property:
  class: Geometric entity
  path: has interior
property:
  class: State
  path: has part

Unit
type: Concept
definition: Een bepaalde hoeveelheidswaarde die is gekozen als schaal voor het meten van andere hoeveelheden van dezelfde soort @nl
definition: A particular quantity value that has been chosen as a scale for measuring other quantities the same kind
preferred label: Eenheid @nl

has temporal entity
type: ObjectProperty
type: Property
domain: Concrete concept
range: Temporal entity
definition: The abstract temporal entity representing a concrete concept in time

Force
type: Transfer type
definition: Physical quantity which, when exerted on a body, causes tension or pressure to arise therein, or which causes the body to change motion, accelerate

executes
type: ObjectProperty
type: Property
domain: Physical object
range: Activity
definition: The activity executed by a physical object

is bound by
type: ObjectProperty
type: Property
domain: Spatial region
range: Physical object
definition: The physical object that bounds a spatial region

chemical formula
type: DatatypeProperty
type: Property
domain: Matter
range: string
definition: The possession of information about the chemical proportions of atoms that constitute a particular chemical compound

requirement severity type
type: Concept
definition: Het hebben van een ernsttype door een eis @nl
definition: The possession of a severity type by a requirement
preferred label: eis ernst type @nl

Pure substance
type: Class
subclass of: Matter
definition: Chemical matter that has an equal chemical composition and recognizable uniform and isotropic properties

Plasma
type: Concept
broader: Aggregation state type
definition: Een fase waarin de deeltjes van een gasvormige stof geïoniseerd zijn @nl
definition: A phase in which the particles of a gaseous substance are ionised

Gas
type: Concept
broader: Aggregation state type
definition: Materie in een tussentoestand tussen vloeistof en plasma die alleen kan worden ingesloten als deze volledig is omgeven door een vaste stof (of in een bel van vloeistof) (of bij elkaar wordt gehouden door zwaartekracht); het kan condenseren tot een vloeistof, of kan (zelden) direct een vaste stof worden door afzetting @nl
definition: Matter in an intermediate state between liquid and plasma that can be contained only if it is fully surrounded by a solid (or in a bubble of liquid) (or held together by gravitational pull); it can condense into a liquid, or can (rarely) become a solid directly by deposition

Realized entity
type: Concept
broader: Entity
definition: Een entiteit die bestaat of heeft bestaan in de fysieke werkelijkheid @nl
definition: An entity that exists or has existed in the physical reality
preferred label: Gerealiseerde entiteit @nl

Requirement source type
type: Enumeration type
type: Class
definition: The type of source from which a requirement comes like a client, by definition, recommended by the sector or demanded by law/regulation

has technical part
type: Concept
broader: has part
definition: Een heeftDeel relatie van technische aard @nl
definition: A hasPart relation of a technical nature
preferred label: heeft technisch deel @nl

begins
type: Concept
definition: De toestand die gestart wordt door een gebeurtenis @nl
definition: The state that is started by an event
preferred label: begint @nl

Heterogeneous mixture
type: Class
subclass of: Mixture
definition: A mixture that is separated into different regions or phases that have different compositions or properties

Top concept
type: Concept
definition: Het meest generieke concept @nl
definition: The most generic concept

participates in
type: ObjectProperty
type: Property
domain: Physical object
range: Interaction
definition: The interaction a physical object participates in

Heterogeneous mixture
type: Concept
broader: Mixture
definition: Een mengsel dat is opgedeeld in verschillende regio's of fasen met verschillende samenstellingen of eigenschappen @nl
definition: A mixture that is separated into different regions or phases that have different compositions or properties
preferred label: Heterogeneen mengsel @nl

over interface
type: ObjectProperty
type: Property
domain: Interaction
range: Interface
definition: The interface over which an interaction between physical objects takes place

State
type: Concept
broader: Concrete concept
definition: Temporeel deel van een entiteit gedurende een periode tussen twee gebeurtenissen. Een toestand wordt gekenmerkt door de eigenschappen en relaties van de entiteit @nl
definition: Temporal part of an entity during a period between two events. A state is characterized by the properties and relations of the entity
preferred label: Toestand @nl

Matter
type: Concept
alternative label: Chemical substance
broader: Physical object
definition: Een pure chemische stof, chemische verbinding of mengsel waaruit reële objecten zijn gemaakt @nl
definition: A pure chemical substance, chemical compound or mixture from which real objects are made
preferred label: Materie @nl

Connection
type: NodeShape
type: Class
subclass of: Physical object
definition: A physical object (real object or spatial area) that connects two other physical objects and over which interaction takes place, namely the transfer of matter, energy, information or forces
property:
  class: Port
  path: connects port
property:
  class: Physical object
  path: connects object

contains
type: ObjectProperty
type: Property
domain: Spatial region
range: Real object
definition: The real objects located in a spatial region, typically the gaseous amount of bulk matter present in that region

Force
type: Concept
broader: Transfer type
definition: Natuurkundige grootheid die, uitgeoefend op een lichaam, daarin een spanning of druk doet ontstaan, of die het lichaam van beweging doet veranderen, doet versnellen @nl
definition: Physical quantity which, when exerted on a body, causes tension or pressure to arise therein, or which causes the body to change motion, accelerate
preferred label: Kracht @nl

is connected to
type: Concept
definition: De topologische relatie tussen fysieke objecten @nl
definition: The topological relation between physical objects
preferred label: is verbonden met @nl

Liquid
type: Concept
broader: Aggregation state type
definition: Een vloeistof is een bijna onsamendrukbare vloeistof die zich aanpast aan de vorm van de houder, maar een (bijna) constant volume behoudt, onafhankelijk van de druk @nl
definition: A liquid is a nearly incompressible fluid that conforms to the shape of its container but retains a (nearly) constant volume independent of pressure
preferred label: Vloeistof @nl

Transfer type
type: Concept
broader: Enumeration type
definition: Het soort ding dat wordt overgedragen, hier: materiaal, informatie, energie of kracht @nl
definition: The type of thing being transferred, here: material, information, energy or force
preferred label: Overdrachtstype @nl

Energy flow
type: Concept
broader: Transfer type
definition: De beweging van een hoeveelheid energie (als capaciteit om arbeid te verrichten) @nl
definition: The movement of an amount of energy (as capacity to do work)
preferred label: Energie stroom @nl

chemical formula
type: Concept
definition: Het hebben van informatie over de chemische verhoudingen van atomen die een bepaalde chemische verbinding vormen @nl
definition: The possession of information about the chemical proportions of atoms that constitute a particular chemical compound
preferred label: chemische formule @nl

abbreviation
type: AnnotationProperty
type: Property
domain: Top concept
range: string
sub property of: altLabel
definition: Acronym or initial word as special case of an external name

Physical object
type: Concept
broader: Object
definition: Object dat bestaat of kan bestaan binnen de fysieke 4D ruimte-tijd. Een fysiek object vormt een manifestatie en een afbakening van materie en/of energie, en is (in)direct waarneembaar door de zintuigen @nl
definition: Object that exists or may exist within physical 4D space-time. A physical object forms a manifestation and a demarcation of matter and/or energy, and is (in)directly perceptible by the senses
preferred label: Fysiek object @nl

Relation reference
type: NodeShape
type: Class
subclass of: Objectification
subclass of: Restriction
  all values from: anyURI
  on property: value
definition: The objectification of a reference for a relation having a complex value like a simple reference sec combined with other metadata or just a combination of simple references (n-ary relation)
property:
  datatype: anyURI
  path: value

Quality value
type: Concept
broader: Objectification
definition: De objectivering van een waarde van een kwaliteit met een complexe waarde zoals een eenvoudige waarde sec gecombineerd met andere metadata of alleen een combinatie van eenvoudige waarden @nl
definition: The objectification of a value of a quality having a complex value like a simple value sec combined with other metadata or just a combination of simple values
preferred label: Kwaliteitwaarde @nl

has temporal entity
type: Concept
definition: De abstracte temporele entiteit die een concreet concept in de tijd vertegenwoordigt @nl
definition: The abstract temporal entity representing a concrete concept in time
preferred label: heeft temporele entiteit @nl

Concrete concept
type: Class
type: NodeShape
subclass of: Top concept
definition: Concept that forms a manifestation and a demarcation in a concrete space-time. A concrete concept has a life cycle
property:
  class: Container
  path: has parts group
property:
  class: Geometric entity
  path: has interior
property:
  class: Geometric entity
  path: has boundary
property:
  class: Temporal entity
  path: has temporal entity
property:
  class: Concrete concept
  path: has part

Port
type: Class
subclass of: Physical object
definition: A physical or logical point of interaction as part of a physical object where, through a connection or interface, an interaction can take place

Requirement source type
type: Concept
broader: Enumeration type
definition: Het type bron waaruit een behoefte voortkomt zoals een klant, per definitie, aanbevolen door de sector of vereist door wet/regelgeving @nl
definition: The type of source from which a requirement comes like a client, by definition, recommended by the sector or demanded by law/regulation
preferred label: Eis bron type @nl

requirement topic type
type: ObjectProperty
type: Property
domain: Requirement
range: Requirement topic type
definition: The possession of a topic type by a requirement

Pure substance
type: Concept
broader: Matter
definition: Een chemische stof die een gelijke chemische samenstelling en herkenbare uniforme en isotrope eigenschappen heeft @nl
definition: Chemical matter that has an equal chemical composition and recognizable uniform and isotropic properties
preferred label: Zuivere stof @nl

Quantity kind
type: Enumeration type
definition: Any observable property that can be measured and quantified numerically

has part
type: ObjectProperty
type: Property
domain: Concrete concept
range: Concrete concept
definition: A decomposition (hasPart) relation between concrete concepts

Representation
type: Class
subclass of: Information object
definition: That which represents something else

requirement topic type
type: Concept
definition: Het hebben van een onderwerptype door een eis @nl
definition: The possession of a topic type by a requirement
preferred label: eis onderwerp type @nl

Functional entity
type: Class
type: NodeShape
subclass of: Entity
subclass of: Restriction
  all values from: Entity
  on property: has part
definition: An entity involving the external behavior where the output contributes to stakeholder objectives implemented/played by one or more technical entities
property:
  class: Functional entity
  path: has functional part
property:
  class: Technical entity
  path: has solution
property:
  class: Entity
  path: has part

Abstract concept
type: Class
subclass of: Top concept
definition: Concept that forms a manifestation and demarcation in an abstract space. An abstract concept has no life cycle

Chemical element
type: Concept
broader: Pure substance
definition: Zuivere stof die is opgebouwd uit atomen met hetzelfde atoomnummer. Een chemisch element kan niet worden ontleed door middel van chemische reacties @nl
definition: Pure substance that is made up of atoms with the same atomic number. A chemical element cannot be decomposed through chemical reactions
preferred label: Chemisch element @nl

has requirement
type: Concept
definition: De (ongestructureerde) eis aan iets @nl
definition: The (unstructured) requirement for something
preferred label: heeft eis @nl

Quantity kind
type: Concept
definition: Elke waarneembare eigenschap die numeriek kan worden gemeten en gekwantificeerd @nl
definition: Any observable property that can be measured and quantified numerically
preferred label: Kwantiteitsoort @nl

Plasma
type: Aggregation state type
definition: A phase in which the particles of a gaseous substance are ionised

Requirement severity type
type: Enumeration type
type: Class
definition: The seriousness of a requirement like demanded or wished

Requirement
type: Concept
broader: Information object
definition: Een regel die ergens voor moet gelden, gedefinieerd via zijn attributen of relaties @nl
definition: A rule that should hold for something, defined via its attributes or relations
preferred label: Eis @nl

begins
type: ObjectProperty
type: Property
domain: Event
range: State
definition: The state that is started by an event

Amount of bulk matter
type: Concept
broader: Real object
definition: Een reëel object dat bestaat uit een aaneengesloten hoeveelheid niet-vormvaste materie, primair bijeengehouden door externe krachten (zwaartekracht of opsluiting) @nl
definition: A real object that consists of a continuous amount of non-rigid matter, held together primarily by external forces (gravity or confinement)
preferred label: Hoeveelheid bulkmaterie @nl

has interior
type: Concept
definition: De geometrische entiteit die het inwendige van een concreet concept vertegenwoordigt @nl
definition: The geometric entity representing the interior of a concrete concept
preferred label: heeft inwendige @nl

Spatial region
type: Concept
broader: Physical object
definition: Een fysiek object dat een bepaald gebied omsluit zoals een vertrek, rijbaan en rivier, en dat wordt begrensd door reële objecten of andere ruimtelijke gebieden (bijvoorbeeld op basis van gebruik of conventie) en dat voornamelijk vloeibare of gasvormige hoeveelheid materie bevat @nl
definition: A physical object that encloses a particular area such as a room, roadway and river, that is bounded by real objects or other spatial areas (e.g., by usage or convention) and that contains primarily liquid or gaseous amount of matter
preferred label: Ruimtelijk gebied @nl

Gas
type: Aggregation state type
definition: Matter in an intermediate state between liquid and plasma that can be contained only if it is fully surrounded by a solid (or in a bubble of liquid) (or held together by gravitational pull); it can condense into a liquid, or can (rarely) become a solid directly by deposition

Matter
type: NodeShape
type: Class
subclass of: Physical object
definition: A pure chemical substance, chemical compound or mixture from which real objects are made
property:
  datatype: string
  path: chemical formula
property:
  class: Aggregation state type
  path: aggregation state type

Connection
type: Concept
broader: Physical object
definition: Een fysiek object (reëel object of ruimtelijk gebied) dat twee andere fysieke objecten verbindt en waarover interactie plaatsvindt namelijk de overdracht van materie, energie, informatie of krachten @nl
definition: A physical object (real object or spatial area) that connects two other physical objects and over which interaction takes place, namely the transfer of matter, energy, information or forces
preferred label: Verbinding @nl

Information flow
type: Transfer type
definition: The movement of information represented in some medium

Requirement
type: Class
type: NodeShape
subclass of: Information object
subclass of: Restriction
  on class: string
  on property: value
  qualified cardinality: 1
definition: A rule that should hold for something, defined via its attributes or relations
property:
  class: Requirement severity type
  path: requirement severity type
property:
  class: Requirement source type
  path: requirement source type
property:
  datatype: string
  max count: 1
  min count: 1
  path: value
property:
  class: Requirement topic type
  path: requirement topic type

consists of
type: Concept
definition: De materie waarvan een reëel object of mengsel is gemaakt @nl
definition: The matter a real object or mixture is made of
preferred label: bestaat uit @nl

Discrete object
type: Class
subclass of: Real object
definition: A real object consisting of a contiguous amount of form-retaining matter, held together primarily by internal forces (gravity or electromagnetic force)

Object
type: Concept
broader: Entity
definition: Entiteit die bestaat of kan bestaan binnen een concrete ruimte-tijd. Een object voert een activiteit uit, en wordt getransformeerd door een activiteit @nl
definition: Entity that exists or can exist within a concrete space-time. An object executes an activity, and is transformed by an activity

Objectification
type: Concept
broader: Abstract concept
definition: Een attribuut (kwaliteit of kwantiteit) of relatie voorgesteld als een individu gedefinieerd door een concept @nl
definition: An attribute (quality or quantity) or relation represented as an individual defined by a concept
preferred label: Objectificatie @nl

contains
type: Concept
definition: De reële objecten die zich in een ruimtelijk gebied bevinden, meestal de gasvormige hoeveelheid bulkmaterie die in dat gebied aanwezig is @nl
definition: The real objects located in a spatial region, typically the gaseous amount of bulk matter present in that region
preferred label: bevat @nl

has interior
type: ObjectProperty
type: Property
domain: Concrete concept
range: Geometric entity
definition: The geometric entity representing the interior of a concrete concept

Information object
type: Class
subclass of: Object
definition: Object which describes a thing in reality

connects port
type: Concept
definition: De poorten (als onderdeel van fysieke objecten) verbonden door een verbinding of interface @nl
definition: The ports (as part of physical objects) connected by a connection or interface
preferred label: verbindt poort @nl

has part
type: Concept
definition: Een decompositie (heeftDeel) relatie tussen concrete concepten @nl
definition: A decomposition (hasPart) relation between concrete concepts
preferred label: heeft deel @nl

consists of
type: ObjectProperty
type: Property
domain: Class
  union of: Real object
  union of: Mixture
range: Class
  union of: Matter
  union of: Matter portion
definition: The matter a real object or mixture is made of

Abstract concept
type: Concept
broader: Top concept
definition: Concept dat een manifestatie en een afbakening vormt in een abstracte ruimte. Een abstract concept heeft geen levenscyclus @nl
definition: Concept that forms a manifestation and demarcation in an abstract space. An abstract concept has no life cycle

Material flow
type: Transfer type
definition: The movement of an amount of material

Technical entity
type: Class
type: NodeShape
subclass of: Entity
subclass of: Restriction
  all values from: Entity
  on property: has part
definition: An entity concerned with technical properties and relations that implements or plays functional entities
property:
  class: Entity
  path: has part
property:
  class: Technical entity
  path: has technical part

Type
type: Concept
broader: Abstract concept
definition: Een meta-concept waarvan instanties concepten zijn (geen individuen) @nl
definition: A meta-concept which instances are concepts (not individuals)

Functional entity
type: Concept
broader: Entity
definition: Een entiteit waarbij het gaat om het externe gedrag waarbij de uitvoer bijdraagt aan doelstellingen van belanghebbenden geïmplementeerd/gespeeld door een of meer technische entiteiten @nl
definition: An entity involving the external behavior where the output contributes to stakeholder objectives implemented/played by one or more technical entities
preferred label: Functionele entiteit @nl

Planned entity
type: Class
type: NodeShape
subclass of: Entity
subclass of: Restriction
  all values from: Planned entity
  on property: has part
definition: An entity that does not yet exist in physical reality, but which exists in mental or conceptual reality
property:
  class: Planned entity
  path: has part
property:
  class: Realized entity
  path: is plan for

Type
type: Class
subclass of: Abstract concept
definition: A meta-concept which instances are concepts (not individuals)

portion
type: ObjectProperty
type: Property
domain: Matter portion
range: Quantity value
definition: The relative portion of a matter portion
has quantity kind: DimensionlessRatio

Aggregation state type
type: Enumeration type
type: NodeShape
type: Class
one of: Solid
one of: Liquid
one of: Gas
one of: Plasma
definition: One of the four fundamental states of matter being a solid, liquid, gas or plasma
in: Solid
in: Liquid
in: Gas
in: Plasma

Enumeration type
type: Class
subclass of: Type
subclass of: Container
definition: A meta-concept having concepts as instances having no further attributes or relations (annotations only)

Aggregation state type
type: Concept
broader: Enumeration type
definition: Een van de vier fundamentele toestanden van materie zijnde een vaste stof, vloeistof, gas of plasma @nl
definition: One of the four fundamental states of matter being a solid, liquid, gas or plasma
preferred label: Aggregatietoestandtype @nl

Chemical compound
type: Class
subclass of: Pure substance
definition: Pure substance consisting of two or more chemical elements that have a chemical bond with each other. In a chemical compound, the elements occur in a fixed ratio. A compound can be broken down into simpler substances by means of chemical reactions

Port
type: Concept
broader: Physical object
definition: Een fysiek of logisch interactiepunt als deel van een fysiek object waar, via een verbinding of raakvlak, een interactie kan plaatsvinden @nl
definition: A physical or logical point of interaction as part of a physical object where, through a connection or interface, an interaction can take place
preferred label: Poort @nl

is implemented by
type: ObjectProperty
type: Property
domain: Functional entity
range: Technical entity
sub property of: has solution
definition: The technical entity that implements a functional entity

Quantity value
type: NodeShape
type: Class
subclass of: Objectification
subclass of: Restriction
  all values from: Class
    union of: decimal
    union of: float
    union of: double
    union of: integer
  on property: value
definition: The objectification of a value of a quantity (typically involving a quantity kind and a unit) having a complex value like a simple value sec combined with other metadata or just a combination of simple values
property:
  or:
    datatype: decimal
  or:
    datatype: float
  or:
    datatype: double
  path: value

Concept type
type: Concept
broader: Type
definition: Een meta-concept met concepten als instanties die attributen of relaties kunnen hebben @nl
definition: A meta-concept having concepts as instances that can have attributes or relations

is realized by
type: Concept
broader: is plan for
definition: De gerealiseerde entiteit die een geplande entiteit realiseert @nl
definition: The realized entity that realizes a planned entity
preferred label: is gerealiseerd door @nl

requirement severity type
type: ObjectProperty
type: Property
domain: Requirement
range: Requirement severity type
definition: The possession of a severity type by a requirement

over connection
type: Concept
definition: De verbinding waarover een interactie tussen fysieke objecten plaatsvindt @nl
definition: The connection over which an interaction between physical objects takes place
preferred label: over verbinding @nl

Solid
type: Aggregation state type
definition: Matter that can be picked up or held, having a texture, and usually firm. Unlike a liquid, gas or plasma

Matter portion
type: Class
type: NodeShape
subclass of: Relation reference
subclass of: Restriction
  on class: Matter
  on property: value
  qualified cardinality: 1
subclass of: Restriction
  cardinality: 1
  on property: portion
definition: An objectified relation reference for the consists of relation
property:
  class: Quantity value
  max count: 1
  min count: 1
  path: portion

has parts group
type: ObjectProperty
type: Property
domain: Concrete concept
range: Container
definition: The possession of an group of, potentially implicit, parts

Concept type
type: Class
subclass of: Type
definition: A meta-concept having concepts as instances that can have attributes or relations

Realized entity
type: NodeShape
type: Class
subclass of: Entity
subclass of: Restriction
  all values from: Realized entity
  on property: has part
definition: An entity that exists or has existed in the physical reality
property:
  class: Realized entity
  path: has part

transfer type
type: Concept
definition: Het hebben van een overdrachtstype door een interactie @nl
definition: The possession of a transfer type by an interaction
preferred label: overdrachtstype @nl

connects object
type: Concept
definition: De fysieke objecten verbonden door een verbinding of raakvlak @nl
definition: The physical objects connected by a connection or interface
preferred label: verbindt object @nl

Unit
type: Enumeration type
definition: A particular quantity value that has been chosen as a scale for measuring other quantities the same kind

Object
type: NodeShape
type: Class
subclass of: Entity
subclass of: Restriction
  all values from: Object
  on property: has part
definition: Entity that exists or can exist within a concrete space-time. An object executes an activity, and is transformed by an activity
property:
  class: Object
  path: has part

Interface
type: Concept
broader: Spatial region
definition: Een ruimtelijk object, typisch een dunne 2D fysieke ruimte (maar 0D of 1D kan ook) dat de verbinding legt tussen twee fysieke objecten of poorten van fysieke objecten waarlangs een statische of dynamische wisselwerking of interactie tussen die elementen kan plaatsvinden @nl
definition: A spatial object, typically a thin 2D physical space (but also 0D or 1D) that connects two physical objects or ports of physical objects through which a static or dynamic interaction or interaction between those elements can take place
preferred label: Raakvlak @nl

over interface
type: Concept
definition: Het raakvlak waarover een interactie tussen fysieke objecten plaatsvindt @nl
definition: The interface over which an interaction between physical objects takes place
preferred label: over raakvlak @nl

portion
type: Concept
definition: Het relatieve deel van een materiedeel @nl
definition: The relative portion of a matter portion
preferred label: aandeel @nl

Enumeration type
type: Concept
broader: Type
definition: Een meta-concept met concepten als instanties zonder verdere attributen of relaties (alleen annotaties) @nl
definition: A meta-concept having concepts as instances having no further attributes or relations (annotations only)
preferred label: Enumeratie type @nl

Concrete concept
type: Concept
broader: Top concept
definition: Concept dat een manifestatie en een afbakening vormt in een concrete ruimte-tijd. Een concreet concept heeft een levenscyclus @nl
definition: Concept that forms a manifestation and a demarcation in a concrete space-time. A concrete concept has a life cycle
preferred label: Concreet concept @nl

Real object
type: Concept
alternative label: Amount of matter
broader: Physical object
definition: Een fysiek object (vormvast of niet-vormvast) dat in de werkelijkheid tastbaar en zichtbaar is (of kan zijn), door de mens gemaakt of natuurlijk ontstaan @nl
definition: physical object (rigid or non-rigid) that is (or can be) tangible and visible in reality, man-made or naturally occurring
preferred label: Reeel object @nl

Liquid
type: Aggregation state type
definition: A liquid is a nearly incompressible fluid that conforms to the shape of its container but retains a (nearly) constant volume independent of pressure

is implemented by
type: Concept
broader: has solution
definition: De technische entiteit die een functionele entiteit implementeert @nl
definition: The technical entity that implements a functional entity
preferred label: is geimplementeerd door @nl

Amount of bulk matter
type: Class
subclass of: Real object
definition: A real object that consists of a continuous amount of non-rigid matter, held together primarily by external forces (gravity or confinement)

Transfer type
type: Enumeration type
type: NodeShape
type: Class
one of: Material flow
one of: Energy flow
one of: Information flow
one of: Force
definition: The type of thing being transferred, here: material, information, energy or force
in: Material flow
in: Energy flow
in: Information flow
in: Force

is described by
type: ObjectProperty
type: Property
domain: Top concept
range: Information object
definition: The information object that describes something

ends
type: ObjectProperty
type: Property
domain: Event
range: State
definition: The state that is ended by an event

Chemical compound
type: Concept
broader: Pure substance
definition: Zuivere stof bestaande uit twee of meer chemische elementen die een chemische binding met elkaar hebben. In een chemische verbinding komen de elementen in een vaste verhouding voor. Een verbinding kan worden ontleed in eenvoudigere stoffen door middel van chemische reacties @nl
definition: Pure substance consisting of two or more chemical elements that have a chemical bond with each other. In a chemical compound, the elements occur in a fixed ratio. A compound can be broken down into simpler substances by means of chemical reactions
preferred label: Chemische verbinding @nl

Planned entity
type: Concept
broader: Entity
definition: Een entiteit die nog niet bestaat in de fysieke werkelijkheid, maar die in de mentale of conceptuele werkelijkheid voorkomt @nl
definition: An entity that does not yet exist in physical reality, but which exists in mental or conceptual reality
preferred label: Geplande entiteit @nl

Physical object
type: Class
type: NodeShape
subclass of: Object
definition: Object that exists or may exist within physical 4D space-time. A physical object forms a manifestation and a demarcation of matter and/or energy, and is (in)directly perceptible by the senses
property:
  class: Information object
  path: is described by
property:
  class: Physical object
  path: is connected to
property:
  class: Interaction
  path: participates in
property:
  class: Activity
  path: executes

Solid
type: Concept
broader: Aggregation state type
definition: Materie die kan worden opgepakt of vastgehouden, een textuur heeft en meestal stevig is. In tegenstelling tot een vloeistof, gas of plasma @nl
definition: Matter that can be picked up or held, having a texture, and usually firm. Unlike a liquid, gas or plasma
preferred label: Vaste stof @nl

Real object
type: Class
type: NodeShape
subclass of: Physical object
subclass of: Restriction
  all values from: Class
    union of: Real object
    union of: Port
  on property: has part
definition: physical object (rigid or non-rigid) that is (or can be) tangible and visible in reality, man-made or naturally occurring
property:
  or:
    class: Matter
  or:
    class: Matter portion
  path: consists of
property:
  or:
    class: Real object
  or:
    class: Port
  path: has part

Relation reference
type: Concept
broader: Objectification
definition: De objectivering van een referentie voor een relatie met een complexe waarde zoals een simpele referentie sec gecombineerd met andere metadata of alleen een combinatie van simpele referenties (n-ary relaties) @nl
definition: The objectification of a reference for a relation having a complex value like a simple reference sec combined with other metadata or just a combination of simple references (n-ary relation)
preferred label: Relatie referentie @nl

has quantity kind
type: ObjectProperty
type: Property
range: Quantity kind
definition: The possession of a quantity kind

Temporal entity
type: Concept
broader: Representation
definition: Een tijdsinterval of -moment @nl
definition: A temporal interval or instant
preferred label: Temporele entiteit @nl

Quality value
type: NodeShape
type: Class
subclass of: Objectification
subclass of: Restriction
  all values from: Class
    union of: string
    union of: boolean
    union of: anyURI
  on property: value
definition: The objectification of a value of a quality having a complex value like a simple value sec combined with other metadata or just a combination of simple values
property:
  datatype: string
  path: value

Quantity value
type: Concept
broader: Objectification
definition: De objectivering van een waarde van een hoeveelheid (typisch met een grootheid en een eenheid) met een complexe waarde zoals een eenvoudige waarde sec gecombineerd met andere metadata of alleen een combinatie van eenvoudige waarden @nl
definition: The objectification of a value of a quantity (typically involving a quantity kind and a unit) having a complex value like a simple value sec combined with other metadata or just a combination of simple values
preferred label: Kwantiteitsoort @nl

transforms
type: ObjectProperty
type: Property
domain: Activity
range: Object
definition: The object transformed by an activity

Entity
type: Concept
broader: Concrete concept
definition: Concept dat een manifestatie en een afbakening vormt in een concrete ruimte-tijd, en dat op ieder moment in de tijd een bepaalde toestand heeft. Een entiteit heeft een unieke identiteit die constant blijft gedurende de levenscyclus. De levenscyclus van een entiteit is opgebouwd uit de reeks van toestanden van die entiteit, die elkaar in de tijd opvolgen. Een entiteit is een object of een activiteit. Een object bestaat, een activiteit vindt plaats @nl
definition: Concept that forms a manifestation and a demarcation in a concrete space-time, and which has a certain state at any moment in time. An entity has a unique identity that remains constant throughout its life cycle. The life cycle of an entity is made up of the sequence of states of that entity, which follow each other in time. An entity is an object or an activity. An object exists, an activity takes place
preferred label: Entiteit @nl

has state
type: ObjectProperty
type: Property
domain: Entity
range: State
definition: The state of an entity in a certain point or period of time

participates in
type: Concept
definition: De interactie waaraan een fysiek object deelneemt @nl
definition: The interaction a physical object participates in
preferred label: participeert in @nl

Event
type: Class
type: NodeShape
subclass of: Concrete concept
subclass of: Restriction
  all values from: Event
  on property: has part
definition: Transition between two successive states of an entity (object or activity). An event is triggered in a state
property:
  class: Event
  path: has part
property:
  class: State
  path: begins
property:
  class: State
  path: ends

Information flow
type: Concept
broader: Transfer type
definition: De beweging van informatie weergegeven in een of ander medium @nl
definition: The movement of information represented in some medium
preferred label: Informatie stroom @nl

is connected to
type: ObjectProperty
type: Property
domain: Physical object
range: Physical object
definition: The topological relationship between physical objects

has functional part
type: ObjectProperty
type: Property
domain: Functional entity
range: Functional entity
sub property of: has part
definition: The hasPart relation of a functional nature

abbreviation
type: Concept
broader: altLabel
definition: Acroniem of eerste woord als speciaal geval van een naam @nl
definition: Acronym or initial word as special case of a name
preferred label: afkorting @nl

has requirement
type: ObjectProperty
type: Property
domain: Top concept
range: Requirement
definition: The (unstructured) requirement for something

has quantity kind
type: Concept
definition: Het hebben van een grootheid @nl
definition: The possession of a quantity kind
preferred label: heeft kwantiteitsoort @nl

Technical entity
type: Concept
broader: Entity
definition: Een entiteit waarbij het gaat om technische eigenschappen en relaties die functionele entiteiten implementeert of speelt @nl
definition: An entity concerned with technical properties and relations that implements or plays functional entities
preferred label: Technische entiteit @nl

requirement source type
type: ObjectProperty
type: Property
domain: Requirement
range: Requirement source type
definition: The possession of a source type by a requirement

Interaction
type: Concept
broader: Activity
definition: De activiteit zijnde een combinatie van subactiviteiten uitgevoerd door fysieke objecten waartussen een overdracht van materie, informatie, energie of kracht plaatsvindt, typisch over een verbinding of raakvlak (direct of via poorten) @nl
definition: The activity being a combination of sub-activities performed by physical objects between which a transfer of matter, information, energy or force takes place, typically over a connection or interface (directly or through ports)
preferred label: Interactie @nl

Mixture
type: NodeShape
type: Class
subclass of: Matter
definition: The combination of two or more different pure substances without the molecules losing their identity
property:
  or:
    class: Matter
  or:
    class: Matter portion
  path: consists of

Geometric entity
type: Class
subclass of: Representation
definition: Named concept, which forms an actual or virtual demarcation in a concrete (physical, three-dimensional) space, which we experience in reality

triggers
type: Concept
definition: De gebeurtenis getriggerd door een entiteit @nl
definition: The event triggert by an entity
preferred label: triggert @nl

is described by
type: Concept
definition: Het informatie object dat iets beschrijft @nl
definition: The information object that describes something
preferred label: is beschreven door @nl

Temporal entity
subclass of: Representation
definition: A temporal interval or instant

AllDisjointClassesShape
type: NodeShape
property:
  path: type
  path:
    zero or more path: subClassOf
  qualified max count: 1
  qualified value shape:
    in: Physical object
    in: Information object
    in: State
    in: Event
    in: Activity
property:
  path: type
  path:
    zero or more path: subClassOf
  qualified max count: 1
  qualified value shape:
    in: Planned entity
    in: Realized entity
property:
  path: type
  path:
    zero or more path: subClassOf
  qualified max count: 1
  qualified value shape:
    in: Functional entity
    in: Technical entity
property:
  path: type
  path:
    zero or more path: subClassOf
  qualified max count: 1
  qualified value shape:
    in: Real object
    in: Spatial region
target subjects of: type

is plan for
type: Concept
definition: Een potentieel gerealiseerde entiteit volgens deze geplande entiteit @nl
definition: A potentially realized entity according to this planned entity
preferred label: is plan voor @nl

triggers
type: ObjectProperty
type: Property
domain: Entity
range: Event
definition: The event triggert by an entity

Information object
type: Concept
broader: Object
definition: Object dat een beschrijving vormt van een ding in de werkelijkheid @nl
definition: Object which describes a thing in reality
preferred label: Informatie object @nl

Interaction
type: Class
type: NodeShape
subclass of: Activity
definition: The activity being a combination of sub-activities performed by physical objects between which a transfer of matter, information, energy or force takes place, typically over a connection or interface (directly or through ports)
property:
  class: Transfer type
  path: transfer type
property:
  class: Connection
  path: over connection
property:
  class: Interface
  path: over interface

Representation
type: Concept
broader: Information object
definition: Dat wat iets anders vertegenwoordigt @nl
definition: That which represents something else
preferred label: Representatie @nl

Event
type: Concept
broader: Concrete concept
definition: Overgang tussen twee opeenvolgende toestanden van een entiteit (object of activiteit). Een gebeurtenis wordt getriggerd in een toestand @nl
definition: Transition between two successive states of an entity (object or activity). An event is triggered in a state
preferred label: Gebeurtenis @nl

connects port
type: ObjectProperty
type: Property
domain: Class
  union of: Connection
  union of: Interface
range: Port
definition: The ports (as part of physical objects) connected by a connection or interface

aggregation state type
type: ObjectProperty
type: Property
domain: Matter
range: Aggregation state type
definition: The possession of an aggregation state type

aggregation state type
type: Concept
definition: Het hebben van een aggregatietoestandtype @nl
definition: The possession of an aggregation state type
preferred label: aggregatietoestandtype @nl

ends
type: Concept
definition: De toestand die wordt beëindigd door een gebeurtenis @nl
definition: The state that is ended by an event
preferred label: beeindigt @nl

has unit
type: ObjectProperty
type: Property
range: Unit
definition: The possession of a unit

Requirement severity type
type: Concept
broader: Enumeration type
definition: De ernst van een eis zoals gevraagd of gewenst @nl
definition: The seriousness of a requirement like demanded or wished
preferred label: Eis ernst type @nl

transforms
type: Concept
definition: Het object getransformeerd door een activiteit @nl
definition: The object transformed by an activity
preferred label: transformeert @nl

Entity
type: NodeShape
type: Class
subclass of: Concrete concept
definition: Concept that forms a manifestation and a demarcation in a concrete space-time, and which has a certain state at any moment in time. An entity has a unique identity that remains constant throughout its life cycle. The life cycle of an entity is made up of the sequence of states of that entity, which follow each other in time. An entity is an object or an activity. An object exists, an activity takes place
property:
  class: Event
  path: triggers
property:
  class: State
  path: has state

Requirement topic type
type: Enumeration type
type: Class
definition: The entity aspect a requirement applies to

Homogeneous mixture
type: Concept
broader: Mixture
definition: Een mengsel dat overal uniform is en maar 1 fase heeft @nl
definition: A mixture that is uniform throughout, and has only one phase
preferred label: Homogeen mengsel @nl

Requirement topic type
type: Concept
broader: Enumeration type
definition: Het entiteitsaspect waarop een eis van toepassing is @nl
definition: The entity aspect a requirement applies to
preferred label: Eis onderwerp type @nl

Spatial region
type: NodeShape
type: Class
subclass of: Physical object
subclass of: Restriction
  all values from: Class
    union of: Spatial region
    union of: Port
  on property: has part
definition: A physical object that encloses a particular area such as a room, roadway and river, that is bounded by real objects or other spatial areas (e.g., by usage or convention) and that contains primarily liquid or gaseous amount of matter
property:
  class: Physical object
  path: is bound by
property:
  or:
    class: Spatial region
  or:
    class: Port
  path: has part
property:
  class: Real object
  path: contains

Activity
type: Concept
broader: Entity
definition: Entiteit die plaatsvindt of kan plaatsvinden in een concrete ruimte-tijd. Een activiteit transformeert objecten, en wordt uitgevoerd door een object @nl
definition: Entity that takes place or can take place in a concrete space-time. An activity transforms objects, and is executed by an object
preferred label: Activiteit @nl

is plan for
type: ObjectProperty
type: Property
domain: Planned entity
range: Realized entity
definition: A potentially realized entity according to this planned entity

Geometric entity
type: Concept
broader: Representation
definition: Benoemd concept, dat een daadwerkelijke of virtuele afbakening vormt in een concrete (fysieke, driedimensionale) ruimte, die we in de werkelijkheid ervaren @nl
definition: Named concept, which forms an actual or virtual demarcation in a concrete (physical, three-dimensional) space, which we experience in reality
preferred label: Geometrische entiteit @nl

has boundary
type: Concept
definition: De geometrische entiteit die de grens van een concreet concept vertegenwoordigt @nl
definition: The geometric entity representing the boundary of a concrete concept
preferred label: heeft begrenzing @nl

Interface
type: NodeShape
type: Class
subclass of: Spatial region
definition: A spatial object, typically a thin 2D physical space (but also 0D or 1D) that connects two physical objects or ports of physical objects through which a static or dynamic interaction or interaction between those elements can take place
property:
  class: Port
  path: connects port
property:
  class: Physical object
  path: connects object

has solution
type: Concept
definition: Een technische entiteit die een mogelijke oplossing is voor een functionele entiteit @nl
definition: A technical entity that is a potential solution for a functional entity
preferred label: heeft oplossing @nl

has state
type: Concept
definition: De toestand van een entiteit op een bepaald tijdstip of in een bepaalde periode @nl
definition: The state of an entity in a certain point or period of time
preferred label: heeft toestand @nl

Mixture
type: Concept
broader: Matter
definition: De combinatie van twee of meer verschillende zuivere stoffen zonder dat daarbij de moleculen hun identiteit verliezen @nl
definition: The combination of two or more different pure substances without the molecules losing their identity
preferred label: Mengsel @nl

Discrete object
type: Concept
broader: Real object
definition: Een reëel object dat bestaat uit een aaneengesloten hoeveelheid vormvaste materie, primair bijeengehouden door interne krachten (zwaartekracht of elektromagnetische kracht) @nl
definition: A real object consisting of a contiguous amount of form-retaining matter, held together primarily by internal forces (gravity or electromagnetic force)
preferred label: Discreet object @nl

Homogeneous mixture
type: Class
subclass of: Mixture
definition: A mixture that is uniform throughout, and has only one phase

has functional part
type: Concept
broader: has part
definition: De heeftDeel relatie van functionele aard @nl
definition: The hasPart relation of a functional nature
preferred label: heeft functioneel deel @nl

Activity
type: Class
type: NodeShape
subclass of: Entity
subclass of: Restriction
  all values from: Activity
  on property: has part
definition: Entity that takes place or can take place in a concrete space-time. An activity transforms objects, and is executed by an object
property:
  class: Temporal entity
  path: hasPeriod
property:
  class: Object
  path: transforms
property:
  class: Geometric entity
  path: has boundary
property:
  class: Geometric entity
  path: has interior
property:
  class: Activity
  path: has part

Chemical element
type: Class
subclass of: Pure substance
definition: Pure substance that is made up of atoms with the same atomic number. A chemical element cannot be decomposed through chemical reactions

Top concept
type: NodeShape
type: Class
definition: The most generic concept
property:
  class: Information object
  path: is described by
property:
  class: Requirement
  path: has requirement
property:
  datatype: string
  path: abbreviation

is bound by
type: Concept
definition: Het fysieke object dat een ruimtelijk gebied begrensd @nl
definition: The physical object that bounds a spatial region
preferred label: is begrensd door @nl

over connection
type: ObjectProperty
type: Property
domain: Interaction
range: Connection
definition: The connection over which an interaction between physical objects takes place

requirement source type
type: Concept
definition: Het hebben van een brontype door een eis @nl
definition: The possession of a source type by a requirement
preferred label: eis bron type @nl

is realized by
type: ObjectProperty
type: Property
domain: Planned entity
range: Realized entity
sub property of: is plan for
definition: The realized entity that realizes a planned entity

has boundary
type: ObjectProperty
type: Property
domain: Concrete concept
range: Geometric entity
definition: The geometric entity representing the boundary of a concrete concept

has solution
type: ObjectProperty
type: Property
domain: Functional entity
range: Technical entity
definition: A technical entity that is a potential solution for a functional entity

Matter portion
type: Concept
broader: Relation reference
definition: Een geobjectiveerde relatiereferentie voor de bestaat uit relatie @nl
definition: An objectified relation reference for the consists of relation
preferred label: Materie-aandeel @nl

Material flow
type: Concept
broader: Transfer type
definition: De beweging van een hoeveelheid materiaal @nl
definition: The movement of an amount of material
preferred label: Materiaalstroom @nl

has parts group
type: Concept
definition: Het hebben van een groep, eventueel impliciete, onderdelen @nl
definition: The possession of an group of, potentially implicit, parts
preferred label: heeft delen groep @nl

has technical part
type: ObjectProperty
type: Property
domain: Technical entity
range: Technical entity
sub property of: has part
definition: A hasPart relation of a technical nature

Energy flow
type: Transfer type
definition: The movement of an amount of energy (as capacity to do work)