entrance
type: Property
type: ObjectProperty
comment: Describes the entrance of a parking facility.
domain: Parking facility
label: hat Einfahrt @de
range: Entrance
created: 2017-05-15
modified: 2018-01-12
term status: stable

has charging point
type: ObjectProperty
type: Property
comment: Indicates whether charging points are available.
domain: Class
  union of: Parking facility
  union of: Parking space
label: hat Ladestation @de
range: Charging point
created: 2017-04-13
modified: 2018-01-12
term status: stable

CEE 7/4
type: Plug type
comment: The CEE 7/3 socket and CEE 7/4 plug are commonly called Schuko. The socket (which is often, in error, also referred to as CEE 7/4) has a predominantly circular recess which is 17.5 mm (0.689 in) deep with two symmetrical round apertures and two earthing clips on the sides of the socket positioned to ensure that the earth is always engaged before live pin contact is made. The plug pins are 4.8 by 19 mm (0.189 by 0.748 in).
ocm connection ID: 28
alternative label: Type F
alternative label: Schuko

Underground parking garage
type: Class
comment: Parking facility with one or more levels below the surface and none above ground.
label: Tiefgarage @de
subclass of: Parking facility
created: 2017-04-13
modified: 2018-01-12
term status: stable
alternative label: Rampengarage @de

Place
type: Class
comment: Entities that have a somewhat fixed, physical extension.

Faulty
type: Civic structure status
comment: The parking facility is not operating normally.
label: Defekt @de

level
type: DatatypeProperty
type: Property
comment: Indicates the level of a parking facility the parking space is located in.
domain: Parking space
label: Ebene @de
range: integer
created: 2018-01-11
modified: 2018-01-12
term status: stable

Annette Weilandt
type: Person
type: Agent
affiliation: eccenca GmbH

Recreational vehicle
type: Vehicle
comment: A motor vehicle or trailer equipped with living space and amenities found in a home.
label: Wohnmobil @de

address
type: ObjectProperty
comment: Physical address of the item.
domain: Place
range: Postal address

operated by
type: Property
type: ObjectProperty
comment: The operator of a civic structure or facility. Operator and owner can be different business entitites.
domain: Civic structure
label: betrieben von @de
range: Business entity
created: 2017-06-07
modified: 2018-01-12
term status: stable

Park & Ride
type: Parking facility connections
comment: Connection to public transport.
label: Parken und Reisen @de
alternative label: P&R
alternative label: P+R

due for time
type: Property
type: ObjectProperty
comment: Indicates that a price specification is due for a certain time specification.
domain: Price specification
label: fällig für Zeitdauer @de
range: Time specification
created: 2017-06-07
modified: 2018-01-12
term status: stable

Park and ride service operating
type: Civic structure status
comment: Park and ride services are operating until the specified time.
label: P+R-Service vorhanden @de

vehicle width limit
type: DatatypeProperty
type: Property
comment: Indicates the width limit in meter for vehicles using the parking facility.
domain: Civic structure
label: Breitenbegrenzung für Fahrzeuge @de
range: decimal
created: 2017-06-07
modified: 2018-01-12
term status: stable

price
type: Property
type: ObjectProperty
comment: Indicates that a civic structure can be used for a specific price.
domain: Civic structure
label: Preis @de
range: Price specification
created: 2017-06-07
modified: 2018-01-12
term status: stable

eccenca GmbH
type: Agent
type: Organization

IEC_60309 3-pin
type: Plug type
comment: IEC 60309 (formerly IEC 309 and CEE 17, also published by CENELEC as EN 60309) is an international standard from the International Electrotechnical Commission (IEC) for "plugs, socket-outlets and couplers for industrial purposes". 3-Pin connector.
ocm connection ID: 34
ocm connection ID: 16

Carpooling
type: Parking facility connections
comment: Parking facility used for carpooling or ridesharing.
label: Parken und Mitfahren @de
alternative label: Parken und Mitnehmen @de
alternative label: P&M
alternative label: P+M
alternative label: Park & Drive

access
type: ObjectProperty
type: Property
comment: Indicates that a civic structure can only be accessed when certain conditions are fullfilled.
domain: Civic structure
range: Access condition
created: 2017-06-07
modified: 2018-01-12
term status: stable

current value
type: DatatypeProperty
type: Property
comment: Indicates the current value of the real-time capacity.
domain: Real time capacity
range: integer
created: 2015-05-15
modified: 2018-01-12
term status: stable

AS 3112 Type I
type: Plug type
comment: AS/NZS 3112 are the harmonised Australian and New Zealand standards for AC Plugs and Socket-Outlets.
ocm connection ID: 29
alternative label: Type I/AS 3112/CPCS-CCC
alternative label: Type I

charger
type: ObjectProperty
type: Property
comment: Describes the charger available at a charging point. A charging point can have more than one charger.
domain: Charging point
range: Charger

Electric vehicle
type: Vehicle
comment: A wheeled, self-powered motor vehicle using an electric drivetrain.
label: Véhicule électrique @fr
label: Elektrofahrzeug @de

Parallel parking
type: Arrangement pattern
comment: Bei der Längsaufstellung wird das Fahrzeug (gemäß § 12 StVO) parallel zur Fahrbahn geparkt. Diese Fahrzeugaufstellung ist die gängigste Aufstellungsart an Straßen. @de
comment: With parallel parking, vehicles are arranged in a line, with the front of one vehicle facing the back of an adjacent one. This is done parallel to a curb, when one is provided. Parallel parking is the most common mode of roadside parking for vehicles.
label: Längsaufstellung @de
created: 2017-05-10
modified: 2018-01-12
term status: stable
alternative label: Parallelaufstellung @de

Charging point
type: Class
comment: Civic structure that supplies electric energy for the recharging of electric vehicles.
label: Ladestation @de
subclass of: Civic structure

free of charge
type: Property
type: DatatypeProperty
comment: Indicates that the usage of the civic structure is for free.
domain: Price specification
label: kostenlos @de
range: boolean
created: 2017-06-07
modified: 2018-01-12
term status: stable

plug
type: ObjectProperty
type: Property
comment: Indicates the plugs available at a charger.
domain: Charger
range: Plug

IEC_60309 16A 2+E
type: Plug type
comment: IEC 60309 (formerly IEC 309 and CEE 17, also published by CENELEC as EN 60309) is an international standard from the International Electrotechnical Commission (IEC) for "plugs, socket-outlets and couplers for industrial purposes". The blue P+N+E, 6h (180°) plug is a single phase connector. In particular this smallest (16 A) variant has become especially common in camping vehicles and sockets found in caravan parks and marinas throughout Europe.
ocm connection ID: 4
alternative label: Blue Commando (2P+E)

brand
type: DatatypeProperty
type: Property
comment: Indicates the brand of a charger.
domain: Charger
label: Marke @de
range: string

Plug type
type: Class
comment: Type of a plug that is used to connect electric vehicles.
label: Steckertyp @de

SCAME Type 3A
type: Plug type
comment: The type 3A is derived from the Scame charging connectors adding the IEC 62196 pins which is suited for single-phase charging – the connector builds on the experience with the Scame connector for charging of light vehicles (electric motorcycles and scooters).
ocm connection ID: 36
alternative label: IEC 62196-2 Type 3A

Women
type: User group
comment: Female persons.
label: Frauen @de

CEE 7/16
type: Plug type
comment: The CEE 7/16 standard sheet appears in Supplement 2 (June 1962) to the 1951 edition of CEE 7. The CEE 7/16 unearthed plug is used for low power Class II applications, it has two round 4 by 19 mm (0.157 by 0.748 in) pins, rated at 2.5 A. There are two variants.
ocm connection ID: 13
alternative label: Europlug

Allow
type: Action
comment: Allow to do an action.
label: Erlauben @de

No park and ride information
type: Civic structure status
comment: No park and ride information will be available until the specified time.
label: Keine P+R-Informationen @de

Business entity
type: class
comment: An instance of this class represents the legal agent making (or seeking) a particular offering. This can be a legal body or a person. A business entity has at least a primary mailing address and contact details. For this, typical address standards (vCard) and location data (geo, WGS84) can be attached. Note that the location of the business entity is not necessarily the location from which the product or service is being available.
label: Juristische Person @de

civic structure status
type: ObjectProperty
type: Property
comment: Indicates the current status of the civil structure.
domain: Civic structure
label: hat Status der zivilen Struktur @de
range: Civic structure status
created: 2017-06-23
modified: 2018-01-12
term status: stable

MobiVoc: Open Mobility Vocabulary
type: Ontology
type: Vocabulary
comment: Our goal is to significantly improve the data mobility between all stakeholders by providing a standardized vocabulary using Semantic Web technologies and ontologies. For the open vocabulary covering various mobility aspects we use RDF (Resource Description Framework) - a recommended specification of the World Wide Web Consortium (W3C) and the so-called lingua franca for the integration of data and web. We invite everyone who is interested to join our MobiVoc initiative and to participate in the development of the Open Mobility Vocabulary.
license: Creative Commons Attribution 4.0 International
contributor: Christop Lange
contributor: Sebastian Tramp
contributor: Niklas Petersen
created: 2014-08-05
creator: Annette Weilandt
creator: Martin Brümmer
modified: 2018-01-12
publisher: eccenca GmbH
preferred namespace prefix: mv
vocabulary: vann
vocabulary: http://xmlns.com/foaf/0.1/
version info: v1.0.0

is fast charge capable
type: DatatypeProperty
type: Property
comment: Indicates that the charger is able to fast charge.
domain: Charger
label: erlaubt Schnellladen @de
range: boolean

Martin Brümmer
type: Person
type: Agent
affiliation: eccenca GmbH

time start value
type: DatatypeProperty
type: Property
comment: Indicates the start value of a time period.
domain: Time specification
label: Anfangszeit @de
range: float
created: 2017-06-07
modified: 2018-01-12
term status: stable

power in kW
type: DatatypeProperty
type: Property
comment: Indicates the power of a charger or plug in kilowatts.
domain: Class
  union of: Plug
  union of: Charger
range: double

Carsharing users
type: User group
comment: User of a car rental model where people rent cars for short periods of time.
label: Car club users
label: Carsharing-Nutzer @de
label: Utilisateurs de l'autopartage @fr
hidden label: Car-sharing users
hidden label: Car sharing users

voltage in V
type: DatatypeProperty
type: Property
comment: Indicates the voltage of a charger or plug in volt.
domain: Class
  union of: Plug
  union of: Charger
range: double

model
type: DatatypeProperty
type: Property
comment: Indicates the charger model of the charging point.
domain: Charger
label: Modell @de
range: string

Normal parking restrictions lifted
type: Civic structure status
comment: The parking restrictions that normally apply in the specified location have been temporarily lifted.
label: Normale Parkbeschränkungen aufgehoben @de

Special parking restrictions in force
type: Civic structure status
comment: Parking restrictions, other than those that normally apply, are in force in a specified area.
label: Besondere Parkbeschränkungen in Kraft @de

Bicycle
type: Vehicle
comment: A human-or electric powered, pedal-driven, single-track vehicle, having two wheels attached to a frame, one behind the other.
label: Fahrrad @de
label: Vélo @fr

Perpendicular parking
type: Arrangement pattern
comment: Bei der Senkrechtaufstellung wird das Fahrzeug mit einem Aufstellwinkel von von 100 gon (90°) geparkt. @de
comment: With perpendicular parking, vehicles are parked side to side, perpendicular to an aisle, curb, or wall. This type of parking is commonly used in parking lots and parking facilities.
label: Senkrechtaufstellung @de
created: 2017-05-10
modified: 2018-01-12
term status: stable
alternative label: Bay parking

Plug
type: Class
comment: Component of a charger to connect an electric vehicle. There are different plug types used for charging electric vehicles.
label: Anschluss @de

charger quantity
type: DatatypeProperty
type: Property
comment: Indicates the amount of chargers available at the charging point.
domain: Charger
label: Anzahl Ladepunkte @de
range: integer

SEV1011 Type J
type: Plug type
comment: The Swiss standard, also used in Liechtenstein, is SN SEV 1011:2009 Plugs and socket-outlets for household and similar purposes. The standard defines a hierarchical system of plugs and sockets with two, three and five pins, and 10 A or 16 A ratings. Sockets will accept plugs with the same or fewer pins and the same or lower ratings.
ocm connection ID: 1037
alternative label: Type J
alternative label: Swiss domestic 3-pin

total capacity
type: DatatypeProperty
type: Property
comment: Indicates the total number of parking spaces of a parking facility.
domain: Parking facility
label: Gesamtkapazität @de
range: integer
created: 2017-05-10
modified: 2018-01-12
term status: stable

J1772
type: Plug type
comment: SAE J1772 (IEC Type 1) is a North American standard for electrical connectors for electric vehicles maintained by the SAE International and has the formal title "SAE Surface Vehicle Recommended Practice J1772, SAE Electric Vehicle Conductive Charge Coupler".
ocm connection ID: 7

Parking lot
type: Class
comment: Parking area on a single groundfloor level that is usually located outdoor.
label: Parkplatz @de
subclass of: Parking facility
created: 2017-05-30
modified: 2018-01-12
term status: stable
alternative label: car lot
alternative label: Parkfläche @de
preferred label: Car park

queuing time
type: DatatypeProperty
type: Property
comment: The current queuing time (duration) for entering the parking facility.
domain: Parking facility
label: Wartezeit @de
range: string
created: 2017-05-15
modified: 2018-01-12
term status: stable

Mennekes (Type 2)
type: Plug type
comment: The IEC 62196 Type 2 connector (commonly referred to as Mennekes) is used for charging electric cars within Europe. The connector is circular in shape, with a flattened top edge and originally specified for charging battery electric vehicles at 3–120 kilowatts.
ocm connection ID: 25
ocm connection ID: 1036
alternative label: IEC_62196 Type 2

CEE 7/5
type: Plug type
comment: The CEE 7/5 socket and CEE 7/6 plug are defined in French standard NF C 61-314 "Plugs and socket-outlets for household and similar purposes" (which also includes CEE 7/7, 7/16 and 7/17 plugs) The socket has a predominantly circular recess which is 15 mm (0.591 in) deep with two symmetrical round apertures and a round 4.8 mm (0.189 in) earth pin projecting from the socket such that the tip is 23 mm (0.906 in) beyond the live contacts, to ensure that the earth is always engaged before live pin contact is made. The earth pin is centred between the apertures, offset by 10 mm (0.394 in). The plug (which is often, in error, also referred to as CEE 7/5) has two round pins measuring 4.8 by 19 mm (0.189 by 0.748 in), spaced 19 mm (0.748 in) apart and with an aperture for the socket's projecting earth pin. This standard is also used in Belgium, Poland, the Czech Republic, Slovakia and some other countries.
ocm connection ID: 23
alternative label: Type E

date
type: DatatypeProperty
type: Property
comment: The date of the given real-time capacity.
domain: Real time capacity
range: datetime

IEC_60309 5-pin
type: Plug type
comment: IEC 60309 (formerly IEC 309 and CEE 17, also published by CENELEC as EN 60309) is an international standard from the International Electrotechnical Commission (IEC) for "plugs, socket-outlets and couplers for industrial purposes". 5-Pin connector.
ocm connection ID: 17

name
type: DatatypeProperty
type: Property
comment: Name of the civic structure or facility.
domain: Civic structure
label: Name @de
range: string
created: 2017-04-13
modified: 2018-01-12
term status: stable

NEMA 14-50
type: Plug type
comment: NEMA connectors are power plugs and receptacles used for AC mains electricity in North America and other countries that use the standards set by the US National Electrical Manufacturers Association. The NEMA 14 devices are four-wire grounding devices (hot-hot-neutral-ground) available in ratings from 15 to 60 A. The voltage rating is 250 V. Rated for 60A.
ocm connection ID: 11

Action
type: Class
comment: Action that is done.
label: Aktion @de
created: 2017-06-23
modified: 2018-01-12
term status: stable

Automated parking garage
type: Class
comment: Parking garage with an automated parking system that automatically moves cars to the available parking space somewhere in the garage.
label: Automatisches Parkhaus @de
subclass of: Parking facility
created: 2017-04-13
modified: 2018-01-12
term status: stable

CEE 7-Pin
type: Plug type
comment: CEE 7-Pin 32A / 400V Socket.
ocm connection ID: 18

J1772 2009
type: Plug type
comment: SAE J1772 (IEC Type 1) is a North American standard for electrical connectors for electric vehicles maintained by the SAE International and has the formal title "SAE Surface Vehicle Recommended Practice J1772, SAE Electric Vehicle Conductive Charge Coupler". The SAE J1772-2009 connector specification has been added to the international IEC 62196-2 standard.
ocm connection ID: 1
alternative label: IEC 62196 Type 1

Exit
type: Class
comment: Exit of a parking facility where vehicles can leave the parking facility.
label: Ausfahrt @de
subclass of: Civic structure
created: 2017-05-10
modified: 2018-01-12
term status: stable

opening hours specification
type: ObjectProperty
type: Property
comment: Indicates the general opening hours for a business or civic structure.
domain: Civic structure
range: Opening hours specification

Bike and Ride
type: Parking facility connections
comment: Parking facilities for bicycles with connection to public transport.

Parking facility
type: Class
comment: Any facility or area assigned for parking vehicles. A parking facility can provide one or more parking spaces.
label: Parkeinrichtung @de
subclass of: Civic structure
created: 2014-10-16
modified: 2018-01-12
equivalent class: ParkingFacility
term status: stable

accepted payment method
type: ObjectProperty
comment: The payment method(s) accepted by seller for this offer.
domain: Civic structure
range: Payment method

Tesla Supercharger
type: Plug type
comment: The Tesla Supercharger network is a system of 480-volt DC fast-charging stations built by American vehicle manufacturer Tesla Inc. to allow longer journeys for their all-electric manufactured vehicles (Model S, 3 and X), through quick charging of the vehicle's battery packs.
ocm connection ID: 30
ocm connection ID: 27

Park and ride service not operating
type: Civic structure status
comment: Park and ride services are not operating until the specified time.
label: Kein P+R-Service @de

time unit
type: Property
type: DatatypeProperty
comment: Indicates the time unit a value is specified for.
domain: Time specification
label: Zeiteinheit @de
range: string
created: 2017-06-07
modified: 2018-01-12
term status: stable

Price specification
type: Class
comment: A structured value representing a price or price range for an item.
label: Preisspezifikation @de

Civic structure status
type: Class
comment: Status information of a civic structure.
label: Status der Parkeinrichtung @de
created: 2018-01-11
modified: 2018-01-12
term status: stable

NEMA 6-20
type: Plug type
comment: NEMA connectors are power plugs and receptacles used for AC mains electricity in North America and other countries that use the standards set by the US National Electrical Manufacturers Association. All NEMA 6 devices are three-wire grounding devices (hot-hot-ground) used for 208 and 240 V circuits and rated for 250 V maximum. The 20 A plug has a blade rotated 90°.
ocm connection ID: 14

Park & Fly
type: Parking facility connections
comment: Connection to airport.
label: Parken und Fliegen @de
alternative label: P&F
alternative label: P+F

Taxi drivers
type: User group
comment: Drivers of a vehicle for hire, used by a single passenger or small group of passengers, often for a non-shared ride. Taxi drivers convey passengers between locations of their choice.
label: Taxifahrer @de
alternative label: Taxicab drivers
alternative label: Cabbies
alternative label: Cab drivers

exit
type: ObjectProperty
type: Property
comment: Describes the exit of a parking facility.
domain: Parking facility
label: hat Ausfahrt @de
range: Exit
created: 2017-05-10
modified: 2018-01-12
term status: stable

Coach
type: Vehicle
comment: A bus is a road vehicle designed to carry passengers. Coaches are luxury busses, usually in service for long distance travel.
label: Bus @de

Parking facility connections
type: Class
comment: Transport connections available at the parking facility (e.g. Park & Ride).
label: Anschlussmöglichkeiten der Parkeinrichtung @de
created: 2017-06-09
modified: 2018-01-12
term status: stable

current in A
type: DatatypeProperty
type: Property
comment: Indicates the current of a charger or plug in ampere.
domain: Class
  union of: Plug
  union of: Charger
range: double

Video surveillance
type: Parking facility feature
comment: The parking facility is surveilled by video.
label: Videoüberwachung @de

University of Bonn
type: Agent
type: Organization

ocm connection ID
type: AnnotationProperty
comment: The OpenChargeMap ID used for the Connection / Plug.
range: string

latitude
type: DatatypeProperty
type: Property
comment: Geographic latitude of a place.
domain: Place
range: string

Families
type: User group
comment: Parents with children.
label: Familien @de

NEMA 5-20R
type: Plug type
comment: NEMA connectors are power plugs and receptacles used for AC mains electricity in North America and other countries that use the standards set by the US National Electrical Manufacturers Association. All NEMA 5 devices are three-wire grounding devices (hot-neutral-ground) rated for 125 V maximum.
ocm connection ID: 9

vechicle height limit
type: Property
type: DatatypeProperty
comment: Indicates the height limit in meter for vehicles using the parking facility.
domain: Civic structure
label: Höhenbegrenzung für Fahrzeuge @de
range: decimal
created: 2017-04-13
modified: 2018-01-12
term status: stable

Motorbike
type: Vehicle
comment: A single-track, two-wheeled motor vehicle.
label: Motorrad @de
alternative label: Motorcycle
preferred label: Moto @fr

Bicycle parking station
type: Class
comment: Building or structure designed for use as a bicycle parking facility.
label: Fahrradparkstation @de
subclass of: Parking facility
created: 2017-05-10
modified: 2018-01-12
term status: stable

Car
type: Vehicle
comment: A wheeled, self-powered motor vehicle used for transportation.
label: Auto @de
label: Voiture @fr
alternative label: Pkw @de

NEMA 5-15R
type: Plug type
comment: NEMA connectors are power plugs and receptacles used for AC mains electricity in North America and other countries that use the standards set by the US National Electrical Manufacturers Association. All NEMA 5 devices are three-wire grounding devices (hot-neutral-ground) rated for 125 V maximum. The 5-15R is by far the most common electrical receptacle in North America in buildings built since the mid-twentieth century. It is usually installed in a duplex configuration; two receptacles may share a common circuit or may each be wired separately, sometimes to a switch.
ocm connection ID: 22

parking space
type: Property
type: ObjectProperty
comment: Relates the parking facility to a contained parking space.
domain: Parking facility
label: hat Stellplatz @de
range: Parking space
created: 2017-05-15
modified: 2018-01-12
term status: stable

Parking facility feature
type: Class
comment: Features of the parking facility (e.g. parking for disabled people).
label: Ausstattung der Parkeinrichtung @de
created: 2017-04-13
modified: 2018-01-12
term status: stable

Truck
type: Vehicle
comment: A motor vehicle designed to transport cargo.
label: Lkw @de

has capacity
type: Property
type: ObjectProperty
comment: Relates the civic structure to its capacity.
domain: Civic structure
label: hat Kapazität @de
range: Capacity
created: 2017-04-13
modified: 2018-01-12
term status: stable

valid for vehicle
type: Property
type: ObjectProperty
comment: Indicates that an entity is valid for a specific type of vehicle.
domain: Class
  union of: Access condition
  union of: Price specification
  union of: Capacity
label: gültig für Fahrzeug @de
range: Vehicle
created: 2017-08-29
modified: 2018-01-12
term status: stable

Restrict
type: Action
comment: An action is restricted.
label: Beschränken @de

Charger
type: Class
comment: Component of a charging point used to charge electric vehicles. A charging point can have one or more chargers.
label: Ladegerät @de

additional information
type: Property
type: DatatypeProperty
comment: Further information about the civic structure or facility.
domain: Civic structure
label: zusätzliche Information @de
range: string
created: 2017-04-07
modified: 2018-01-12
term status: stable

NEMA 6-15
type: Plug type
comment: NEMA connectors are power plugs and receptacles used for AC mains electricity in North America and other countries that use the standards set by the US National Electrical Manufacturers Association. All NEMA 6 devices are three-wire grounding devices (hot-hot-ground) used for 208 and 240 V circuits and rated for 250 V maximum. The 6-15 resembles the 5-15, but with collinear horizontal pins
ocm connection ID: 15

owned by
type: ObjectProperty
type: Property
comment: The owner of a civic structure or facility. Owner and operator can be different business entities.
domain: Civic structure
label: in Besitz von @de
range: Business entity
created: 2017-04-05
modified: 2018-01-12
term status: stable

ID
type: Property
type: DatatypeProperty
comment: ID of the entity.
range: string
created: 2017-05-11
modified: 2018-01-12
term status: stable

Park and Rail
type: Parking facility connections
comment: Connection to railway station.

Pay station
type: Parking facility feature
comment: The parking facility has a pay station.
label: Kassenautomat @de

Only a few parking spaces available
type: Civic structure status
comment: The parking facility has 95% or greater occupancy.
label: Nur noch wenige Stellplätze frei @de

No parking information available
type: Civic structure status
comment: Parking information is not available until a specified time.
label: Keine Parkinformationen verfügbar @de

Christop Lange
type: Person
type: Agent
affiliation: University of Bonn

BS1363
type: Plug type
comment: 13 A plugs socket-outlets adaptors and connection units is a British Standard which specifies the most common type of single-phase AC power plugs and sockets that are used in the United Kingdom.
ocm connection ID: 3
alternative label: Type G

action
type: ObjectProperty
type: Property
comment: Indicates which action is applied.
domain: Access condition
range: Action
created: 2017-06-23
modified: 2018-01-12
term status: stable

picture
type: DatatypeProperty
type: Property
comment: URL of the picture of a civic structure or facility.
domain: Civic structure
label: Bild @de
range: string
created: 2017-06-07
modified: 2018-01-12
term status: stable

Time specification
type: Class
comment: Specific time a price specification is due for.
label: Zeitspezifikation @de
created: 2017-06-07
modified: 2018-01-12
term status: stable

Full
type: Civic structure status
comment: The parking facility is completely occupied.
label: Belegt @de

unspecified charge
type: Property
type: DatatypeProperty
comment: Indicates that a charge has to be paid for the usage of the civic structure.
domain: Price specification
label: kostenpflichtig @de
range: boolean
created: 2017-06-07
modified: 2018-01-12
term status: stable

Parking space
type: Class
comment: A parking space is a location that is designated for parking a vehicle. A parking space has a certain size, is sometimes marked and can be located at roadside or inside a parking facility. Depending on the location of the parking space, there can be regulations regarding the time allowed to park and a fee paid to use the parking space.
label: Stellplatz @de
subclass of: Civic structure
created: 2017-05-10
modified: 2018-01-12
term status: stable
hidden label: Parkplatz @de

current type
type: DatatypeProperty
type: Property
comment: Indicates the current type (AC/DC) of the plug.
domain: Class
  union of: Plug
  union of: Charger
range: string

XLR 4-Pin
type: Plug type
comment: The XLR connector is a style of electrical connector, primarily found on professional audio, video, and stage lighting equipment. The connectors are circular in design and have between 3 and 7 pins. They are most commonly associated with balanced audio interconnection, including AES3 digital audio, but are also used for lighting control, low-voltage power supplies, and other applications. XLR connectors are available from a number of manufacturers and are covered by an international standard for dimensions, IEC 61076-2-103.[1] They are superficially similar to the older and smaller DIN connector range, but are not physically compatible with them.
ocm connection ID: 21

Status unknown
type: Civic structure status
comment: The status of the parking facility is unknown.
label: Status unbekannt @de

Niklas Petersen
type: Person
type: Agent
affiliation: University of Bonn

Enough parking spaces available
type: Civic structure status
comment: The parking facility has parking spaces available.
label: Genügend Stellplätze frei @de

surveillance by security guards
type: Parking facility feature
comment: The parking facility is surveilled by security guards.
label: Bewacht durch Personal @de

Entrance
type: Class
comment: Entrance of a parking facility where vehicles can enter the parking facility.
label: Einfahrt @de
subclass of: Civic structure
created: 2017-05-10
modified: 2018-01-12
term status: stable

Real time capacity
type: Class
comment: Real-time capacity of a parking facility or parking space.
comment: Real-time capacity of a civic structure.
label: Echtzeit Kapazität @de
subclass of: Capacity
created: 2017-04-05
created: 2017-05-15
modified: 2018-01-12
term status: stable

Vehicle
type: Class
comment: A vehicle is a device that is designed or used to transport people or cargo over land, water, air, or through space.
label: Fahrzeug @de

Inhabitants
type: User group
comment: People living on the premises.
label: Anwohner @de

SAE Combo (DC Fast Charge J1772)
type: Plug type
comment: The Combined Charging System is a quick charging method for battery electric vehicles delivering high-voltage direct current via a special electrical connector derived from the SAE J1772 (IEC Type 1).
ocm connection ID: 32

number of levels
type: DatatypeProperty
type: Property
comment: Indicates the total number of levels a parking facility has.
domain: Parking facility
label: Anzahl Ebenen @de
range: integer
created: 2018-01-11
modified: 2018-01-12
term status: stable

Parking garage
type: Class
comment: A single level or multilevel parking building to park at.
label: Parkhaus @de
subclass of: Parking facility
created: 2017-04-13
modified: 2018-01-12
term status: stable
alternative label: Hochgarage @de
alternative label: Parking structure
alternative label: Car park
alternative label: Parking building

rate of occupancy
type: DatatypeProperty
type: Property
comment: Indicates the percentage value of parking spaces occupied in a parking facility.
domain: Parking facility
label: Belegungsrate @de
range: string
created: 2017-05-10
modified: 2018-01-12
term status: stable

User group
type: Class
comment: A group of users having a common characteristic.
label: Nutzergruppe @de
created: 2017-06-07
modified: 2018-01-12
term status: stable

time end value
type: DatatypeProperty
type: Property
comment: Indicates the end value of a time period.
domain: Time specification
label: Endzeit @de
range: float
created: 2017-06-07
modified: 2018-01-12
term status: stable

NEMA 14-30
type: Plug type
comment: NEMA connectors are power plugs and receptacles used for AC mains electricity in North America and other countries that use the standards set by the US National Electrical Manufacturers Association. The NEMA 14 devices are four-wire grounding devices (hot-hot-neutral-ground) available in ratings from 15 to 60 A. The voltage rating is 250 V. Rated for 30A.
ocm connection ID: 10

exit rate
type: DatatypeProperty
type: Property
comment: The rate at which vehicles are exiting the parking facility.
domain: Parking facility
range: string
created: 2017-06-07
modified: 2018-01-12
term status: stable

Status operational
type: Civic structure status
comment: The facility is operational.
label: Status in Betrieb @de

fill rate
type: Property
type: DatatypeProperty
comment: The rate at which vehicles are entering the parking facility.
domain: Parking facility
range: string
created: 2017-05-10
modified: 2018-01-12
term status: stable

CCS Type2
type: Plug type
comment: The Combined Charging System is a quick charging method for battery electric vehicles delivering high-voltage direct current via a special electrical connector derived from the IEC Type 2 connector. As the plug is a combination of an AC connector with a DC option the resulting connector is also called Combo Coupler and the variant with Type 2 is abbreviated as Combo2.
ocm connection ID: 33
alternative label: Combo2

employee of
type: Property
type: ObjectProperty
comment: Indicates that a group is employee of a specific business entity.
domain: User group
label: Mitarbeiter von @de
range: Business entity
created: 2017-06-23
modified: 2018-01-12
term status: stable

maximum value
type: Property
type: DatatypeProperty
comment: Indicates the maximum value of the capacity.
domain: Capacity
range: integer
created: 2015-05-15
modified: 2018-01-12
term status: stable

Arrangement pattern
type: Class
comment: Art und Weise, wie ein Fahrzeug auf einer Parkfläche aufgestellt wird. @de
comment: Pattern how parking spaces are arranged in a parking facility or at roadside.
label: Aufstellart @de
created: 2017-05-10
modified: 2018-01-12
term status: stable

Persons with disabled parking permit
type: User group
comment: Persons with disabilities having a special parking permit that gives the right to use parking spaces reserved for disabled people.
label: Personen mit Behindertenparkausweis @de

longitude
type: DatatypeProperty
type: Property
comment: Geographic longitude of a place.
domain: Place
range: string

Access condition
type: Class
comment: A condition that has to be fullfilled to get access to a civic structure.
label: Zugangsbedingung @de
created: 2017-08-29
modified: 2018-01-12
term status: stable

valid for user group
type: ObjectProperty
type: Property
comment: Indicates that an entity is valid for a specific group of users.
domain: Class
  union of: Access condition
  union of: Price specification
  union of: Capacity
label: gültig für Nutzergruppe @de
range: User group
created: 2017-09-01
modified: 2018-01-12
term status: stable

CHAdeMO
type: Plug type
comment: CHAdeMO is the trade name of a quick charging method for battery electric vehicles delivering up to 62.5 kW of direct current (500 V, 125 A[1]) via a special electrical connector.
ocm connection ID: 2

plug type
type: ObjectProperty
type: Property
comment: Indicates the type of a plug.
domain: Plug
range: Plug type

energy source
type: DatatypeProperty
type: Property
comment: Indicates the energy source used for the charging point i.e. renewable etc.
domain: Charging point
range: string

overnight
type: DatatypeProperty
type: Property
comment: Indicates that a time period overnight is possible.
domain: Time specification
label: über Nacht @de
range: boolean
created: 2017-06-07
modified: 2018-01-12
term status: stable

No parking allowed
type: Civic structure status
comment: No parking allowed until the specified time.
label: Parken verboten @de

vehicle length limit
type: DatatypeProperty
type: Property
comment: Indicates the length limit in meter for vehicles using the parking facility.
domain: Civic structure
label: Längenbegrenzung für Fahrzeuge @de
range: decimal
created: 2017-04-13
modified: 2018-01-12
term status: stable

Payment method
type: Class
comment: A payment method is a standardized procedure for transferring the monetary amount for a purchase. Payment methods are characterized by the legal and technical structures used, and by the organization or group carrying out the transaction.
label: Zahlungsart @de

All parking facilities full
type: Civic structure status
comment: All parking facilities within a specified area are completely occupied.
label: Alle Parkmöglichkeiten belegt @de

Angle parking
type: Arrangement pattern
comment: Parking where the parking spaces are arranged at an acute angle to the direction of approach, allowing the driver to enter a space easily and later reverse back out.
comment: Bei der Schrägaufstellung wird das Fahrzeug mit einem Aufstellwinkel zwischen 50 und 90 gon (45° und ca. 81°) geparkt. Das Fahrzeug kann vorwärts in den Parkstand einfahren, muss zum Ausparken jedoch wieder rückwärts herausfahren. Diese Aufstellung wird oft bei Parkplätzen verwendet, da sie schmalere Fahrwege als die Senkrechtaufstellung und bessere Platzausnutzung als Parallelaufstellung ermöglicht. @de
label: Schrägaufstellung @de
created: 2017-05-31
modified: 2018-01-12
term status: stable
alternative label: Echelon parking

Capacity
type: Class
comment: Capacity of a civic structure.
label: Kapazität @de
created: 2017-04-13
modified: 2018-01-12
term status: stable

three-phased current available
type: DatatypeProperty
type: Property
comment: Indicates whether three-phased current is available.
domain: Class
  union of: Plug
  union of: Charger
range: boolean

Sebastian Tramp
type: Person
type: Agent
affiliation: eccenca GmbH

customer of
type: ObjectProperty
type: Property
comment: Indicates that a group is customer of a specific business entity.
domain: User group
label: Kunde von @de
range: Business entity
created: 2017-06-23
modified: 2018-01-12
term status: stable

cable available
type: DatatypeProperty
type: Property
comment: Indicates whether the plug has a cable.
domain: Plug
label: Kabel verfügbar @de
range: boolean

Parking barrier
type: Parking facility feature
comment: The parking facility has a parking barrier.
label: Parkschranke @de

Opening hours specification
type: Class
comment: A structured value providing information about the opening hours of a place or a certain service inside a place.
label: Öffnungszeiten @de

connected to
type: ObjectProperty
type: Property
comment: Indicates the transport connections available.
domain: Parking facility
range: Parking facility connections
created: 2017-05-30
modified: 2018-01-12
term status: stable

feature
type: Property
type: ObjectProperty
comment: Indicates which feature the parking facility provides.
domain: Parking facility
range: Parking facility feature
created: 2017-09-01
modified: 2018-01-12
term status: stable

arrangement pattern
type: ObjectProperty
type: Property
comment: Indicates in which pattern a parking space is arranged.
domain: Parking space
domain: Parking facility
label: Anordnung @de
range: Arrangement pattern
created: 2017-05-10
modified: 2018-01-12
term status: stable

Civic structure
type: Class
comment: A public structure, such as a town hall or concert hall, parking facility or charging point.
label: Zivile Struktur @de
subclass of: Place

Closed
type: Civic structure status
comment: The parking facility is closed.
label: Geschlossen @de

Postal address
type: Class
comment: The mailing address.

SCAME Type 3C
type: Plug type
comment: The type 3A is derived from the Scame charging connectors adding the IEC 62196 pins which is suited for single-phase charging – the connector builds on the experience with the Scame connector for charging of light vehicles (electric motorcycles and scooters). The additional type 3C adds additional 2 pins for three-phase charging for usage at fast charge stations. Based on its origin the connector is sometimes referred to as the Scame type 3 connector.
ocm connection ID: 26
alternative label: IEC 62196-2 Type 3C