The MEX Vocabulary (mex-perf)
type: Ontology
label: Vocabulario MEX (mex-perf) @pt
created: 2014-02-02
modified: 2016-05-01
creator: DiegoEsteves.html
about: http://mex.aksw.org/mex-doc-perf#
version info: 1.0.2
publisher: AKSW Research Group - Leipzig University
title: MEX Performance (mex-perf) is an ontology with the goal of describing performance values for machine learning problems (MEX Platform)
comment: MEX is an RDF vocabulary designed to facilitate interoperability between published machine learning experiments results on the Web. The mex-perf layer is the 3rd level of the MEX for representing the machine learning algorithm's performances.
publisher: AKSW Grupo de Pesquisa - Universidade de Leipzig @pt
comment: MEX e um vocabulario modelado para facilitar a interoperabilidade entre resultados de experimentos de aprendizado de maquinas publicados na Web. A camada mex-perf e o 3o. nivel na abordagem MEX para representar performances de algoritmos de aprendizado de maquinas @pt
contributor: DiegoMoussallem.html
contributor: JensLehmann.html
imports: doap#
imports: rdf-schema#
imports: prov-o#

f1Measure
type: DatatypeProperty
description: F-measure or F-score or F1 score
domain: ClassificationMeasure
range: double

Pointwise mutual information
type: DatatypeProperty
domain: StatisticalMeasure
range: double