lemon
type: Ontology
comment: Lemon: The lexicon model for ontologies is designed to allow for descriptions of lexical information regarding ontological elements and other RDF resources. Lemon covers mapping of lexical decomposition, phrase structure, syntax, variation, morphology, and lexicon-ontology mapping.

Actant
type: Class
comment: A slot representing a gap that must be filled in realising a lexical entry in a given projection
label: Argument
label: Argumento @es
label: Аргумент @ru
subclass of: LemonElement
subclass of: Phrase element
disjoint with: Component
disjoint with: Form
disjoint with: Frame
disjoint with: Lexical entry
disjoint with: Lexical sense
disjoint with: Lexicon
disjoint with: Node
disjoint with: Property Value
disjoint with: Definición
disjoint with: Syntactic role marker
disjoint with: Usage Example

Component
type: Class
comment: A constituent element of a lexical entry. This may be a word in a multi-word lexical element or a constituent of a compound word
label: Bestanddeel @nl
label: Componente @es
label: Composant @fr
label: Komponente @de
label: Компонента @ru
subclass of: LemonElement
subclass of: Phrase element
subclass of: Restriction
  max cardinality: 1
  on property: Element
disjoint with: Form
disjoint with: Frame
disjoint with: Lexical entry
disjoint with: Lexical sense
disjoint with: Lexicon
disjoint with: Node
disjoint with: Property Value
disjoint with: Definición
disjoint with: Syntactic role marker
disjoint with: Usage Example

ComponentList
type: Class
comment: A node within a list of components. This should generally be a blank node,see rdf:List
subclass of: List
subclass of: Restriction
  cardinality: 1
  on property: first
subclass of: Restriction
  all values from: Component
  on property: first
subclass of: Restriction
  cardinality: 1
  on property: rest
subclass of: Restriction
  all values from: Class
    union of: ComponentList
    union of: Class
      one of: nil
  on property: rest

Form
type: Class
comment: A given written or spoken realisation of a lexical entry
label: Forma @es
label: Forme @fr
label: Vorm @nl
label: Форма @ru
subclass of: LemonElement
subclass of: Restriction
  min cardinality: 1
  on property: Representation
disjoint with: Frame
disjoint with: Lexical entry
disjoint with: Lexical sense
disjoint with: Lexicon
disjoint with: Node
disjoint with: Property Value
disjoint with: Definición
disjoint with: Syntactic role marker
disjoint with: Usage Example

Frame
type: Class
comment: A stereotypical example of the usage of a given lexical entry. The most common example of projections are subcategorization frames which describe the slots taken by the arguments of a verb.
label: Cadre @fr
label: Marco @es
label: Raam @nl
label: Rahmen @de
label: Рамка @ru
subclass of: LemonElement
disjoint with: Lexical entry
disjoint with: Lexical sense
disjoint with: Lexicon
disjoint with: Node
disjoint with: Property Value
disjoint with: Definición
disjoint with: Syntactic role marker
disjoint with: Usage Example

HasLanguage
type: Class
comment: Structural element for all elements that can be tagged with a language
subclass of: LemonElement

Lexical Condition
type: Class
comment: An evaluable condition on when a sense applies.
label: Condición léxica @es
label: Condition lexicale @fr
label: Lexikaal Voorwaarde @nl
label: Lexikonbedingung @de
label: Лексическое условие @ru
subclass of: LemonElement

Lexical Context
type: Class
comment: Indicates the pragmatic or discourse context in which a sense applies
label: Contexte lexical @fr
label: Contexto léxico @es
label: Lexikaal Context @nl
label: Lexikonkontext @de
label: Лексический контекст @ru
subclass of: LemonElement

Lexical entry
type: Class
comment: An entry in the lexicon. This may be any morpheme, word, compound, phrase or clause that is included in the lexicon
label: Entrada léxica @es
label: Entrée lexicale @fr
label: Lexikaal item @nl
label: Lexikoneintrag @de
label: Лексическая единица @ru
subclass of: HasLanguage
subclass of: HasPattern
subclass of: LemonElement
subclass of: Restriction
  min cardinality: 1
  on property: Lexical form
subclass of: Restriction
  max cardinality: 1
  on property: Canonical form
disjoint with: Lexical sense
disjoint with: Lexicon
disjoint with: Node
disjoint with: Property Value
disjoint with: Definición
disjoint with: Usage Example

Lexical sense
type: Class
comment: Represents the intersection in meaning between the lexical entry and the ontology entity. This is used as the ontology entity and lexical entry may not be in one-to-one correspondence as such the existence of a sense between them states meerly that there are some cases when this lexical entry refer to the ontology entity and vica versa. Mapping elements can be used to further specify this relation
label: Acepción léxica @es
label: Lexikaal zin @nl
label: Lexikonsinn @de
label: Signification lexicale @fr
subclass of: LemonElement
subclass of: Class
  union of: Restriction
    min cardinality: 1
    on property: Subsense
  union of: Restriction
    cardinality: 1
    on property: Reference
disjoint with: Lexicon
disjoint with: Node
disjoint with: Property Value
disjoint with: Definición
disjoint with: Syntactic role marker
disjoint with: Usage Example

Lexical Topic
type: Class
comment: Indicates the topic of a lexicon or a lexical entry
label: Lexikaal Thema @nl
label: Lexikonthema @de
label: Tema léxica @es
label: Thème lexicale @fr
subclass of: LemonElement

Lexicon
type: Class
comment: The lexicon object. This object is specific to the given language and/or domain it describes
label: Lexicón @es
label: Lexikon @de
label: Lexique @fr
label: Лексикон @ru
subclass of: HasLanguage
subclass of: HasPattern
subclass of: LemonElement
subclass of: Restriction
  min cardinality: 1
  on property: Entry
subclass of: Restriction
  cardinality: 1
  on property: Language
disjoint with: Node
disjoint with: Property Value
disjoint with: Definición
disjoint with: Syntactic role marker
disjoint with: Usage Example

Morphological pattern
type: Class
label: Morphologisch Patroon @nl
label: Morphologische Muster @de
label: Patron morphologique @fr
label: Patrón morfológico @es
label: Морфологический шаблон @ru
subclass of: HasLanguage
subclass of: LemonElement

Morphological Transform
type: Class
label: Morphologisch transformatie @nl
label: Morphologische Transformation @de
label: Transformación morfológica @es
label: Transformation morphologique @fr
label: Морфологическое преобразование @ru
subclass of: LemonElement

Node
type: Class
comment: A node in a phrase structure or dependency parse graph
label: Knoten @de
label: Nœud @fr
label: Punt @nl
label: Vértice @es
label: Узел @ru
subclass of: LemonElement
subclass of: Class
  union of: Restriction
    min cardinality: 1
    on property: Edge
  union of: Restriction
    min cardinality: 1
    on property: Leaf
disjoint with: Property Value
disjoint with: Definición
disjoint with: Syntactic role marker
disjoint with: Usage Example

Constituent
type: Class
comment: The class of constituents, that is types applied to nodes in a phrase structure graph
label: Constituyente @es
label: Konstituent @de
label: Составляющая @ru
subclass of: LemonElement

Part of word
type: Class
comment: An affix is a morpheme that is attached to a word stem to form a new word. Use this for lexical entries with only abstract forms
label: Deel van een woord @nl
label: Parte de la palabra @es
label: Partie du mot @fr
label: Wortteil @de
label: Часть слова @ru
subclass of: Lexical entry

Phrase
type: Class
comment: A phrase in lemon is defined in the looser sense of a sequence of words, it does not have to a fully grammatical phrase
label: Sintagma @es
label: Syntagme @fr
label: Zinsdeel @nl
label: Фраза @ru
subclass of: Lexical entry
subclass of: Restriction
  min cardinality: 1
  on property: Decomposition

Phrase element
type: Class
comment: A terminal node in a phrase structure graph, i.e., a realisable, lexical element.
label: Elemento del sintagma @es
label: Elément du syntagme @fr
label: Phrase-Element @de
label: Zinselement @nl
subclass of: LemonElement

Property Value
type: Class
comment: A value that can be used in the range of linguistic property
label: Prädikatswert @de
label: Valeur de la propriété @fr
label: Valor de la propiedad @es
label: Waarde van het predikaat @nl
label: Свойство @ru
subclass of: LemonElement
disjoint with: Definición
disjoint with: Usage Example

Prototype
type: Class
label: Prototipo @es
label: Prototyp @nl
label: Прототип @ru
subclass of: LemonElement

Condition
type: Class
comment: Indicates a logical condition that is used indicate when a particular term has the given meaning
label: Bedingung @de
label: Condición @es
label: Voorwaarde @nl
label: Условие @ru
subclass of: LemonElement

Context
type: Class
comment: Indicates the context in which a term is to be used. The context refers not to the immediate syntactic context, but the document and register the document is used in
label: Contexte @fr
label: Contexto @es
label: Kontext @de
label: Контекст @ru
subclass of: LemonElement

Definición
type: Class
comment: A definition of a sememe, that is the a text describing the exact meaning of the lexical entry when its sense is the given ontology reference
label: Definitie @nl
label: Definition
label: Définition @fr
label: Определение @ru
subclass of: LemonElement
subclass of: Restriction
  min cardinality: 1
  on property: Value
disjoint with: Syntactic role marker
disjoint with: Usage Example

Syntactic role marker
type: Class
comment: The indicator of a given syntactic argument, normally a preposition or other particle marker or a linguistic property such as case
label: Marcador de la función sintáctica @es
label: Marqueur du rôle syntaxique @fr
label: Syntactisch rol merker @nl
label: Syntactische Rolle-Marker @de
label: Маркер синтаксической роли @ru
subclass of: LemonElement
subclass of: Class
  union of: Lexical entry
  union of: Property Value
disjoint with: Usage Example

Usage Example
type: Class
comment: An example of the usage of a lexical entry when refering to the ontology entity given by the sememe's reference. This should in effect be an example of the form used in context. E.g., "this is a *usage example*"
label: Anwendungsbeispiel @de
label: Ejemplo de uso @es
label: Exemple d'utilisation @fr
label: Voorbeeld van het gebruik @nl
label: Пример использования @ru
subclass of: LemonElement
subclass of: Restriction
  min cardinality: 1
  on property: Value

Word
type: Class
comment: A word is a single unit of writing or speech. In languages written in Latin, Cyrillic, Greek, Arabic scripts etc. these are assumed to be separated by white-space characters. For Chinese, Japanese, Korean this should correspond to some agreed segmentation scheme.
label: Mot @fr
label: Palabra @es
label: Woord @nl
label: Wort @de
label: Слово @ru
subclass of: Lexical entry

Abstract form
type: Property
type: ObjectProperty
comment: A representation of a lexical entry that should not be considered canonical. This is primarily from a linguistic view for non-realisable forms such as stems but may also include misspellings and other unusual forms
domain: Lexical entry
label: Abstracte vorm @nl
label: Abstrakte Form @de
label: Forma abstracta @es
label: Forme abstraite @fr
range: Form
sub property of: Lexical form

Alternative reference of
type: Property
type: ObjectProperty
comment: The sense of a non-preferred but admissible lexicalization of a given ontology entity
label: Alternatieve referentie van @nl
label: Alternative Referenz von @de
label: Referencia alternativa de @es
label: Référence alternative de @fr
range: Lexical sense
sub property of: Reference of

Broader
type: Property
type: ObjectProperty
comment: Denotes that one sense is broader than another. From a lexical point of view this means replacing one lexical entry with another generalizes the meaning of the phrase. From an ontological point of view this property makes not strong assertions. From a mapping point of view if the broader sense applies the narrower sense must also
domain: Lexical sense
label: Breder @nl
label: Breiter @de
label: Más amplio @es
label: Plus large @fr
range: Lexical sense
sub property of: Sense relation
inverse of: Narrower

Canonical form
type: Property
type: FunctionalProperty
type: ObjectProperty
comment: The canonical ("dictionary") form of the lexical entry. This can be used to indicate the "lemma" form of a lexical entry
domain: Lexical entry
label: Canonieke vorm @nl
label: Forma canónica @es
label: Forme canonique @fr
label: Kanonische Form @de
range: Form
sub property of: Lexical form

Condition
type: Property
type: ObjectProperty
comment: Indicates an evaluable test, the is necessary for this sense to apply
domain: Lexical sense
label: Bedingung @de
label: Condición @es
label: Voorwaarde @nl
range: Lexical Condition

Constituent
type: Property
type: ObjectProperty
domain: Node
label: Constitutif @fr
label: Constituyente @es
label: Konstituent @de
range: Constituent
sub property of: topObjectProperty

Context
type: Property
type: ObjectProperty
comment: Denotes the pragmatic or discursive context of a sense mapping or a constraint on the mapping by syntactic or semantic properites
domain: Lexical sense
label: Contexte @fr
label: Contexto @es
label: Kontext @de
range: Lexical Context

Decomposition
type: Property
type: ObjectProperty
comment: Denotes a component of a lexical entry
domain: Lexical entry
label: Decompositie @nl
label: Dekompositum @de
label: Descomposición @es
label: Décomposition @fr
range: ComponentList

Definición
type: Property
type: ObjectProperty
comment: Indicates a natural language definition. Note there is a pseudo-node to allow for further description of the definition (e.g., source, creation date etc.). The value property should be used to indicate the string value of the definition.
domain: Lexical sense
label: Definitie @nl
label: Definition
label: Définition @fr
range: Definición

Edge
type: Property
type: ObjectProperty
comment: Denotes the relation between a node in a multi-word expression structure and an edge
domain: Node
label: Arista @es
label: Kante @de
label: Lien @fr
label: Lijn @nl
range: Node

Element
type: Property
type: FunctionalProperty
type: ObjectProperty
comment: Denotes the lexical entry represented by the component
domain: Component
label: Elemento @es
label: Elément @fr
range: Lexical entry

Entry
type: Property
type: ObjectProperty
comment: Indicates an entry in a lexicon
domain: Lexicon
label: Eintrag @de
label: Entrada @es
label: Entrée @fr
label: Item @nl
range: Lexical entry

Equivalent
type: Property
type: ObjectProperty
type: SymmetricProperty
type: TransitiveProperty
comment: Indicates that two senses are equivalent. From a lexical point of view , this indicates that the lexical entries can be substituted for each other with no change in meaning. From an ontological point of view it means that the two references are not disjoint. From a mapping point of view it means if one mapping apply the other must necessarily apply
domain: Lexical sense
label: Equivalente @es
label: Äquivalent @de
range: Lexical sense
sub property of: Sense relation

Example
type: Property
type: ObjectProperty
domain: Lexical sense
label: Beispiel @de
label: Ejemplo @es
label: Exemple @fr
label: Voorbeeld @nl
range: Usage Example

Extrinsic argument
type: Property
type: ObjectProperty
comment: A raisable semantic argument is not in fact the semantic argument of the current frame-sense but instead is "raised" into a frame-sense used for an argument. For example the phrase "John seemed to be happy", is interpreted as "it seemed that X" where X is "John is happy", hence the subject of "seem" is a raisable argument.
label: Actant extrinsèque @fr
label: Argumento extrínseco @es
label: Extrinsiek argument @nl
label: Äußerliche Argument @de
sub property of: Semantic argument

Form variant
type: Property
type: ObjectProperty
domain: Form
label: Form-Variante @de
label: Variante de la forma @es
label: Variante de la forme @fr
label: Vorm variant @nl
range: Form

Generates
type: Property
type: ObjectProperty
domain: Morphological Transform
label: Erzeugt @de
label: Genera @es
label: Genereert @nl
label: Génère @fr
label: Порождает @ru
range: Prototype
subclass of: Restriction
  min cardinality: 1
  on property: Rule

Hidden reference of
type: Property
type: ObjectProperty
comment: The sense of a non-admissible lexicalization for a ontology entity. This is used to denote incorrect or deprecated language that may be useful for information extraction but not generation
label: Referencia oculta de @es
label: Référence cachée de @fr
label: Verborgen referentie van @nl
label: Verborgene Referenz von @de
range: Lexical sense
sub property of: Reference of

Incompatible
type: Property
type: ObjectProperty
type: SymmetricProperty
comment: Says that the two senses are disjoint. From a lexical point of view, this means substituting the lexical entries must change the meaning of the phrase. From an ontological point of view, this property is implied if both references are also disjoint, but does not imply disjointness, but non-equivalence of the references. For the mapping point of view there is not instance when both mappings are valid.
domain: Lexical sense
label: Inkompatibel @de
label: Onverenigbaar @nl
range: Lexical sense
sub property of: Sense relation

Instance of
type: Property
type: ObjectProperty
comment: Denotes that the single argument of a class predicate is represented in the lexicon by the given semantic argument. That is Class(?x) or ?x rdf:type Class
domain: Lexical sense
label: Instance de @fr
label: Instancia de @es
label: Instantie van @nl
label: Instanz von @de
range: Actant
sub property of: Semantic argument

Reference of
type: Property
type: ObjectProperty
comment: Indicate that a reference has a given sense
label: Referencia de @es
label: Referentie van @nl
label: Referenz von @de
label: Référence de @fr
range: Lexical sense
inverse of: Reference

Sense of
type: Property
type: ObjectProperty
comment: Indicate that a sense is realised by the given lexical entry
domain: Lexical sense
label: Acepción de @es
label: Signfication de @fr
label: Sinn von @de
label: Zin van @nl
range: Lexical entry
inverse of: Sense

Language
type: Property
type: DatatypeProperty
comment: The language of a given lexicon. This should be some ISO-639 string
domain: HasLanguage
label: Langue @fr
label: Lengua @es
label: Sprache @de
label: Taal @nl
range: string

Leaf
type: Property
type: ObjectProperty
comment: Denotes the component referred to by the lex (pre-terminal) of the phrase structure
domain: Node
label: Blad @nl
label: Blatt @de
label: Feuille @fr
label: Hoja @es
range: Phrase element

Lexical form
type: Property
type: InverseFunctionalProperty
type: ObjectProperty
comment: Denotes a written representation of a lexical entry
domain: Lexical entry
label: Forma léxica @es
label: Forme lexicale @fr
label: Lexikaal vorm @nl
label: Lexikalische Form @de
range: Form

Lexical variant
type: Property
type: ObjectProperty
comment: Indicates a non-semantic relationship between two lexical entries. E.g., a term is derived from another term, such as "lexical" and "lexicalize"
domain: Lexical entry
label: Lexikaal variant @nl
label: Lexikalische Variante @de
label: Variante lexicale @fr
label: Variante léxica @es
range: Lexical entry

Marcador
type: Property
type: ObjectProperty
comment: Denotes the marker of a semantic argument. This should generally either be a semantic property i.e., case or another lexical entry e.g., a preposition or particle
domain: Actant
label: Marker
label: Marqueur @fr
label: Merker @nl
label: маркер @ru
range: Syntactic role marker

Narrower
type: Property
type: ObjectProperty
comment: Denotes that one sense is narrower than another. From a lexical point of view this means replacing one lexical entry with another specializes the meaning of the phrase. From an ontological point of view this property makes not strong assertions. From a mapping point of view if the broader sense applies the narrower sense must also
domain: Lexical sense
label: Enger @de
label: Más estrecho @es
label: Plus restreint @fr
range: Lexical sense
sub property of: Sense relation

Next transform
type: Property
type: ObjectProperty
domain: Morphological Transform
label: Folgende Transformation @de
label: Transformación siguiente @es
label: Transformation suivante @fr
label: Volgende transformatie @nl
range: Morphological Transform

Object of property
type: Property
type: ObjectProperty
comment: Indicates the semantic argument which represents the objects (ranges) of the property referred to by this sense
domain: Lexical sense
label: Complemento de la propiedad @es
label: Complément de la propiété @fr
label: Object van predikaat @nl
label: Objekt von Prädikat @de
range: Actant
sub property of: Semantic argument

Opcional
type: Property
type: DatatypeProperty
comment: Denotes that the syntactic argument is optional (may be omitted)
domain: Actant
label: Optional
label: Optionele @nl
label: Optionnel @fr
range: boolean

Other form
type: Property
type: ObjectProperty
comment: A non-preferred ("non-dictionary") representation of a lexical entry. This should be variant that is either a morphological variant, an abbreviation, short form or acronym
domain: Lexical entry
label: Andere Form @de
label: Andere vorm @nl
label: Autre forme @fr
label: Otra forma @es
range: Form
sub property of: Lexical form

Pattern
type: Property
type: ObjectProperty
domain: HasPattern
label: Muster @de
label: Patron @fr
label: Patroon @nl
label: Patrón @es
label: Шаблон @ru
range: Morphological pattern

Phrase root
type: Property
type: ObjectProperty
comment: Indicates the head node of a phrase structure or dependency parse graph
domain: Lexical entry
label: Base de la syntagme @fr
label: Phrasewurzel @de
label: Raíz del sintagma @es
label: Zinsdeel wortel @nl
range: Node

Preferred reference of
type: Property
type: ObjectProperty
comment: The sense of the preferred lexicalization of a given ontology entity
label: Bevorzugte Referenz von @de
label: Referencia preferida de @es
label: Référence préféré de @fr
label: Voorkeursreferentie van @nl
range: Lexical sense
sub property of: Reference of

Lexical property
type: Property
type: ObjectProperty
comment: Denotes a lexical property of a lexical entry, form, component or MWE node. For the lexical entry this is assumed to be static properties e.g., part of speech and gender and for the others this is assumed to be specific properties e.g., case, number
domain: LemonElement
label: Lexikaal predikaat @nl
label: Lexikalische Prädikat @de
label: Propiedad léxica @es
label: Propiété lexicale @fr
range: Property Value

Property domain
type: Property
type: ObjectProperty
comment: Indicates a restrictions on the domain of the property. That is, this sense only applies if the property the sense refers to has a subject in the class referred to by this property
domain: Lexical sense
label: Domein van het predikaat @nl
label: Dominio de la propiedad @es
label: Ensemble de la propiété @fr
label: Prädikatsbereich @de
sub property of: Condition

Property range
type: Property
type: ObjectProperty
comment: Indicates a restrictions on the range of the property. That is, this sense only applies if the property the sense refers to has a object in the class referred to by this property
domain: Lexical sense
label: Bereik van het predikaat @nl
label: Image de la propiété @fr
label: Prädikatszielmenge @de
label: Rango de la propiedad @es
sub property of: Condition

Reference
type: Property
type: FunctionalProperty
type: ObjectProperty
comment: A reference to an external resource
domain: Lexical sense
label: Referencia @es
label: Referentie @nl
label: Referenz @de
label: Référence @fr

Representation
type: Property
type: DatatypeProperty
comment: A realisation of a given form
domain: Form
label: Darstellung @de
label: Representación @es
label: Représentation @fr
label: Voorstelling @nl
range: string

Rule
type: Property
type: DatatypeProperty
domain: Morphological Transform
label: Regel @de
label: Regla @es
label: Règle @fr
range: string

Semantic argument
type: Property
type: ObjectProperty
comment: Denotes a semantic argument slot of a semantic unit
domain: Lexical sense
label: Actant sémantique @fr
label: Argumento semántico @es
label: Semantisch argument @nl
label: Semantische Argument @de
range: Actant

Sense
type: Property
type: ObjectProperty
comment: Indicates the sense of a lexical entry
domain: Lexical entry
label: Acepción @es
label: Signification @fr
label: Sinn @de
label: Zin @nl
range: Lexical sense

Sense relation
type: Property
type: ObjectProperty
comment: Denotes a relationship between senses
domain: Lexical sense
label: Relación de Acepción @es
label: Relation de Signification @fr
label: Sinn-Relation @de
label: Zin relatie @nl
range: Lexical sense

Afscheider
type: Property
type: DatatypeProperty
comment: Indicates the graphical element used to seperate the subnodes of this phrase structure. It is generally recommended that you use a string value with the language tag used to indicate script, (i.e., using ISO-15924 codes, such as "Latn"), as orthographic features may change with script.
domain: Node
label: Separador @es
label: Separator
label: Séparateur @fr
range: string

Subject of property
type: Property
type: ObjectProperty
comment: Indicates the semantic argument which represents the subjects (domain) of the property referred to by this sense
domain: Lexical sense
label: Onderwerp van predikaat @nl
label: Subjekt von Prädikat @de
label: Sujet de la propiété @fr
label: Sujeto de la propiedad @es
range: Actant
sub property of: Semantic argument

Subsense
type: Property
type: ObjectProperty
comment: Indicates that the relation between a compound sense and its atomic subsenses
domain: Lexical sense
label: Deel van de zin @nl
label: Parte del acepción @es
label: Signification composante @fr
label: Teil des Sinnes @de
range: Lexical sense

Syntactic argument
type: Property
type: ObjectProperty
comment: Indicates a slot in a syntactic frame
domain: Frame
label: Actant syntaxique @fr
label: Argumento sintáctico @es
label: Syntactisch argument @nl
label: Syntactische Argument @de
range: Actant

Syntactic behavior
type: Property
type: ObjectProperty
comment: Indicates a syntactic behavior of a lexical entry
domain: Lexical entry
label: Conduite syntaxique @fr
label: Funcionamiento sintáctico @es
label: Syntactisch optreden @nl
label: Syntactische Verhalten @de
range: Frame

Topic
type: Property
type: ObjectProperty
comment: Indicates the topic of the overrall lexicon, this is property is sometimes called "subject field". Note that in addition to the topic of a lexicon each lexical entry may belong to a given domain, this can be modelled as equal or not equal to the topic of the associated lexicon
domain: Class
  union of: Lexical entry
  union of: Lexicon
label: Tema @es
label: Thema @de
label: Thème @fr
range: Lexical Topic

Transform
type: Property
type: ObjectProperty
domain: Morphological pattern
label: Transformación @es
label: Transformatie @nl
label: Transformation @de
range: Morphological Transform

Tree
type: Property
type: ObjectProperty
label: Arbre @fr
label: Baum @de
label: Boom @nl
label: Árbol @es

Value
type: Property
type: DatatypeProperty
comment: This indicates the value of a pseudo-data node. An example of this is definition where the value would generally be a string but it would not be possible to add further annotations, such as source or creation date.
label: Valeur @fr
label: Valor @es
label: Waarde @nl
label: Wert @de

Written representation
type: Property
type: DatatypeProperty
comment: Gives the written representation of a given form
domain: Form
label: Representación escrita @es
label: Représentation écrite @fr
label: Schriftelijke voorstelling @nl
label: Schriftliche Darstellung @de
range: string
sub property of: Representation