Subdivision of use
type: DatatypeProperty
comment: Dokumentierte geographische Region, in der das Merkmal/ die Merkmalsgruppe verwendet wird
comment: Documented geographical region of use of the group of properties
domain: Group of properties
domain: Property
label: Unterteilung der Verwendung
range: string
sub property of: topDataProperty
scope note: PA025/GA020
Code: PA025/GA020

has property group reference
type: ObjectProperty
comment: Fuegt eine Merkmalsgruppe (oberstes in der Hierarchie) zu einer isoprops:ReferenceDocument hinzu
comment: Attaches a property group reference to a isoprops:ReferenceDocument
domain: ReferenceDocument
label: hat Merkmalsgruppenreferenz
range: Group of properties
sub property of: distribution
sub property of: topObjectProperty

Name in language N
type: DatatypeProperty
comment: Liste von Paaren (Name des Merkmals und Sprache) Dieses Attribut kann verwendet werden, um Synonyme fuer verschiedene Domaenen hinzuzufuegen
comment: List of pairs (property name and language) This attribute can be used to add synonyms for different domains
domain: Property
domain: Group of properties
label: Name in Sprache N
range: langString
sub property of: topDataProperty
scope note: PA016/GA016
Code: PA016/GA016

Boundary value
type: ObjectProperty
comment: Einzelnes Grenzwertintervall
comment: Single Boundary value interval
domain: Boundary values list
label: Grenzwert
range: Minimum Boundary Limit
sub property of: topObjectProperty
scope note: PA040
Code: PA040

Definition of in language N
type: DatatypeProperty
comment: List of pairs (definition of the property/group of properties, language)
comment: Liste von Paaren (Definition des Merkmals/der Merkmalsgruppe, Sprache)
domain: Group of properties
domain: Property
label: Definition in Sprache N
range: langString
sub property of: topDataProperty
scope note: PA016/GA016
Code: PA016/GA016

Parameters of the dynamic property
type: ObjectProperty
comment: Liste von GUIDs von Merkmalen, welche Parameter der Funktion fuer ein dynamisches Merkmal sind
comment: List of GUIDS of properties which are parameters of the function for a dynamic property
domain: Property
label: Parameter des dynamischen Merkmals
range: Property
sub property of: topObjectProperty
scope note: PA032
Code: GA032
Code: PA032

Date of revision
type: DatatypeProperty
comment: Datum der Ueberarbeitung
comment: Date of revision
domain: Property
domain: Group of properties
label: Datum der Ueberarbeitung
range: dateTime
sub property of: topDataProperty
scope note: PA006/GA006
Code: PA006/GA006

Revision number
type: DatatypeProperty
comment: Diese Nummer der ueberarbeitung ermoeglicht die Verfolgung kleinerer aenderungen, z. B. neue uebersetzung, Korrekturen von Tippfehlern: wenn sich die Versionsnummer aendert, beginnt die Nummer der ueberarbeitung wieder bei 1. Sachverstaendige entscheiden, ob eine neue Nummer der ueberarbeitung angewendet werden kann oder ob eine neue ueberarbeitung erforderlich ist.
comment: This revision number allows tracking of minor changes e.g. new translation, changes of typos: if the version number changes, the revision number starts again at 1 Experts decide if a new revision number can be applied or if a new revision is needed
domain: Group of properties
domain: Property
label: Nummer der ueberarbeitung
range: integer
sub property of: topDataProperty
scope note: PA010/GA010
Code: PA010/GA010

Example in language N
type: DatatypeProperty
comment: Liste von Paaren (Beispiel des Merkmals, Sprache)
comment: List of pairs (example of the property, language)
domain: Property
label: Beispiel in Sprache N
range: langString
sub property of: topDataProperty
scope note: PA019
Code: PA019

ISO 23386 Property Ontology (ISOProps)
type: Ontology
comment: The ISO Property (ISOProps) ontology maps the data model of the ISO 23386 for the describing, creating, and maintenance of properties in interconnected data dictionaries. The namespace for ISOProps terms is [https://w3id.org/isoprops](https://w3id.org/isoprops) The preferred prefix for the ISOProps namespace is `isoprops`. ## Ontology Overview ![IDDO Ontology](Ontology_Overview.png "Ontology") ## Assigning an ISOProps Property to a Feature of Interest ![Property_Assignment](Property_Assignment.png "Property_Assignment") ## Relation between DCAT vocabulary and the ISOProps ontology ![DataCatalog_Overview](DataCatalog_Overview.png "DataCatalog_Overview")
created: 2019-01-01
creator: Philipp Hagedorn
  type: Person
  member of: Ruhr University Bochum
creator: Sven Zentgraf
  type: Person
  member of: Ruhr University Bochum
issued: 2021-12-06
license: https://creativecommons.org/licenses/by/4.0/
modified: 2024-04-24
publisher: Chair of Computing in Engineering, Ruhr University Bochum
  type: Organization
  parent organization: Ruhr University Bochum, Germany
source: LDAC2024 Camera 8.pdf
preferred namespace prefix: isoprops
preferred namespace uri: https://w3id.org/isoprops#
imports: dt
prior version: iddo
version info: v2.1
history note: v2.1: renamed from IDDO to ISOProps v2.0: update v0.3: dcat usage update v0.2: ontology update v0.1: initial ontology for BIMSTRUCT project
code repository: isoprops

Physical quantity
type: ObjectProperty
comment: List of pairs (physical quantity | language) Physical quantities are expressed in International System (SI) units Non-physical quantities such as text are expressed with the value "without" --> http://qudt.org/vocab/quantitykind/Dimensionless This is equivalent to a measure in ISO 16739-1 and ISO 10303 Only one physical quantity can be attached to a property. This attribute is used to provide the quantity in plain text with all the needed translations
comment: Liste von Paaren (physikalische Groesse | Sprache) Physikalische Groessen werden in Einheiten des Internationalen Einheitensystems (SI) angegeben nicht physikalische Groessen wie z. B. Text werden mit dem Wert "ohne" angegeben --> http://qudt.org/vocab/quantitykind/Dimensionless dies ist gleichbedeutend mit einem Mass in ISO 16739-1 und ISO 10303 nur eine physikalische Groesse kann einem Merkmal zugeordnet werden. Dieses Attribut wird ver-wendet, um die Groesse in Klartext mit allen benoetigten ueberset-zungen bereitzustellen.
domain: Property
label: Physikalische Groesse
range: QuantityKind
sub property of: topObjectProperty
scope note: PA027
Code: PA027

Date of activation
type: DatatypeProperty
comment: Date after when the property can be used
comment: Datum, nach dem das Merkmal verwendet werden kann
domain: Group of properties
domain: Property
label: Datum der Aktivierung
range: dateTime
sub property of: topDataProperty
scope note: PA04/GA04
Code: PA004/GA004

Connected properties
type: ObjectProperty
comment: List of the globally unique identifier of the connected properties (attribute PA001); the value of one property is related to the values of the other ones. For example, a sound absorption coefficient is given for a specific frequency, in this case sound absorption and frequency are connected properties
comment: Liste der global eindeutigen Bezeichner der verbundenen Merkmale (Attribut PA001); der Wert eines Merkmals steht zu den Werten der anderen in einer Beziehung. Beispielsweise ist ein Schallabsorptionsgrad fuer eine bestimmte Frequenz gegeben, in diesem Fall sind Schallabsorp-tionsgrad und Frequenz ver-bundene Merkmale.
domain: Property
label: Verbundene Merkmale
range: Property
sub property of: topObjectProperty
scope note: PA020
Code: PA020

has External Dictionary Reference
type: ObjectProperty
comment: List of pairs (property internal identifier, corresponding data dictionary identifier) This attribute should be used for compatibility between already existing properties
comment: Liste von Paaren (interner Merk-malsbezeichner, entsprechender Datenkatalog-Bezeichner) dieses Attribut sollte fuer die Vertraeglichkeit zwischen bereits vorhandenen Merkmalen verwendet werden
domain: Group of properties
domain: Property
label: hat externe Dictionary Referenz
range: External Dictionary Reference
sub property of: topObjectProperty
scope note: GA014
scope note: PA014
Code: PA014
Code: GA014

Maximum Boundary Limit
type: Class
comment: Grenzwertintervall bestehend aus der oberen(maxValue) Intervallgrenze
comment: Boundary limit interval consisting of the the upper (maxValue) interval boundary
label: Oberer Grenzwert
subclass of: PropertyValue
subclass of: Thing
subclass of: Restriction
  cardinality: 1
  on property: value
subclass of: Restriction
  cardinality: 1
  on property: has unit
subclass of: Restriction
  on data range: boolean
  on property: inclusive
  qualified cardinality: 1
scope note: PA040
Code: PA040

has property
type: ObjectProperty
comment: Fuegt ein Merkmal zu einem Feature of Interest (FOI) hinzu
comment: Attaches a property to a feature of interest (FOI)
label: hat Merkmal
range: Assigned property
sub property of: topObjectProperty

Assigned property
type: Class
comment: Represents the assignment of a property and a property state to a feature of interest (FOI).
comment: Repraesentiert die Zweisung eines Merkmals und einer Merkmalszustandes an ein Feature of Interest (FOI)
label: Zugewiesenes Merkmal
subclass of: Property
subclass of: Restriction
  min cardinality: 1
  on property: hasPropertyState
subclass of: Restriction
  cardinality: 1
  on property: has Property Reference

Symbols of the property in a given property group
type: ObjectProperty
comment: Liste von Paaren (Symbol des Merkmals, global eindeutiger Bezeichner der Merkmalsgruppe (Attribut GA001))
comment: List of pairs (symbol of the property, globally unique identifier of the group of properties (attribute GA001))
domain: Property
label: Symbole des Merkmals in einer gegebenen Merk-malsgruppe
range: Symbol of the property in a given property group
sub property of: topObjectProperty
scope note: PA022
Code: PA022

Globally Unique Identifier (GUID)
type: DatatypeProperty
comment: Unique identifier generated using the algorithm denoted in RFC 4122
comment: Eindeutiger Bezeichner, der mit dem in RFC 4122 beschriebenen Algorithmus erzeugt wird
domain: Group of properties
domain: Property
label: Global eindeutiger Bezeichner (GUID)
range: string
sub property of: topDataProperty
scope note: PA001/GA001
Code: PA001/GA001

Method of measurement
type: DatatypeProperty
comment: Beurteilung von Bauprodukten, um ihre Tauglichkeit entsprechend den Anforderungen in harmonisierten technischen Spezifikationen sicherzustellen
comment: Evaluation of construction products to ensure their fitness according to requirements in harmonised technical specifications
domain: Property
label: Messverfahren
range: string
sub property of: topDataProperty
scope note: PA029
Code: PA029

Given group of properties
type: ObjectProperty
comment: Globally unique identifier of a group of properties (attribute GA001) for the symbol assigned to the property.
comment: Global eindeutiger Bezeichner einer Merkmalsgruppe (Attribut GA001) fuer das dem Merkmal zugeordnetem Symbol
domain: Property
label: Gegebene Merkmalsgruppe
range: Group of properties
sub property of: topObjectProperty
scope note: PA022
Code: PA022

Dictionary subset
type: Class
comment: Definiert eine Teilmenge oder Untergruppierung eines Datenkatalogs
comment: Defines a subset or subgrouping of a data catalog
label: Teilmenge des Datenkatalogs
subclass of: Dataset
subclass of: Restriction
  cardinality: 1
  on property: accessURL
subclass of: Restriction
  cardinality: 1
  on property: has relation to a reference document
subclass of: Restriction
  cardinality: 1
  on property: description
subclass of: Restriction
  cardinality: 1
  on property: title

has relation to a reference document
type: ObjectProperty
domain: Dictionary subset
label: hat den Verweis auf ein Referenzdokument
range: Reference document
sub property of: distribution

Encoding
type: DatatypeProperty
comment: The encoding is set according to Name of encoding standard of IANA, RFC 2978
comment: Die Verschluesselung wird nach Name der Codierungsnorm von IANA, RFC 2978 festgelegt
domain: Text format item
label: Kodierung
range: string
sub property of: topDataProperty
scope note: PA038
Code: PA038

Digital format item
type: Class
comment: Paar fuer den digitalen Texttyp (Praezision, Masseinheit) Praezision ist die Anzahl signifikanter Stellen
comment: Pair for digital text type (precision, unit) Precision is the number of significant digits
label: Digitales Format-Item
subclass of: Thing
subclass of: Restriction
  on class: Unit
  on property: has unit
  qualified cardinality: 1
subclass of: Restriction
  on data range: decimal
  on property: Tolerance
  qualified cardinality: 1
scope note: PA037
Code: PA037

Status
type: DatatypeProperty
comment: Status of the property during its life cycle
comment: Status des Merkmals waehrend seines Lebenszyklus
domain: Group of properties
domain: Property
range: Datatype
  one of: active
  one of: inactive
sub property of: topDataProperty
example: active
example: inactive
scope note: PA002/GA002
Code: PA002/GA002

Date of creation
type: DatatypeProperty
comment: Datum der Validierung der An-frage zur Erstellung des Merkmals durch Sachverstaendige
comment: Date of validation of the property creation request by experts
domain: Group of properties
domain: Property
label: Datum der Erstellung
range: dateTime
sub property of: topDataProperty
scope note: PA003/GA003
Code: PA003/GA003

List of replacing properties
type: ObjectProperty
comment: Globally unique identifier (attribute PA001) of the replacing property (or properties)
comment: global eindeutiger Bezeichner (Attribut PA001) des ersetzenden Merkmals (oder der Merkmale)
domain: Property
label: Liste ersetzender Merkmale
range: Property
sub property of: topObjectProperty
inverse of: List of replaced properties
scope note: PA012
Code: PA012

Group(s) of properties
type: ObjectProperty
comment: List of globally unique identifiers of groups of properties (attribute GA001) to which the property is attached
comment: Liste von global eindeutigen Bezeichnern von Merkmalsgruppen (Attribut GA001), denen das Merkmal angehoert
domain: Property
label: Merkmalsgruppe(n)
range: Group of properties
sub property of: topObjectProperty
scope note: PA021
Code: PA021

Digital format
type: ObjectProperty
comment: Pair for digital text type (precision, unit) Precision is the number of significant digits
comment: Paar fuer den digitalen Texttyp (Praezision, Masseinheit) Praezision ist die Anzahl signifikanter Stellen
domain: Property
label: Digitales Format
range: Digital format item
sub property of: topObjectProperty
scope note: PA037
Code: PA037

Boundary values
type: ObjectProperty
comment: Paar (Liste von Grenzwert-Intervallen moeglicher Werte fuer das Merkmal, Einheit)
comment: Pair (list of boundary intervals of possible values for the property, unit)
domain: Property
label: Grenzwerte
range: Boundary values list
sub property of: topObjectProperty
scope note: PA040
Code: PA040

List of possible values in language N
type: ObjectProperty
comment: Liste von Paaren (moeglicher Wert fuer das Merkmal und Sprache) Werte koennen String oder Zahlen sein
comment: List of pairs (possible value for the property and language) Values can be string or numbers
domain: Property
label: Liste moeglicher Werte in Sprache N
range: Possible value in language N
sub property of: topObjectProperty
scope note: PA039
Code: PA039

has external dictionary
type: ObjectProperty
sub property of: topObjectProperty
equivalent property: hasExternalDictionary

Property
type: Class
comment: Inhaerente oder erworbene Eigenschaft eines Datenelements
comment: Inherent or acquired feature of an item
label: Merkmal
subclass of: LibraryComponent
subclass of: Thing
subclass of: Restriction
  min qualified cardinality: 0
  on data range: decimal
  on property: Tolerance
subclass of: Restriction
  min qualified cardinality: 1
  on data range: string
  on property: Definition of in language N
subclass of: Restriction
  min qualified cardinality: 0
  on data range: string
  on property: Method of measurement
subclass of: Restriction
  min qualified cardinality: 0
  on data range: string
  on property: Description in language N
subclass of: Restriction
  on data range: dateTime
  on property: Date of creation
  qualified cardinality: 1
subclass of: Restriction
  on data range: Datatype
    one of: yes
    one of: no
  on property: Dynamic Property
  qualified cardinality: 1
subclass of: Restriction
  min qualified cardinality: 0
  on data range: string
  on property: Visual representation
subclass of: Restriction
  on data range: Datatype
    one of: BOOLEAN
    one of: INTEGER
    one of: RATIONAL
    one of: REAL
    one of: COMPLEX
    one of: STRING
    one of: DATETIME
  on property: Data type
  qualified cardinality: 1
subclass of: Restriction
  min qualified cardinality: 0
  on class: Property
  on property: Connected properties
subclass of: Restriction
  on data range: string
  on property: Globally Unique Identifier (GUID)
  qualified cardinality: 1
subclass of: Restriction
  on data range: integer
  on property: Revision number
  qualified cardinality: 1
subclass of: Restriction
  min qualified cardinality: 1
  on data range: string
  on property: Name in language N
subclass of: Restriction
  min qualified cardinality: 0
  on data range: dateTime
  on property: Date of last change
subclass of: Restriction
  min qualified cardinality: 0
  on data range: string
  on property: Example in language N
subclass of: Restriction
  min qualified cardinality: 1
  on data range: string
  on property: Country of use
subclass of: Restriction
  min qualified cardinality: 0
  on data range: string
  on property: Deprecation explanation
subclass of: Restriction
  on data range: Datatype
    one of: active
    one of: inactive
  on property: Status
  qualified cardinality: 1
subclass of: Restriction
  min qualified cardinality: 0
  on data range: dateTime
  on property: Date of deactivation
subclass of: Restriction
  cardinality: 1
  on property: Creator's language
subclass of: Restriction
  min qualified cardinality: 1
  on class: Group of properties
  on property: Group(s) of properties
subclass of: Restriction
  min qualified cardinality: 0
  on class: Text format item
  on property: Text format
subclass of: Restriction
  min qualified cardinality: 0
  on data range: string
  on property: Country of origin
subclass of: Restriction
  min qualified cardinality: 0
  on class: Possible value in language N
  on property: List of possible values in language N
subclass of: Restriction
  min qualified cardinality: 0
  on class: Property
  on property: List of replacing properties
subclass of: Restriction
  min qualified cardinality: 0
  on class: External Dictionary Reference
  on property: has External Dictionary Reference
subclass of: Restriction
  min qualified cardinality: 0
  on class: Defining values list
  on property: Defining values
subclass of: Restriction
  on class: Boundary values list
  on property: Boundary values
  qualified cardinality: 1
subclass of: Restriction
  on data range: integer
  on property: Version number
  qualified cardinality: 1
subclass of: Restriction
  on data range: dateTime
  on property: Date of version
  qualified cardinality: 1
subclass of: Restriction
  min qualified cardinality: 0
  on data range: string
  on property: Subdivision of use
subclass of: Restriction
  on data range: dateTime
  on property: Date of revision
  qualified cardinality: 1
subclass of: Restriction
  min qualified cardinality: 0
  on data range: dateTime
  on property: Date of activation
subclass of: Restriction
  min qualified cardinality: 0
  on data range: string
  on property: List of possible values in language N
subclass of: Restriction
  min qualified cardinality: 0
  on class: Symbol of the property in a given property group
  on property: Symbols of the property in a given property group
subclass of: Restriction
  min qualified cardinality: 0
  on class: Property
  on property: List of replaced properties
subclass of: Restriction
  min qualified cardinality: 0
  on class: Digital format item
  on property: Digital format
subclass of: Restriction
  max qualified cardinality: 1
  on data range: string
  on property: Deprecation explanation
subclass of: Restriction
  min qualified cardinality: 0
  on class: Property
  on property: Parameters of the dynamic property
subclass of: Restriction
  max qualified cardinality: 1
  on data range: string
  on property: Country of origin
subclass of: Restriction
  min qualified cardinality: 1
  on data range: QuantityKind
  on property: Physical quantity
subclass of: Restriction
  min qualified cardinality: 0
  on data range: string
  on property: Names of the defining values
subclass of: Restriction
  min qualified cardinality: 1
  on class: Unit
  on property: has unit
equivalent class: Property

List of replacing groups of properties
type: ObjectProperty
comment: Liste von globalen Bezeichnern fuer die ersetzenden Merkmalsgruppen
comment: List of globally unique identifiers of the replacing groups of properties
domain: Group of properties
label: Liste ersetzender Merkmalsgruppen
range: Group of properties
sub property of: topObjectProperty
inverse of: List of replaced groups of properties
scope note: GA012
Code: GA012

Tolerance
type: DatatypeProperty
comment: Fuer numerische Werte; der Gesamtbetrag, um den eine be-stimmte Einheit schwanken darf; sie ist die Differenz zwischen dem Hoechstwert und dem Mindestwert fuer die Einheit
comment: For numerical values; the total amount that a specific unit is permitted to vary; it is the difference between the maximum and the minimum limits for the unit
domain: Property
label: Toleranz
range: decimal
sub property of: topDataProperty
scope note: PA036
Code: PA036

Text format item
type: Class
comment: Paar fuer den Texttyp (Verschluesselung, Anzahl der Zeichen) die Verschluesselung wird nach Name der Codierungsnorm von IANA, RFC 2978 festgelegt
comment: Pair for text type (encoding, number of characters) The encoding is set according to Name of encoding standard of IANA, RFC 2978
label: Textformat-Item
subclass of: Thing
subclass of: Restriction
  on data range: string
  on property: Encoding
  qualified cardinality: 1
subclass of: Restriction
  on data range: integer
  on property: Number of Characters
  qualified cardinality: 1
scope note: PA038
Code: PA038

Parent group of properties
type: ObjectProperty
comment: Ermoeglicht die Ver-knuepfung einer Unter-gruppe mit einer ueber-geordneten Gruppe ueber ihre global ein-deutigen Bezeichner (Attribut GA001) jedes einer Gruppe zugehoerige Merkmal wird von der/den Untergruppe(n) uebernommen
comment: Enables a sub-group to be linked to a parent group via their globally unique identifiers (attribute GA001) Any property attached to a group is inherited by the sub-group(s)
domain: Group of properties
label: uebergeordnete Merkmalsgruppe
range: Group of properties
sub property of: topObjectProperty
scope note: GA023
Code: GA023

Possible value in language N
type: Class
comment: Possible value for the property and language Values can be string or numbers
comment: Moeglicher Wert fuer das Merkmal und Sprache Werte koennen String oder Zahlen sein
label: Liste moeglicher Werte in Sprache N
subclass of: Thing
subclass of: PropertyValue
subclass of: Restriction
  cardinality: 1
  on property: value
equivalent class: PredefinedValuesList
scope note: PA039
Code: PA039

Group of properties
type: Class
comment: Collection enabling the properties to be prearranged or organized
comment: Sammlung, die es ermoeglicht, die Merkmale vorauszuplanen oder zu organisieren
label: Merkmalsgruppe
subclass of: Thing
subclass of: LibraryComponent
subclass of: Restriction
  min qualified cardinality: 1
  on data range: string
  on property: Name in language N
subclass of: Restriction
  min qualified cardinality: 1
  on data range: string
  on property: Definition of in language N
subclass of: Restriction
  on data range: string
  on property: Country of origin
  qualified cardinality: 1
subclass of: Restriction
  min qualified cardinality: 1
  on data range: string
  on property: Country of use
subclass of: Restriction
  on data range: integer
  on property: Version number
  qualified cardinality: 1
subclass of: Restriction
  on data range: dateTime
  on property: Date of version
  qualified cardinality: 1
subclass of: Restriction
  min qualified cardinality: 0
  on data range: dateTime
  on property: Date of activation
subclass of: Restriction
  min qualified cardinality: 0
  on class: External Dictionary Reference
  on property: has External Dictionary Reference
subclass of: Restriction
  on data range: integer
  on property: Revision number
  qualified cardinality: 1
subclass of: Restriction
  on data range: dateTime
  on property: Date of revision
  qualified cardinality: 1
subclass of: Restriction
  min qualified cardinality: 0
  on data range: string
  on property: Deprecation explanation
subclass of: Restriction
  min qualified cardinality: 0
  on data range: string
  on property: Subdivision of use
subclass of: Restriction
  on data range: dateTime
  on property: Date of creation
  qualified cardinality: 1
subclass of: Restriction
  min qualified cardinality: 0
  on data range: decimal
  on property: Tolerance
subclass of: Restriction
  on data range: string
  on property: Globally Unique Identifier (GUID)
  qualified cardinality: 1
subclass of: Restriction
  min qualified cardinality: 1
  on data range: string
  on property: Visual representation
subclass of: Restriction
  min qualified cardinality: 0
  on data range: dateTime
  on property: Date of last change
subclass of: Restriction
  min qualified cardinality: 0
  on class: Group of properties
  on property: List of replaced groups of properties
subclass of: Restriction
  min qualified cardinality: 0
  on class: Group of properties
  on property: List of replacing groups of properties
subclass of: Restriction
  max qualified cardinality: 1
  on data range: string
  on property: Deprecation explanation
subclass of: Restriction
  on data range: Datatype
    one of: Alternative use
    one of: Class
    one of: Composed property
    one of: Domain
    one of: Reference document
  on property: Category of group of properties
  qualified cardinality: 1
subclass of: Restriction
  min qualified cardinality: 0
  on class: Group of properties
  on property: Parent group of properties
subclass of: Restriction
  max qualified cardinality: 1
  on class: Group of properties
  on property: Parent group of properties
subclass of: Restriction
  min qualified cardinality: 0
  on data range: dateTime
  on property: Date of deactivation
subclass of: Restriction
  on data range: string
  on data range: Datatype
    one of: active
    one of: inactive
  on property: Status
  qualified cardinality: 1
subclass of: Restriction
  on data range: string
  on property: Creator's language
  qualified cardinality: 1

inclusive
type: DatatypeProperty
domain: Minimum Boundary Limit
domain: Maximum Boundary Limit
range: boolean
sub property of: topDataProperty

Deprecation explanation
type: DatatypeProperty
comment: Sentence explaining the reason of the deprecation, which can explain how to convert values to conform to the new property/group of properties; this explanation has to be written in international English (EN)
comment: Satz, der den Grund fuer die Ablehnung erlaeutert, der erklaeren kann, wie Werte umzurechnen sind, damit sie dem neuen Merkmal/der neuen Merkmalsgruppe entsprechen; diese Erlaeuterung muss in internationalem Englisch (EN) geschrieben werden
domain: Group of properties
domain: Property
label: Erlaeuterung fuer die Ablehnung
range: langString
sub property of: topDataProperty
scope note: PA013/GA013
Code: PA013/GA013

has dictionary subset
type: ObjectProperty
domain: Data dictionary
label: hat Teilmenge eines Katalogs
range: Dictionary subset
sub property of: dataset

Data type
type: DatatypeProperty
comment: Format fuer die Angabe des Wertes des Merkmals dies kann aus einer Soft-ware-Perspektive als Speiche-rungsart verstanden werden im Falle eines dynamischen Merkmals ist der Wert dieses Attributs der Datentyp des Er-gebnisses der Berechnung mit der Gleichung
comment: Format for expressing the value of the property This can be understood as the storage type from a software perspective In case of a dynamic property the value of this attribute is the datatype of the result of the calculation by the formula
domain: Property
label: Datentyp (GUID)
range: string
sub property of: topDataProperty
scope note: PA030
Code: PA030

List of replaced groups of properties
type: ObjectProperty
comment: Liste von globalen Bezeichnern fuer die ersetzten Merk-malsgruppen
comment: List of globally unique identifiers of the replaced groups of properties
domain: Group of properties
label: Liste ersetzter Merkmalsgruppen
range: Group of properties
sub property of: topObjectProperty
inverse of: List of replacing groups of properties
scope note: GA011
Code: GA011

Text format
type: ObjectProperty
comment: Paar fuer den Texttyp (Verschluesselung, Anzahl der Zeichen) die Verschluesselung wird nach Name der Codierungsnorm von IANA, RFC 2978 festgelegt
comment: Pair for text type (encoding, number of characters) The encoding is set according to Name of encoding standard of IANA, RFC 2978
domain: Property
label: Textformat
range: Text format item
sub property of: topObjectProperty
scope note: PA038
Code: PA038

Version number
type: DatatypeProperty
comment: This version number allows tracking of major changes. Experts decide if a new version number must be applied
comment: Diese Versionsnummer ermoeglicht die Verfolgung groesserer aenderungen. Sachverstaendige entscheiden, ob eine neue Ver-sionsnummer angewendet werden muss.
domain: Property
domain: Group of properties
label: Versionsnummer
range: integer
sub property of: topDataProperty
scope note: PA009/GA009
Code: PA009/GA009

Date of deactivation
type: DatatypeProperty
comment: Date of deactivation
comment: Datum der Deaktivierung
domain: Property
domain: Group of properties
label: Datum der Deaktivierung
range: dateTime
sub property of: topDataProperty
scope note: PA008/GA008
Code: PA008/GA008

External Dictionary Reference
type: Class
comment: Pair (property internal identifier, corresponding data dictionary identifier) This attribute should be used for compatibility between already existing properties
comment: Paar (interner Merkmalsbezeichner, entsprechender Datenkatalog-Bezeichner) Dieses Attribut sollte fuer die Vertraeglichkeit zwischen bereits vorhandenen Merkmalen verwendet werden
subclass of: Thing
subclass of: Restriction
  cardinality: 1
  on property: hasExternalDictionaryProperty
subclass of: Restriction
  cardinality: 1
  on property: hasExternalDictionary
equivalent class: ExternalDictionaryReference

Boundary values list
type: Class
comment: Pair (List of boundary intervals of possible values for the property, unit)
comment: Paar (Liste von Grenzwert-Intervallen moeglicher Werte fuer das Merkmal, Einheit)
label: Grenzwertliste
subclass of: Thing
subclass of: Restriction
  max qualified cardinality: 1
  on class: Maximum Boundary Limit
  on property: Boundary value
subclass of: Restriction
  max qualified cardinality: 1
  on class: Minimum Boundary Limit
  on property: Boundary value
scope note: PA040
Code: PA040

has external dictionary property
type: ObjectProperty
sub property of: topObjectProperty
equivalent property: hasExternalDictionaryProperty

Defining value
type: ObjectProperty
comment: Enthaelt einen definierenden Wert eines Arrays
comment: Contains a defining value of an array
domain: Defining values list
label: Definierender Wert
range: Defining value item
sub property of: topObjectProperty
scope note: PA035
Code: PA035

Date of last change
type: DatatypeProperty
comment: Datum der Validierung der letzten Aenderungsanfrage durch Sachverstaendige
comment: Date of validation of the last change request by experts
domain: Property
domain: Group of properties
label: Datum der letzten Aenderung
range: dateTime
sub property of: topDataProperty
scope note: PA005/GA005
Code: PA005/GA005

Creator's language
type: DatatypeProperty
comment: Satz, der den Grund fuer die Ab-lehnung erlaeutert, der erklaeren kann, wie Werte umzurechnen sind, damit sie dem neuen Merkmal entsprechen; diese Er-laeuterung muss in internatio-nalem Englisch (EN) geschrieben werden
comment: Sentence explaining the reason of the deprecation, which can explain how to convert values to conform to the new property; this explanation has to be written in international English (EN)
domain: Property
domain: Group of properties
label: Erlaeuterung fuer die Ablehnung
range: string
sub property of: topDataProperty
scope note: PA015/GA015
Code: PA015/GA015

Names of the defining values
type: DatatypeProperty
comment: Im Falle eines Feldes liefert dieses Attribut die Namen der Spaltenkoepfe, festgelegt als Liste von Paaren (Name, Sprache)
comment: In case of an array, this attribute provides the names of the column headers defined as a list of pairs (name, language)
label: Name der definierenden Werte
range: langString
sub property of: topDataProperty
scope note: PA034
Code: PA034

Number of Characters
type: DatatypeProperty
comment: The encoding is set according to Name of encoding standard of IANA, RFC 2978
comment: Die Verschluesselung wird nach Name der Codierungsnorm von IANA, RFC 2978 festgelegt
domain: Text format item
label: Anzahl der Zeichen
range: integer
sub property of: topDataProperty
scope note: PA038
Code: PA038

Physical quantity
type: Class
comment: Liste von Paaren (physikalische Groesse | Sprache) Physikalische Groessen werden in Einheiten des Internationalen Einheitensystems (SI) angegeben nicht physikalische Groessen wie z. B. Text werden mit dem Wert "ohne" angegeben dies ist gleichbedeutend mit einem Mass in ISO 16739-1 und ISO 10303 nur eine physikalische Groesse kann einem Merkmal zugeordnet werden. Dieses Attribut wird ver-wendet, um die Groesse in Klartext mit allen benoetigten ueberset-zungen bereitzustellen.
comment: List of pairs (physical quantity | language) Physical quantities are expressed in International System (SI) units Non-physical quantities such as text are expressed with the value "without" This is equivalent to a measure in ISO 16739-1 and ISO 10303 Only one physical quantity can be attached to a property. This attribute is used to provide the quantity in plain text with all the needed translations
label: Physikalische Groesse
subclass of: LibraryComponent
equivalent class: QuantityKind

Reference document
type: Class
comment: Publikation, die hinzugezogen wird, um bestimmte Informationen zu finden, insbesondere in einer technischen oder wissenschaftlichen Domaene
comment: Publication that is consulted to find specific information, particularly in a technical or scientific domain
label: Referenzdokument
subclass of: Distribution
subclass of: Restriction
  cardinality: 1
  on property: has property group reference

Minimum Boundary Limit
type: Class
comment: Boundary limit interval consisting of the lower(minValue) interval boundary
comment: Grenzwertintervall bestehend aus der unteren(minValue) Intervallgrenze
label: Unterer Grenzwert
subclass of: PropertyValue
subclass of: Thing
subclass of: Restriction
  on data range: boolean
  on property: inclusive
  qualified cardinality: 1
subclass of: Restriction
  cardinality: 1
  on property: value
subclass of: Restriction
  cardinality: 1
  on property: has unit
scope note: PA040
Code: PA040

Date of version
type: DatatypeProperty
comment: Datum der Version
comment: Date of version
domain: Property
domain: Group of properties
label: Datum der Version
range: dateTime
sub property of: topDataProperty
scope note: PA007/GA007
Code: PA007/GA007

Category of group of properties
type: DatatypeProperty
comment: Specifies the category of the created property group
comment: Gibt die Kategorie der erstellten Merkmalsgruppe an
domain: Group of properties
label: Kategorie der Merkmalsgruppe
range: Datatype
  one of: Alternative use
  one of: Class
  one of: Composed property
  one of: Domain
  one of: Reference document
sub property of: topDataProperty
example: Composed property
example: Reference document
example: Alternative use
example: Domain
example: Class
scope note: GA022
Code: GA022

Tolerance
type: DatatypeProperty
comment: Precision is the number of significant digits
comment: Praezision ist die Anzahl signifi-kanter Stellen
domain: Digital format item
label: Toleranz
range: decimal
sub property of: topDataProperty
scope note: PA037
Code: PA037

Symbol of the property in a given property group
type: Class
comment: Pair (symbol of the property, globally unique identifier of the group of properties (attribute GA001))
comment: Paar (Symbol des Merkmals, global eindeutiger Bezeichner der Merkmalsgruppe (Attribut GA001))
label: Symbol des Merkmals in einer gegebenen Merkmalsgruppe
subclass of: Thing
subclass of: Restriction
  on class: Group of properties
  on property: Given group of properties
  qualified cardinality: 1
subclass of: Restriction
  on data range: string
  on property: Symbol
  qualified cardinality: 1
scope note: PA022
Code: PA022

Country of use
type: DatatypeProperty
comment: Country (group of countries, continent) in which the property is relevant for the market the stakeholders operate in
comment: Land (Gruppe von Laendern, Kon-tinent), in dem das Merkmal/die Merkmalsgruppe fuer den Markt, auf dem die Beteiligten arbeiten, relevant ist
domain: Group of properties
domain: Property
label: Land der Verwendung
range: string
sub property of: topDataProperty
scope note: PA024/GA019
Code: PA024/GA019

Defining value item
type: Class
comment: Contains a defining value of an array in the form of a literal
comment: Enthaelt einen definierenden Wert eines Arrays in Form eines Literals
label: Definierender Wert-Item
subclass of: Thing
subclass of: PropertyValue
subclass of: Restriction
  cardinality: 1
  on property: value
scope note: PA035
Code: PA035

Description in language N
type: DatatypeProperty
comment: Liste von Paaren (Beschreibung des Merkmals, Sprache)
comment: List of pairs (Description of the property, language)
domain: Property
label: Beschreibung in Sprache N
range: langString
sub property of: topDataProperty
scope note: PA019
Code: PA019

List of replaced properties
type: ObjectProperty
comment: Globally unique identifier of the replaced property (or properties)
comment: Global eindeutiger Bezeichner des ersetzten Merkmals (oder der Merkmale)
domain: Property
label: Liste ersetzter Merkmale
range: Property
sub property of: topObjectProperty
inverse of: List of replacing properties
scope note: PA011
Code: PA011

Data dictionary
type: Class
comment: Zentralisiertes Repository von Informationen ueber Daten, wie z. B. Bedeutung, Beziehungen zu anderen Daten, Ursprung, Verwendung und Format
comment: Centralized repository of information about data such as meaning, relationships to other data, origin, usage and format
label: Datenkatalog
subclass of: Catalog
subclass of: Restriction
  cardinality: 1
  on property: issued
subclass of: Restriction
  cardinality: 1
  on property: identifier
subclass of: Restriction
  cardinality: 1
  on property: publisher
subclass of: Restriction
  cardinality: 1
  on property: title
subclass of: Restriction
  min cardinality: 1
  on property: has dictionary subset
subclass of: Restriction
  cardinality: 1
  on property: type
subclass of: Restriction
  cardinality: 1
  on property: description

Defining values list
type: Class
comment: Im Falle eines Feldes liefert dieses Attribut die definierenden Werte, sofern zutreffend, der Datentyp wird durch das Attribut PA030 angegeben
comment: In case of an array, this attribute provides the defining values when applicable, the datatype is given by the attribute PA030
label: Liste definierender Werte
subclass of: Thing
subclass of: Restriction
  min cardinality: 1
  on property: Defining value item
scope note: PA035
Code: PA035

Visual representation
type: DatatypeProperty
comment: Bildliche Darstellung des Merkmals durch Skizzen, Fotos, Videos oder sonstige Multimedia-Objekte
comment: Visual representation of the group of properties through sketches, photos, videos or other multimedia objects
domain: Group of properties
domain: Property
label: Bildliche Darstellung
range: string
sub property of: topDataProperty
scope note: PA023/GA018
Code: PA023/GA018

Relations of the group of properties identifiers in the interconnected data dictionaries
type: ObjectProperty
comment: List of pairs (group of properties internal identifier, corresponding data dictionary identifier) This attribute should be used for compatibility between already existing groups of properties
comment: Liste von Paaren (inter-ner Bezeichner der Merkmalsgruppe, ent-sprechender Daten-katalog-Bezeichner) dieses Attribut sollte fuer die Kompatibilitaet zwischen bereits vorhandenen Merk-malsgruppen verwen-det werden
domain: Group of properties
label: Beziehung der Bezeichner der Merkmalsgruppe in den miteinander verbundenen Datenkatalogen
sub property of: topObjectProperty
scope note: GA014
Code: GA014

Code
type: AnnotationProperty
type: Property
comment: Code, der zur Identifizierung des Attributs verwendet werden kann
comment: Code that can be used to identify the attribute
domain: Resource
range: Literal

Defining values
type: ObjectProperty
comment: Im Falle eines Feldes liefert dieses Attribut die definierenden Werte, sofern zutreffend, der Datentyp wird durch das Attribut PA030 angegeben
comment: In case of an array, this attribute provides the defining values when applicable, the datatype is given by the attribute PA030
domain: Property
label: Definierende Werte
range: Defining values list
sub property of: topObjectProperty
scope note: PA035
Code: PA035

has unit
type: ObjectProperty
comment: A unit to represent a scale that enables a value to be measured It is possible to use this attribute to explain there is no unit attached to the property by using unitless --> http://qudt.org/vocab/unit/UNITLESS
comment: Eine Einheit zur Darstellung einer Skala, die es ermoeglicht, einen Wert zu messen es ist moeglich, dieses Attribut zu verwenden, um zu erlaeutern, dass dem Merkmal keine Einheit zugeordnet ist, indem einheitslos verwendet wird --> http://qudt.org/vocab/unit/UNITLESS
domain: Maximum Boundary Limit
domain: Property
domain: Minimum Boundary Limit
label: hat Einheit
range: Unit
sub property of: topObjectProperty
scope note: PA033
Code: PA033

has Property Reference
type: ObjectProperty
comment: Fuegt ein Merkmal zu einer Merkmalszuweisung hinzu
comment: Attaches a property reference to a property assignment
domain: Assigned property
label: hat Merkmalreferenz
range: Property
sub property of: topObjectProperty

Dynamic Property
type: DatatypeProperty
comment: If this is a dynamic property, the value is dependent on the parameters provided in the attribute PA032
comment: Wenn es sich um ein dynamisches Merkmal handelt, haengt der Wert von den im Attribut PA032 bereitgestellten Parametern ab
label: Dynamisches Merkmal
range: Datatype
  one of: yes
  one of: no
sub property of: topDataProperty
example: no
example: yes
scope note: PA031
Code: PA031

Country of origin
type: DatatypeProperty
comment: Country from where the requirement for this property/group of properties originated
comment: Land, aus dem die Anforderung an dieses Merkmal/dieser Merkmalsgruppe stammt
domain: Group of properties
domain: Property
label: Ursprungsland
range: string
sub property of: topDataProperty
scope note: PA026/GA021
Code: PA026/GA021

Symbol
type: DatatypeProperty
domain: Symbol of the property in a given property group
range: string
sub property of: topDataProperty
scope note: PA022
Code: PA022