has presence of illustrations
type: Property
domain: Resource
label: tiene presencia de ilustraciones @es
name: hasPresenceOfIllustrations
status: Published
definition: Relaciona un recurso que está ilustrado con la abreviatura “ill.” (o su equivalente en otra lengua), seguido o sustituido por una especificación del tipo concreto de ilustración. @es
definition: Relates a resource that is illustrated to the abbreviation "ill." (or its equivalent in another language), followed or replaced by a specification of particular types of illustration.

has numbering area
type: Property
domain: Resource
label: tiene área de numeración @es
range: Numbering Area Encoding Scheme
name: hasNumberingArea
status: Published
definition: Relaciona un recurso que es una publicación seriada con una mención que incluye la numeración, la designación cronológica, el sistema paralelo de numeración, y el sistema sucesivo de numeración. @es
definition: Relates a resource that is a serial to a statement including the numbering, the chronological designation, the parallel system of numbering, and the subsequent system of numbering.
scope note: Can include a numeral, a letter, any other character, or the combination of these, with or without an accompanying word ("volume", "number", etc.), and/or a chronological designation. Omitted if both the first and last issues or parts are not available.
scope note: Puede incluir un número, una letra, cualquier otro carácter o la combinación de éstos, con o sin una palabra acompañándoles (“volúmen”, “número”, etc.) y /o una designación cronológica. Se omite si tanto el primer como el último número o partes no están disponibles. @es

has parallel common title of series or multipart monographic resource
type: Property
domain: Resource
label: tiene título común paralelo de serie o recurso monográfico multiparte @es
name: hasParallelCommonTitleOfSeriesOrMultipartMonographicResource
status: Published
definition: Relaciona un recurso que es una serie o un recurso monográfico multiparte con aquella parte del título que es común a un grupo de recursos relacionados que tienen además sus diferentes títulos de sección, presentada como equivalente en otra lengua o escritura en la fuente de información preferida del recurso. @es
definition: Relates a resource that is a series or multipart monographic resource to that part of the title that is carried by a group of related resources in addition to their different section titles, presented on the preferred source of information for the resource as an equivalent in another language or script.

has chronological designation
type: Property
domain: Resource
label: tiene designación cronológica @es
name: hasChronologicalDesignation
status: Published
definition: Relaciona un recurso que es una publicación seriada con su designación cronológica. @es
definition: Relates a resource that is a serial to its chronological designation.
scope note: Las palabras en la designación pueden abreviarse. @es
scope note: Words in the designation may be abbreviated.

has note on content form and media type
type: Property
domain: Resource
label: tiene nota sobre forma del contenido y tipo de medio @es
sub property of: has note
name: hasNoteOnContentFormAndMediaType
status: Published
definition: Relates a resource to a note on the content form and media type area.
definition: Relaciona un recurso con una nota sobre el área de forma del contenido y tipo de medio. @es

Resource Identifier And Terms Of Availability Area Encoding Scheme
type: Class
label: Esquema de codificación del área de identificador del recurso y condiciones de disponibilidad @es
subclass of: ISBD Syntax Encoding Scheme
name: ResourceIdentifierAndTermsOfAvailabilityAreaEncodingScheme
status: Published
definition: Esquema de codificación utilizado para el área de identificador del recurso y condiciones de disponibilidad (Área 8). @es
definition: Syntax Encoding Scheme for the resource identifier and terms of availability area (Area 8).

has note on parallel titles and parallel other title information
type: Property
domain: Resource
label: tiene nota sobre títulos paralelos e información complementaria del título paralelo @es
sub property of: has note
name: hasNoteOnParallelTitlesAndParallelOtherTitleInformation
status: Published
definition: Relates a resource to a note on parallel titles and parallel other title information.
definition: Relaciona un recurso con una nota sobre los títulos paralelos e información complementaria del título paralela. @es
scope note: Excludes information recorded in the title and statement of responsibility area.
scope note: Se excluye la información registrada en el área de título y mención de responsabilidad. @es

has note on frequency
type: Property
domain: Resource
label: tiene nota de frecuencia @es
sub property of: has note
name: hasNoteOnFrequency
status: Published
definition: Relates a resource that is a serial to a note on the frequency. Relates a resource that is an integrating resource to a note on the frequency of updates.
definition: Relaciona un recurso que es una publicación seriada con una nota de frecuencia. Relaciona un recurso que es un recurso integrable con una nota de frecuencia de actualizaciones. @es
scope note: Se utiliza cuando la frecuencia no está establecida en el área de título y mención de responsabilidad o es necesario transmitir alguna información adicional. @es
scope note: Used when the frequency is not stated in the title and statement of responsibility area, or it is necessary to convey some additional information.

has note on basis of description
type: Property
domain: Resource
label: tiene nota sobre base de descripción @es
sub property of: has note
name: hasNoteOnBasisOfDescription
status: Published
definition: Relaciona un recurso que es una serie o recurso monográfico multiparte con una nota sobre el fascículo, parte, iteración, etc., en que se basa la descripción. @es
definition: Relates a resource that is a series or multipart monograph to a note on the issue, part, iteration, etc., that forms that basis of its description.
scope note: Incluye el fascículo o parte en el que se basa la descripción cuando la descripción de una publicación seriada o recurso monográfico multiparte no está basada en el primer fascículo o parte publicada. Incluye la primera analítica consultada y su fecha de publicación, producción, distribución, etc, si se hace una descripción para una serie monográfica no numerada. Si también se han consultado otras analíticas y se puede identificar la última analítica incluye la analítica y su fecha de publicación. Incluye la última iteración consultada al preparar la descripción si esta descripción no se basa en la primera iteración de un recurso integrable. Incluye el fascículo o iteración que forma la base de la descripción de un recurso electrónico de acceso remoto, con la fecha en la que se consultó. @es
scope note: Includes the issue or part that forms the basis of the description if the description of a serial or multipart monographic resource is not based on the first issue or part published. Includes the earliest analytic consulted and its date of publication, production, distribution, etc. if a description is made for an unnumbered monographic series itself. Includes the analytic and its date of publication if other analytics also have been consulted and the latest analytic can be identified. Includes the latest iteration consulted in preparing the description if the description is not based on the first iteration of an integrating resource. Includes the issue or iteration that forms the basis of the description of a remote-access electronic resource, along with the date on which it was viewed.

has other physical details
type: Property
domain: Resource
label: tiene otros detalles físicos @es
name: hasOtherPhysicalDetails
status: Published
definition: Relates a resource to a statement including the statement relating to the material of which the resource is composed, the statement relating to the presence of illustrations, the particular type of illustration, the number of illustrations, the presence of colour, the reduction ration (if a microform), the presence or absence of sound (if a resource that may have integral sound as a feature), and other technical specifications.
definition: Relaciona un recurso con una mención que incluye la mención relativa al material del que está hecho el recurso, la mención relativa a la presencia de ilustraciones, el tipo específico de ilustración, el número de ilustraciones, la existencia de color, la proporción de reducción (si es una microforma), la existencia o ausencia de sonido (si es un recurso que pueda tener como carácterística el sonido integrado) y otras especificaciones técnicas. @es
scope note: Incluye método de producción, color, material del que está hecho el recurso, etc. Se omite cualquier característica implícita en la designación específica del material. @es
scope note: Includes method of production, colour, material from which the resource is made, etc. Any characteristic implicit in the specific material designation is omitted.

has content qualification
type: Property
domain: Resource
label: tiene aclaración de contenido @es
name: hasContentQualification
status: Published
definition: Relaciona un recurso con una subcategoría que amplía una categoría que refleja la forma o formas fundamentales en que se expresa el contenido. @es
definition: Relates a resource to a sub-category that expands a category that reflects the fundamental form or forms in which the content is expressed.
scope note: Los calificativos del contenido especifican el tipo, presencia o ausencia de movimiento, dimensión y naturaleza sensorial del recurso que se describe. @es
scope note: Content qualifications specify the type, presence or absence of motion, dimensionality and sensory nature for the resource being described.

has title proper (compound) of series
type: Property
domain: Resource
range: Title Proper (Compound) Of Series Or Multipart Monographic Resource Encoding Scheme
name: hasTitleProperCompoundOfSeries
status: Published
definition: Relates a resource that is a series or multipart monographic resource to the title proper consisting of a common title and a dependent title, with or without a dependent title designation.

has resource identifier and terms of availability area
type: Property
domain: Resource
label: tiene área de identificador del recurso y condiciones de disponibilidad @es
range: Resource Identifier And Terms Of Availability Area Encoding Scheme
name: hasResourceIdentifierAndTermsOfAvailabilityArea
status: Published
definition: Relaciona un recurso con una mención que incluye el identificador del recurso, el título clave y las condiciones de disponibilidad. @es
definition: Relates a resource to a statement including the resource identifier, the key title, and the terms of availability.

has addition to place of publication
type: Property
domain: Resource
label: tiene adición al lugar de publicación @es
name: hasAdditionToPlaceOfPublication
status: Published
definition: Relaciona un recurso con el nombre de un lugar de mayor rango, como un país, estado, etc., y, si se considera necesario para su identificación, la dirección completa del editor, productor o distribuidor. @es
definition: Relates a resource to the name of a larger place such as a country, state, etc. and, if it is considered necessary for identification, the full address of the publisher, producer or distributor.

has note on supplement to or insert in
type: Property
domain: Resource
label: tiene nota de suplemento a o de insertado en @es
sub property of: has note
name: hasNoteOnSupplementToOrInsertIn
status: Published
definition: Relates a resource that is a supplement to or insert in another resource to a note of the title, the key title and ISSN of the main resource.
definition: Relaciona un recurso que es un suplemento de o un inserto en otro recurso con una nota del título, título clave e ISSN del recurso principal. @es

Name Of Publisher, Producer, Distributor Statement Encoding Scheme
type: Class
label: Esquema de codificación de mención del nombre del editor, productor o distribuidor @es
subclass of: ISBD Syntax Encoding Scheme
name: NameOfPublisherProducerDistributorStatementEncodingScheme
status: Published
definition: Esquema de codificación utilizada para la mención del nombre del editor, productor o distribuidor. @es
definition: Syntax Encoding Scheme for the name of publisher, producer, distributor statement.

has note on change to edition
type: Property
domain: Resource
label: tiene nota de cambio en edición @es
sub property of: has note
name: hasNoteOnChangeToEdition
status: Published
definition: Relates a resource that is a serial or multipart monograph to a note on changes in edition statements that occur after the issue or part used as the basis of description and do not require a new description. Relates a resource that is an integrating resource to a note on earlier edition statements that are no longer present on the current iteration or that are in a different form on an earlier iteration and do not require a new description.
definition: Relaciona un recurso que es una publicación seriada o una monografía multiparte con una nota sobre cambios en las menciones de edición que son posteriores al fascículo o parte que se usa como base de la descripción, pero que no requiere una nueva descripción. Relaciona un recurso integrable con una nota sobre una mención de edición anterior que ya no está presente en la iteración más reciente o que está de una forma diferente a la iteración anterior, y que no requiere una nueva descripción. @es

has note on nature, scope, form, purpose or language
type: Property
domain: Resource
label: tiene nota sobre naturaleza, alcance, forma, propósito o lengua @es
sub property of: has note
name: hasNoteOnNatureScopeFormPurposeOrLanguage
status: Published
definition: Relates a resource to a note on its nature, purpose, scope, or literary, artistic or musical form, or language if the linguistic content is significant.
definition: Relaciona un recurso con una nota sobre su naturaleza, propósito, alcance, o forma literaria, artística o musical, o la lengua si el contenido lingüístico es significativo. @es
scope note: Used when the information cannot be inferred from other elements of the description.
scope note: Se utiliza cuando la información no puede ser inferida de otros elementos de la descripción. @es

has equinox
type: Property
domain: Resource
label: tiene equinoccio @es
name: hasEquinox
status: Published
definition: Relaciona un recurso cartográfico con su equinoccio (uno de los dos puntos de la interesección de la eclíptica y el Ecuador celeste, ocupado por el sol cuando su declinación es de 0 grados). @es
definition: Relates a resource that is cartographic to its equinox (one of two points of intersection of the ecliptic and the celestial equator, occupied by the sun when its declination is 0 degrees).

has numbering within series or multipart monographic resource
type: Property
domain: Resource
label: tiene numeración de serie o recurso monográfico multiparte @es
name: hasNumberingWithinSeriesOrMultipartMonographicResource
status: Published
definition: Relaciona un recurso que es una serie o recurso monográfico multiparte con su numeración. @es
definition: Relates a resource that is a series or multipart monographic resource to its numbering.

has statement of responsibility relating to edition
type: Property
domain: Resource
label: tiene mención de responsabilidad relativa a edición @es
name: hasStatementOfResponsibilityRelatingToEdition
status: Published
definition: Relates a resource to one or more names, phrases, or groups of characters relating to the identification and/or function of any persons or corporate bodies responsible for or contributing to the creation or realisation of the intellectual or artistic content of an edition of a work contained in the resource.
definition: Relaciona un recurso con uno o más nombres, frases, o grupos de caracteres relacionados con la identificación y/o función de cualquier persona o entidad corporativa responsables de, o que contribuyen a, la creación o realización del contenido intelectual o artístico de una edición de una obra contenida en el recurso. @es
scope note: Las menciones de responsabilidad relativas a la edición pueden hacer referencia a funciones tales como la de revisor de una nueva edición, o pueden designar a la persona o entidad responsable de la aportación de material complementario, apéndices, etc. a una nueva edición. @es
scope note: Statements of responsibility relating to the edition can indicate functions such as that of a reviser of a new edition, or can name the person or body responsible for the provision of supplementary matter, of appendices, etc., in a new edition.

is expression reflected in
type: Property
domain: C1002
range: Resource
name: isExpressionReflectedIn
status: Published
inverse of: has expression aspect
definition: Relates an expression to a bibliographic resource that reflects it.

has title statement of series or multipart monographic resource
type: Property
domain: Resource
name: hasTitleStatementOfSeriesOrMultipartMonographicResource
status: Published
definition: Relates a resource that is a series or multipart monographic resource to a statement of its title.

has parallel other title information of series or multipart monographic resource
type: Property
domain: Resource
label: tiene información complementaria del título paralela de serie o de recurso monográfico multiparte @es
name: hasParallelOtherTitleInformationOfSeriesOrMultipartMonographicResource
status: Published
definition: Relates a resource that is a serial or multipart monographic resource to a word or phrase, or a group of characters, appearing in conjunction with, and subordinate to, the title proper of the resource presented on the preferred source of information for the resource as an equivalent in another language or script.
definition: Relaciona un recurso que es una publicación seriada o recurso monográfico multiparte con una palabra o frase o grupo de caracteres, que aparecen en conjunción con y subordinado al título propiamente dicho del recurso, presentado en la fuente de información preferida para el recurso como un equivalente en otra lengua o escritura. @es
scope note: La información complementaria del título paralela se da cuando se considera importante para los usuarios del catálogo. @es
scope note: Parallel other title information is given when considered important to users of the catalogue.

has number of tape tracks
type: Property
domain: Resource
label: tiene número de pistas @es
name: hasNumberOfTapeTracks
status: Published
definition: Relaciona un recurso con el número de sus pistas. @es
definition: Relates a resource to the number of its tape tracks.

Terms Of Availability Statement Encoding Scheme
type: Class
subclass of: ISBD Syntax Encoding Scheme
name: TermsOfAvailabilityStatementEncodingScheme
status: Published
definition: Syntax Encoding Scheme for the terms of availability statement.

Material Or Type Of Resource Specific Area Encoding Scheme
type: Class
label: Esquema de codificación del área del material o tipo específico de recurso @es
subclass of: ISBD Syntax Encoding Scheme
name: MaterialOrTypeOfResourceSpecificAreaEncodingScheme
status: Published
definition: Esquema de codificación utilizado para el área del material o tipo específico de recurso (Área 2). @es
definition: Syntax Encoding Scheme for the material or type of resource specific area (Area 3).

has presence of colour
type: Property
domain: Resource
label: tiene presencia de color @es
name: hasPresenceOfColour
status: Published
definition: Relaciona un recurso que tiene ilustraciones en color, o es visual, con una mención que indica la presencia de ilustraciones en color o características de color, utilizando las abreviaturas “col.” o “bl. y n.” (o sus equivalentes en otra lengua). @es
definition: Relates a resource that has coloured illustrations, or is visual, to a statement indicating the presence of coloured illustrations or colour characteristics, using the abbreviations "col." or "b&w" (or their equivalents in another language).

has note on publication, production, distribution, etc.
type: Property
domain: Resource
label: tiene nota sobre publicación, producción, distribución, etc. @es
sub property of: has note
name: hasNoteOnPublicationProductionDistributionEtc
status: Published
definition: Relaciona un recurso con una nota sobre el área de publicación, producción, distribución, etc. @es
definition: Relates a resource to a note on the publication, production, distribution, etc., area.
scope note: Includes details of other publishers, producers, distributors, etc., of the resource; notes on variant publication, production or distribution, etc., information; irregularities; and additional dates.
scope note: Incluye detalles de otros editores, productores, distribuidores, etc., del recurso; notas sobre variaciones en la publicación, producción, distribución, etc.; irregularidades y fechas adicionales. @es

has date of publication, production, distribution
type: Property
domain: Resource
label: tiene fecha de publicación, producción, distribución @es
name: hasDateOfPublicationProductionDistribution
status: Published
definition: Relaciona un recurso con la fecha en que oficialmente se ha ofrecido para la venta o distribución al público, normalmente se da en la forma de un año. @es
definition: Relates a resource to the date on which it is officially offered for sale or distribution to the public, usually given in the form of a year.

has compound title of parallel title
type: Property
domain: Resource
label: tiene título compuesto de título paralelo @es
range: Compound Title Of Parallel Title Encoding Scheme
name: hasCompoundTitleOfParallelTitle
status: Published
definition: Relates a resource to the title proper consisting of a common title and a dependent title, with or without a dependent title designation, presented on the prescribed sources of information for the resource as an equivalent in another language or script.
definition: Relaciona un recurso con un título propiamente dicho consistente en un título común y un título dependiente, con o sin designación de título dependiente, presentado como equivalente en otra lengua o escritura en la fuente de información preferida del recurso. @es

has edition area
type: Property
domain: Resource
label: tiene área de edición @es
range: Edition Area Encoding Scheme
name: hasEditionArea
status: Published
definition: Relates a resource to a statement including the edition statement, parallel edition statements, statements of responsibility relating to the edition, additional edition statements, and statements of responsibility following an additional edition statement.
definition: Relaciona un recurso con una mención que incluye la mención de edición, menciones de edición paralela, menciones de responsabilidad relativas a la edición, menciones de edición adicional y menciones de responsabilidad relativas a la mención de edición adicional. @es

has dependent title designation of title proper
type: Property
domain: Resource
label: tiene designación de título dependiente de título propiamente dicho @es
name: hasDependentTitleDesignationOfTitleProper
status: Published
definition: Relaciona un recurso con la numeración que por sí sola o en conjunción con un título dependiente sirve para distinguirlo de uno o más recursos relacionados que tienen un título común. @es
definition: Relates a resource to numbering that alone or in conjunction with a dependent title serves to distinguish it from one or more related resources having a common title.

has title of individual work by different author
type: Property
domain: Resource
label: tiene título de obra individual de diferente autor @es
sub property of: has title
name: hasTitleOfIndividualWorkByDifferentAuthor
status: Published
definition: Relaciona un recurso con el título de una obra individual cuando el recurso se compone de dos o más obras con diferentes menciones de responsabilidad sin título colectivo. @es
definition: Relates a resource to the title of an individual work when the resource comprises two or more works with different statements of responsibility without a collective title.

Numbering Area Encoding Scheme
type: Class
label: Esquema de codificación del área de numeración @es
subclass of: ISBD Syntax Encoding Scheme
name: NumberingAreaEncodingScheme
status: Published
definition: Esquema de codificación utilizado para el área de numeración (Área 3 de publicaciones periódicas). @es
definition: Syntax Encoding Scheme for the numbering area (Area 3 for serials).

has note on title proper
type: Property
domain: Resource
label: tiene nota sobre título propiamente dicho @es
sub property of: has note
name: hasNoteOnTitleProper
status: Published
definition: Relaciona un recurso con una nota sobre el título propiamente dicho (el nombre principal de un recurso, por ejemplo, el título de un recurso en la forma en la que aparece en la fuente preferida de información de información para el recurso). @es
definition: Relates a resource to a note on the title proper (the chief name of a resource, i.e. the title of a resource in the form in which it appears on the preferred source of information for the resource).

has statement of scale
type: Property
domain: Resource
label: tiene mención de escala @es
name: hasStatementOfScale
status: Published
definition: Relaciona un recurso cartográfico con la razón matemática entre la distancia en el recurso y la medida real que representa, se da como una fracción representativa, expresada como una ratio (1: ). @es
definition: Relates a resource that is cartographic to the ratio of distances on the resource to the actual distances they represent, given as a representative fraction, expressed as a ratio (1: ).

has title proper of series or multipart monographic resource
type: Property
domain: Resource
label: tiene título propiamente dicho de serie o recurso monográfico multiparte @es
name: hasTitleProperOfSeriesOrMultipartMonographicResource
status: Published
definition: Relaciona un recurso que es una serie o recurso monográfico multiparte con el título propiamente dicho (el nombre principal de un recurso, es decir, el titulo de un recurso en la forma en la que aparece en la fuente preferida de información para el recurso). @es
definition: Relates a resource that is a series or multipart monographic resource to the title proper (the chief name of a resource, i.e. the title of a resource in the form in which it appears on the preferred source of information for the resource).

has parallel title
type: Property
domain: Resource
label: tiene título paralelo @es
sub property of: has title
name: hasParallelTitle
status: Published
definition: Relaciona un recurso con un título en otra lengua y/o escritura diferente a la del título propiamente dicho y que se presenta como equivalente del título propiamente dicho en las fuentes preferidas de información. @es
definition: Relates a resource to a title in another language or script than the title proper and presented as an equivalent of the title proper on the preferred source or sources of information.
scope note: Un título en otra lengua que se vincula lingüísticamente a otra parte de la descripción no se trata como título paralelo. @es
scope note: A title in another language that is linguistically linked to another part of the description is not treated as a parallel title.

has place of publication, production, distribution statement
type: Property
domain: Resource
label: tiene mención de lugar de publicación, producción o distribución @es
range: Place Of Publication, Production, Distribution Statement Encoding Scheme
name: hasPlaceOfPublicationProductionDistributionStatement
status: Published
definition: Relaciona un recurso con una mención que incluye el lugar de publicación, producción, distribución, la mención de lugar de publicación adicional y la mención de lugar de publicación paralela. @es
definition: Relates a resource to a statement including the place of publication, production, distribution, the additional place of publication statement, and the parallel statement of place of publication.

has common title of series or multipart monographic resource
type: Property
domain: Resource
label: tiene título común de serie o recurso monográfico multiparte @es
name: hasCommonTitleOfSeriesOrMultipartMonographicResource
status: Published
definition: Relaciona un recurso que es una serie o recurso monográfico multiparte con aquella parte del título que es común a un grupo de recursos relacionados que tienen también sus títulos de sección diferentes. @es
definition: Relates a resource that is a series or multipart monographic resource to that part of the title that is carried by a group of related resources in addition to their different section titles.

has process or method of reproduction of still image
type: Property
domain: Resource
label: tiene proceso o método de reproducción de imagen fija @es
name: hasProcessOrMethodOfReproductionOfStillImage
status: Published
definition: Relaciona un recurso que es una imagen fija con los detalles del proceso o método de reproducción. @es
definition: Relates a resource that is a still image to details on the process or method of reproduction.

Title Proper (Compound) Of Series Or Multipart Monographic Resource Encoding Scheme
type: Class
label: Esquema de codificación del título propiamente dicho (compuesto) de serie @es
subclass of: ISBD Syntax Encoding Scheme
name: TitleProperCompoundOfSeriesOrMultipartMonographicResourceEncodingScheme
status: Published
definition: Esquema de codificación utilizado para el título propiamente dicho (compuesto) de serie o recurso monográfico multiparte. @es
definition: Syntax Encoding Scheme for the title proper (compound) of a series or multipart monographic resource.

has note on different editions
type: Property
domain: Resource
label: tiene nota de diferentes ediciones @es
sub property of: has note
name: hasNoteOnDifferentEditions
status: Published
definition: Relates a resource to a note on the name of another edition or editions.
definition: Relaciona un recurso con una nota sobre el nombre de otra edición o ediciones. @es
scope note: Se utiliza cuando el recurso es una de dos o más ediciones publicadas simultáneamente, que difieren parcialmente en el contenido o en la lengua. Se emplea una nota general si no está disponible el nombre de la otra edición o ediciones, o si el recurso se publica en más ediciones que pueden nombrarse convenientemente. @es
scope note: Used when the resource is one of two or more simultaneously published editions differing in partial content or language. A general note is used if the name of the other edition or editions is not readily available, or the resource is published in more editions than can be named conveniently.

Resource
type: Class
label: Recurso @es
name: Resource
status: Published
definition: Una entidad, tangible o intangible, que tiene contenido artístico y/o intelectual y que está concebida, producida y/o publicada como una unidad, formando la base de una descripción bibliográfica individual. @es
definition: An entity, tangible or intangible, that comprises intellectual and/or artistic content and is conceived, produced and/or issued as a unit, forming the basis of a single bibliographic description.
scope note: Includes text, music, still and moving images, graphics, maps, sound recordings and video recordings, electronic data or programs, including those issued serially.
scope note: Incluye texto, música, imágenes fijas y en movimiento, gráficos, mapas, grabaciones sonoras y videograbaciones, programas o datos electrónicos, incluyendo aquellos editados periódicamente. @es

has label name and catalogue number
type: Property
domain: Resource
label: tiene nombre comercial y número de catálogo @es
sub property of: has resource identifier
name: hasLabelNameAndCatalogueNumber
status: Published
definition: Relates a resource that is commercially issued to the label name and all catalogue numbers supplied by the issuing company.
definition: Relaciona un recurso que se publica comercialmente con el nombre de la etiqueta y con todos los números de catálogo suministrados por la compañía editora. @es

has playing time
type: Property
domain: Resource
label: tiene duración @es
name: hasPlayingTime
status: Published
definition: Relaciona un recurso que tiene un aspecto inherente de duración con el tiempo que conlleva la ejecución del recurso completo. @es
definition: Relates a resource that has an inherent durational aspect to the time it takes to play the whole resource.

has terms of availability
type: Property
domain: Resource
label: tiene condiciones de disponibilidad @es
name: hasTermsOfAvailability
status: Published
definition: Relates a resource to a statement of the price if it is for sale or a brief statement of other terms if it is not for sale.
definition: Relaciona un recurso con una mención del precio si está a la venta o una breve mención de otras condiciones si no está a la venta. @es
scope note: Se recomienda que el precio del recurso se de con el código normalizado internacional para la moneda como en la norma ISO 4217. @es
scope note: It is recommended that the price of the resource be given with the international standard code for the currency as in ISO 4217.

has mathematical data area
type: Property
domain: Resource
label: tiene área de datos matemáticos @es
range: Mathematical Data Area Encoding Scheme
name: hasMathematicalDataArea
status: Published
definition: Relaciona un recurso cartográfico a una mención que incluye la mención de escala, mención de proyección y mención de coordenadas y equinoccio. @es
definition: Relates a resource that is cartographic to a statement including the statement of scale, statement of projection, and the statement of coordinates and equinox.

is work reflected in
type: Property
domain: C1001
range: Resource
name: isWorkReflectedIn
status: Published
inverse of: has work aspect
definition: Relates a work to a bibliographic resource that reflects it.

ISBD elements
note: This is a registration of classes and properties from International Standard Bibliographic Description (ISBD), consolidated edition, published by De Gruyter Saur in July 2011 (ISBN 978-3-11-026379-4).

has longitude and latitude
type: Property
domain: Resource
label: tiene longitud y latitud @es
sub property of: has coordinates
name: hasLongitudeAndLatitude
status: Published
definition: Relates a resource that is a terrestrial map to its coordinates expressed in decimal degrees or degrees (°), minutes (′) and seconds (″) of the sexagesimal system (360° circle) (with longitude always taken from the Greenwich prime meridian) in the order of longitude of westernmost extent, longitude of easternmost extent, latitude of northernmost extent , and latitude of southernmost extent, preceded by the appropriate initials for West (W), East (E), North (N) and South (S) or their equivalents in another language or script. Relates a resource that is a map of another celestial body to its coordinates in its coordinate system.
definition: Relaciona un recurso que es un mapa terrestre con sus coordenadas expresadas en grados decimales o en grados (º), minutos (´) y segundos (´´) del sistema sexagesimal (círculo de 360º) (con la longitud tomada siempre a partir del meridiano cero de Greeenwich) en el orden: punto de longitud más occidental, punto de longitud más oriental, latitud del punto más septentrional y latitud del punto más meridional, precedido por las iniciales apropiadas Oeste (O), Este (E), Norte (N) y Sur (S) o sus equivalentes en otra lengua o escritura. Relaciona un recurso que es un mapa de un cuerpo celeste con sus coordenadas en su sistema correspondiente. @es

has equalization
type: Property
domain: Resource
label: tiene ecualización @es
name: hasEqualization
status: Published
definition: Relaciona un recurso con la ecualización que emplea. @es
definition: Relates a resource to the equalization it employs.

Series And Multipart Monographic Resource Area Encoding Scheme
type: Class
label: Esquema de codificación del área de serie y recurso monográfico multiparte @es
subclass of: ISBD Syntax Encoding Scheme
name: SeriesAndMultipartMonographicResourceAreaEncodingScheme
status: Published
definition: Esquema de codificación utilizado para el área de serie y recurso monográfico multiparte (Área 6). @es
definition: Syntax Encoding Scheme for the series and multipart monographic resource area (Area 6).

has frame alignment
type: Property
domain: Resource
label: tiene alineación de los fotogramas @es
name: hasFrameAlignment
status: Published
definition: Relaciona un recurso que es un carrete de microfilme, tira de microfilme, o tira de película con una mención de su alineación de fotogramas. @es
definition: Relates a resource that is a microfilm reel, microfilm slip, or filmstrip to a statement of its frame alignment.

has note on contents
type: Property
domain: Resource
label: tiene nota sobre el contenido @es
sub property of: has note
name: hasNoteOnContents
status: Published
definition: Relaciona un recurso con una nota relativa al contenido. @es
definition: Relates a resource to a note relating to the contents.
scope note: Includes the list of contents and notes on other inclusions, such as indexes, inserts, bibliographies, discographies, etc.

has date of printing or manufacture
type: Property
domain: Resource
label: tiene fecha de impresión o fabricación @es
name: hasDateOfPrintingOrManufacture
status: Published
definition: Relaciona un recurso con la fecha en la que se imprime o fabrica, normalmente se da en la forma de un año. @es
definition: Relates a resource to the date on which it is printed or manufactured, usually given in the form of a year.

has dependent title designation of parallel title
type: Property
domain: Resource
label: tiene designación de título dependiente de título paralelo @es
name: hasDependentTitleDesignationOfParallelTitle
status: Published
definition: Relaciona un recurso con la numeración que por sí sola o en conjunción con un título dependiente sirve para distinguir un recurso de dos o más recursos relacionados que tienen un título común, presentada como equivalente en otra lengua o escritura en la fuente de información preferida del recurso. @es
definition: Relates a resource to numbering that alone or in conjunction with a dependent title serves to distinguish it from one or more related resources having a common title, presented on the preferred source of information for the resource as an equivalent in another language or script.

has material description area
type: Property
domain: Resource
label: tiene área de descripción del material @es
range: Material Description Area Encoding Scheme
name: hasMaterialDescriptionArea
status: Published
definition: Relates a resource to a statement including the specific material designation and extent, other physical details, the dimensions, and the accompanying material statement.
definition: Relaciona un recurso con una mención que incluye la designación específica del material y la extensión, otros detalles físicos, dimensiones y la mención de material anejo. @es
scope note: Restricted to the resource as issued by the publisher.
scope note: Restringido al recurso tal y como lo publica el editor. @es

has parallel statement of responsibility relating to edition
type: Property
domain: Resource
label: tiene mención de responsabilidad paralela relativa a edición @es
name: hasParallelStatementOfResponsibilityRelatingToEdition
status: Published
definition: Relaciona un recurso con uno o más nombres, frases o grupos de caracteres relativos a la identificación y/o función de cualquier persona o entidad corporativa responsable de o que contribuye a la creación o realización del contenido intelectual o artístico de una edición de una obra contenida en el recurso, que se presenta en la fuente de información preferida para el recurso y que se muestra como equivalente en otra lengua o escritura. @es
definition: Relates a resource to one or more names, phrases, or groups of characters relating to the identification and/or function of any persons or corporate bodies responsible for or contributing to the creation or realisation of the intellectual or artistic content of an edition of a work contained in the resource, presented on the preferred source of information for the resource as an equivalent in another language or script.

has parallel name of publisher, producer, distributor
type: Property
domain: Resource
label: tiene nombre paralelo de editor, productor, distribuidor @es
name: hasParallelNameOfPublisherProducerDistributor
status: Published
definition: Relaciona un recurso con la forma del nombre del editor, productor y/o distribuidor en la lengua y escritura del título propiamente dicho cuando dicho nombre aparece en la fuente prescrita de información en más de una lengua o escritura. @es
definition: Relates a resource to the form of name of the publisher, producer and/or distributor in the language and script of the title proper when the name appears on the prescribed source of information for the resource in more than one language or script.
scope note: If the criterion in the definition does not apply, the form of name made prominent by typography or, if there is no typographical distinction, the form of name that appears first is used.

has note on supplements, inserts, etc.
type: Property
domain: Resource
label: tiene nota de suplementos, insertos, etc. @es
sub property of: has note
name: hasNoteOnSupplementsInsertsEtc
status: Published
definition: Relates a resource that has one or more supplements and/or inserts to a note on the title, the key title and ISSN of the supplement and/or insert.
definition: Relaciona un recurso que tiene uno o más suplementos y/o insertos con una nota sobre el título, el título clave e ISSN del suplemento y/o el inserto. @es
scope note: A general note about the existence of supplements is used when they are numerous.
scope note: Se utiliza una nota general sobre la existencia de suplementos cuando sean muy numerosos. @es

has note on numbers
type: Property
domain: Resource
label: tiene nota relativa a números @es
sub property of: has note
name: hasNoteOnNumbers
status: Published
definition: Relates a resource to a note on numbers or identifiers associated with it.
definition: Relaciona un recurso a una nota relativa a números o identificadores asociados con él. @es
scope note: Se excluyen los identificadores registrados en el área de identificador del recurso y condiciones de disponibilidad. @es
scope note: Excludes identifiers recorded in the resource identifier and terms of availability area.

Statement Of Coordinates And Equinox Encoding Scheme
type: Class
label: Esquema de codificación de la mención de coordenadas y equinoccio @es
subclass of: ISBD Syntax Encoding Scheme
name: StatementOfCoordinatesAndEquinoxEncodingScheme
status: Published
definition: Syntax Encoding Scheme for the statement of coordinates and equinox.

has coordinates
type: Property
domain: Resource
label: tiene coordenadas @es
has subproperty: has right ascension and declination
has subproperty: has longitude and latitude
name: hasCoordinates
status: Published
definition: Relaciona un recurso cartográfico con sus coordenadas (las medidas de latitud y longitud que definen la posición de puntos sobre la superficie de la Tierra u otra esfera celeste que delimita la mayor extensión del área cubierta). @es
definition: Relates a resource that is cartographic to its coordinates (the quantities of latitude and longitude that define the position of points on the surface of the Earth or other celestial sphere that delimit the greatest extent of the area covered).

has statement of responsibility of series or multipart monographic resource
type: Property
domain: Resource
label: tiene mención de responsabilidad de serie o recurso monográfico multiparte @es
name: hasStatementOfResponsibilityOfSeriesOrMultipartMonographicResource
status: Published
definition: Relaciona un recurso que es una serie o recurso monográfico multiparte con uno o más nombres, frases o grupos de caracteres relacionados con la identificación y/o función de cualquier persona o entidad corporativa responsable de, o que contribuye a, la creación o realización del contenido artístico o intelectual de una obra contenida en el recurso. @es
definition: Relates a resource that is a series or multipart monographic resource to one or more names, phrases, or groups of characters relating to the identification and/or function of any persons or corporate bodies responsible for or contributing to the creation or realisation of the intellectual or artistic content of a work contained in the resource.
scope note: Se da la primera mención de responsabilidad si el título propiamente dicho de la serie o recurso monográfico multiparte es un término genérico. En los demás casos, se dan la primera y siguientes menciones de responsabilidad cuando aparecen en la fuente de información prescrita y son necesarias para la identificación del recurso bibliográfico más amplio o bien se considera importante para los usuarios del catálogo. @es
scope note: The first statement of responsibility is given if the title proper of the series or multipart monographic resource is a generic term. The first and subsequent statements of responsibility are given in other cases when they appear on the prescribed source of information and are necessary for identification of the larger bibliographic resource or otherwise considered important to users of the catalogue.

has edition statement
type: Property
domain: Resource
label: tiene mención de edición @es
name: hasEditionStatement
status: Published
definition: Relaciona un recurso con un término, frase o grupo de caracteres que indican que el recurso pertenece a una edición. @es
definition: Relates a resource to a word or phrase, or a group of characters, indicating that the resource belongs to an edition.
scope note: An edition statement normally includes either the word "edition" (or its equivalent in another language) or a related term together with a number ("2nd edition", etc.), or a term indicating difference from other editions ("new edition", "revised edition","“standard edition", "large print edition", "fourth state", "May 1970 script", etc.). A statement that includes the word "edition" or its equivalent is not considered an edition statement when it represents printing information, as is typical in the publication patterns of certain countries. An edition statement can also include other phrases that may be linguistically associated, linking the edition to other elements of the description (e.g. original title in a form such as "abridgement of ...").
scope note: Una mención de edición normalmente incluye o bien la palabra “edición” (o su equivalente en otra lengua) o un término similar, junto con un número ordinal (“2ª edición”, etc.) o un término que indique la diferencia respecto a otras ediciones (“nueva edición”, “edición revisada”, “edición estándar”, “edición de grandes caracteres”, cuarto estado”, “guión de mayo de 1970”, etc.). Una mención de edición puede incluir igualmente otras frases que pueden estar unidas lingüísticamente, vinculando la edición a otros elementos de la descripción (ej. título original con una forma como “resumen de….”). @es

has manifestation aspect
type: Property
domain: Resource
range: C1003
name: hasManifestationAspect
status: Published
inverse of: is manifestation reflected in
definition: Relates a bibliographic resource to a manifestation reflected in it.

has compound title of title proper
type: Property
domain: Resource
label: tiene título compueso de propiamente dicho @es
range: Compound Title Of Title Proper Encoding Scheme
name: hasCompoundTitleOfTitlePrope
status: Published
definition: Relaciona un recurso con un título propiamente dicho consistente en un título común y un título dependiente, con o sin designación de título dependiente. @es
definition: Relates a resource to the title proper consisting of a common title and a dependent title, with or without a dependent title designation.

has qualification to terms of availability
type: Property
domain: Resource
label: tiene aclaración a condición de disponibilidad @es
name: hasQualificationToTermsOfAvailability
status: Published
definition: Relaciona un recurso con una aclaración sobre una mención del precio, si está a la venta, o, si no lo está, una breve mención sobre otras condiciones de disponibilidad. @es
definition: Relates a resource to a qualification to a statement of the price if it is for sale or a brief statement of other terms if it is not for sale.

has groove direction
type: Property
domain: Resource
label: tiene dirección del surco @es
name: hasGrooveDirection
status: Published
definition: Relaciona un recurso que es un disco sonoro analógico con la dirección del surco. @es
definition: Relates a resource that is an analogue sound disc to its groove direction.

Compound Title Of Parallel Title Encoding Scheme
type: Class
label: Esquema de codificación del título compuesto de título paralelo @es
subclass of: ISBD Syntax Encoding Scheme
name: CompoundTitleOfParallelTitleEncodingScheme
status: Published
definition: Esquema de codificación utilizado para el título compuesto del título paralelo. @es
definition: Syntax Encoding Scheme for the compound title of the parallel title.

Title And Statement Of Responsibility Area Encoding Scheme
type: Class
label: Esquema de codificación del área de título y mención de responsabilidad @es
subclass of: ISBD Syntax Encoding Scheme
name: TitleAndStatementOfResponsibilityAreaEncodingScheme
status: Published
definition: Esquema de codificación utilizado para el área de título y mención de responsabilidad (Área 1). @es
definition: Syntax Encoding Scheme for the title and statement of responsibility area (Area 1).

has note on resource identifier and terms of availability
type: Property
domain: Resource
label: tiene nota sobre identificador del recurso y condición de disponibilidad @es
sub property of: has note
name: hasNoteOnResourceIdentifierAndTermsOfAvailability
status: Published
definition: Relates a resource to a note relating to the resource identifier and terms of availability.
definition: Relaciona un recurso con una nota relativa al identificador del recurso y condiciones de disponibilidad. @es
scope note: Includes notes of limited print run, issues or limited distribution.
scope note: Incluye notas de impresión limitada, edición o distribución limitada. @es

has parallel statement of responsibility relating to an additional edition statement
type: Property
domain: Resource
label: tiene mención de responsabilidad paralela relativa a una mención de edición adicional @es
name: hasParallelStatementOfResponsibilityRelatingToAnAdditionalEditionStatement
status: Published
definition: Relaciona un recurso con uno o más nombres, frases o grupos de caracteres relativos a la identificación y/o función de personas o entidades corporativas responsables de, o que contribuyen a, la creación o realización del contenido intelectual o artístico de una mención de edición adicional de una obra contenida en el recurso, que se presenta en la fuente preferida de información como equivalente en otra lengua o escritura. @es
definition: Relates a resource to one or more names, phrases, or groups of characters relating to the identification and/or function of any persons or corporate bodies responsible for or contributing to the creation or realisation of the intellectual or artistic content of an additional edition statement of a work contained in the resource, presented on the preferred source of information for the resource as an equivalent in another language or script.

has note on edition area and bibliographic history
type: Property
domain: Resource
label: tiene nota sobre el área de edición e historia bibliográfica @es
sub property of: has note
name: hasNoteOnEditionAreaAndBibliographicHistory
status: Published
definition: Relates a resource to a note on its edition area and bibliographic history.
definition: Relaciona un recurso con una nota sobre el area de edición e historia bibliográfica. @es

has place of publication, production, distribution
type: Property
domain: Resource
label: tiene lugar de publicación, producción, distribución @es
name: hasPlaceOfPublicationProductionDistribution
status: Published
definition: Relaciona un recurso con el nombre de un lugar asociado en la fuente de información prescrita con el nombre del editor, productor o distribuidor. @es
definition: Relates a resource to the name of the place associated on the prescribed source of information with the name of the publisher, producer or distributor.
scope note: Usually given on the preferred source of information as the name of a city. If no publisher, producer or distributor is named, it is the place from which the resource was issued or distributed.
scope note: Normalmente figura en la fuente preferida de información como el nombre de una ciudad. Si no consta el nombre de ningún editor, productor o distribuidor, es el lugar en el cual el recurso se ha emitido o distribuido. @es

has parallel dependent title of series or multipart monographic resource
type: Property
domain: Resource
label: tiene título dependiente paralelo de serie o recurso monográfico multiparte @es
name: hasParallelDependentTitleOfSeriesOrMultipartMonographicResource
status: Published
definition: Relaciona un recurso que es una serie o un recurso monográfico multiparte con un título que por sí mismo es insuficiente para identificar el recurso y que requiere de la adición del título común, o del título del recurso principal o del título de la serie principal, presentado como equivalente en otra lengua o escritura en la fuente de información preferida del recurso. @es
definition: Relates a resource that is a series or multipart monographic resource to a title that by itself is insufficient to identify the resource and that requires the addition of the common title, or the title of the main resource or the title of the main series, presented on the preferred source of information for the resource as an equivalent in another language or script.

has content form and media type area
type: Property
domain: Resource
label: tiene área de forma del contenido y de tipo de medio @es
range: Content Form And Media Type Area Encoding Scheme
name: hasContentFormAndMediaTypeArea
status: Published
definition: Relaciona un recurso con una mención que comprende tres elementos, cada uno tomado de listas cerradas: la forma del contenido, que son uno o más términos que reflejan la forma o formas fundamentales en que se expresa el contenido del recurso; la calificación del contenido, que especifica el tipo, naturaleza sensorial, dimensiones y/o la presencia/ausencia de movimiento en el recurso que se describe; y el tipo de medio, que indica el tipo o tipos de soporte utilizados para transmitir el contenido del recurso. @es
definition: Relates a resource to one or more statements each comprising three elements, each taken from closed lists: the content form, one or more terms reflecting the fundamental form or forms in which the content of a resource is expressed; the content qualification, specifying the type, sensory nature, dimensionality, and/or presence or absence of motion for the resource being described; and the media type, indicating the type or types of carrier used to convey the content of the resource.

has common title of title proper
type: Property
domain: Resource
label: tiene título común de título propiamente dicho @es
name: hasCommonTitleOfTitleProper
status: Published
definition: Relates a resource to that part of the title that is carried by a group of related resources in addition to their different section titles.
definition: Relaciona un recurso con aquella parte del título que es común a un grupo de recursos relacionados que tienen además sus diferentes títulos de sección. @es
scope note: El título común sirve para indicar esta relación de un grupo de recursos y, junto con el título de sección, identifica un recurso dado. El título común también puede ser común a un recurso principal y su suplemento o suplementos y a una serie principal y sus subseries cuando el suplemento o suplementos o las subseries tienen un título o títulos dependientes. @es
scope note: The common title serves to indicate this relationship in a group of resources and together with the section title identifies a given resource. The common title may also be common to a main resource and its supplement or supplements and to a main series and its subseries when the supplement or supplements or subseries have a dependent title or titles.

has parallel numbering system
type: Property
domain: Resource
label: tiene sistema paralelo de numeración @es
name: hasParallelNumberingSystem
status: Published
definition: Relaciona un recurso que es una publicación seriada con la designación del fascículo o parte que aparece en la lengua y escritura del título propiamente dicho, cuando existen designaciones en más de una lengua o escritura. @es
definition: Relates a resource that is a serial to the designation appearing in the language and script of the title proper when there are designations in more than one language or script on the issue or part.
scope note: Si no es aplicable el criterio de la definición, se utiliza la primera designación que aparece. También se pueden dar las designaciones paralelas. @es
scope note: If the criterion in the definition does not apply, the first designation is used. The parallel designations may also be given.

Mathematical Data Area Encoding Scheme
type: Class
label: Esquema de codificación del área de datos matemáticos @es
subclass of: ISBD Syntax Encoding Scheme
name: MathematicalDataAreaEncodingScheme
status: Published
definition: Esquema de codificación utilizado para el área de datos matemáticos (Área 3 de recursos cartográficos). @es
definition: Syntax Encoding Scheme for the mathematical data area (Area 3 for cartographic resources).

has note on statement of responsibility
type: Property
domain: Resource
label: tiene nota sobre mención de responsabilidad @es
sub property of: has note
name: hasNoteOnStatementOfResponsibility
status: Published
definition: Relaciona un recurso con una nota sobre sus menciones de responsabilidad (menciones, que se transcriben del recurso que se está describiendo, relativas a las personas responsables del contenido intelectual o artístico del recurso, a las entidades corporativas de las que emana el contenido, o a las personas o entidades corporativas responsables de la realización del contenido del recurso). @es
definition: Relates a resource to a note on its statements of responsibility (statements, transcribed from the resource being described, relating to persons responsible for the intellectual or artistic content of the resource, to corporate bodies from which the content emanates, or to persons or corporate bodies responsible for the performance of the content of the resource).
scope note: Includes statements of responsibility taken from outside the resource, its container or accompanying textual matter; notes on variant or expanded forms of names of persons or corporate bodies, notes on pseudonyms, notes on persons or corporate bodies connected with the work that cannot be included in other areas of the description (because, for example, their function is not specified); statements of responsibility relating to appendices and other supplementary matter appearing on the resource but not on a prescribed source of information; notes on the staging, instrumentation, etc., of performed works; notes on persons or bodies connected with the technical production, administrative and consulting functions of the work.
scope note: Incluye menciones de responsabilidad tomadas de fuentes externas al recurso, su envase o información textual aneja; notas sobre las variantes o formas desarrolladas de nombres de personas o de entidades corporativas, notas sobre seudónimos, notas sobre personas o entidades corporativas relacionadas con la obra que no pueden incluirse en otras áreas de la descripción (porque, por ejemplo, no está especificada su función); menciones de responsabilidad relativas a los apéndices y a otros materiales complementarios que aparecen en el recurso pero no en la fuente de información prescrita; notas sobre puesta en escena, instrumentación, etc. de las obras representadas; notas sobre personas o entidades corporativas relacionadas con la producción técnica y las funciones administrativas y consultivas de la obra. @es

has note on system requirements
type: Property
domain: Resource
label: tiene nota de requisitos mínimos del sistema @es
sub property of: has note
name: hasNoteOnSystemRequirements
status: Published
definition: Relates a resource that is a direct access electronic resource to a note on system requirements for use of the resource.
definition: Relaciona un recurso electrónico de acceso directo con una nota sobre los requisitos del sistema para el uso del recurso. @es
scope note: Incluye una o más especificaciones técnicas, normalmente dadas en el siguiente orden y precedidas de la frase “Requisitos del sistema”: (o su equivalente en otra lengua): marca, modelo y/o número de serie del equipo o equipos; cantidad de memoria, nombre del sistema o sistemas operativos; requisitos de software (incluido el lenguaje de programación); periféricos; modificaciones (internas) de hardware; códigos de caracteres. Si el recurso está formado por dos o más soportes físicos diferentes (ej. un recurso multimedia formado por un disco electrónico y un videodisco), se puede redactar una nota sobre requisitos del sistema para cada uno, en la que se resalten las características distintivas del sistema asociado a cada soporte físico. Como alternativa, se puede hacer una única nota de requisitos del sistema para ambos soportes físicos. @es
scope note: Includes one or more technical specifications, usually given in the following order, and preceded by the phrase "System requirements:" (or its equivalent in another language): name, model and, or, number of machine or machines; amount of memory; name of the operating system or systems; software requirements (including programming language); peripherals; hardware (internal) modifications; character code. Separate system requirements notes may be made to highlight distinctive system features associated with each physical carrier, when the resource consists of two or more different physical carriers (e.g. a multimedia resource consisting of an electronic disk and a videodisc). Alternatively, a single system requirements note for both physical carriers may be made.

has note
type: Property
domain: Resource
label: tiene nota @es
has subproperty: has note on relationship between continuing resources
has subproperty: has note on relationship to other resources
has subproperty: has note on numbers
has subproperty: has note on change to edition
has subproperty: has note on material description
has subproperty: has note on contents
has subproperty: has note on statement of responsibility
has subproperty: has note on bibliographic history
has subproperty: has note on content form and media type
has subproperty: has note on title proper
has subproperty: has note on material type or resource specific type
has subproperty: has note on reproduction
has subproperty: has note on supplements, inserts, etc.
has subproperty: has note on use or audience
has subproperty: has note on basis of description
has subproperty: has note on parallel titles and parallel other title information
has subproperty: has note on frequency
has subproperty: has note on mode of access
has subproperty: has note on supplement to or insert in
has subproperty: has note on different editions
has subproperty: has note on resource identifier and terms of availability
has subproperty: has note providing a summary
has subproperty: has note on series and multipart monographic resources
has subproperty: has note on nature, scope, form, purpose or language
has subproperty: has note on bibliographic reference
has subproperty: has note on system requirements
has subproperty: has note on copy in hand
has subproperty: has note on translations
has subproperty: has note on binding
has subproperty: has note on edition area and bibliographic history
has subproperty: has note on publication, production, distribution, etc.
name: hasNote
status: Published
definition: Relates a resource to a note of descriptive information that has not been given in other areas of the description but that is considered to be important to users of bibliographic records.
definition: Relaciona un recurso con una nota de información descriptiva que no se ha dado en otras áreas de descripción pero que se considera importante para los usuarios de registros bibliográficos. @es
scope note: Notes qualify and amplify the description in the other areas and can deal with any aspect of a resource. Notes may also give the bibliographic history of the resource and indicate relationships to other resources. In making reference to another resource in a note, enough information must be given to identify the resource. This may vary depending on the resource and the context of the note. For continuing resources, the citation may consist of the key title and ISSN. In other cases, it may consist of the title proper along with a statement of responsibility or other bibliographic details. Two or more notes may be combined into a single note when considered appropriate by the cataloguing agency.
scope note: Las notas califican y amplian la descripción de las otras áreas y pueden relacionarse con cualquier aspecto del recurso. Las notas pueden referirse también a la historia bibliográfica del recurso e indicar relaciones con otros recursos. Al hacer referencia a otros recursos en una nota, debe darse suficiente información para identificar el recurso. Esto puede variar dependiendo del recurso y el contexto de la nota. Para recursos continuados, la cita puede consistir en el título clave y el ISSN. En otros casos, puede consistir en el título propiamente dicho junto con una mención de responsabilidad u otros detalles bibliográficos. Se puede combinar dos o más notas en una nota común cuando se considere apropiado por la agencia de catalogación. @es

has dimensions
type: Property
domain: Resource
label: tiene dimensiones @es
name: hasDimensions
status: Published
definition: Relates a resource to a note on its dimensions in centimetres (or millimetres if the gauge of a film or width of a tape) rounded up to the nearest whole.
definition: Relaciona un recurso con una nota sobre sus dimensiones en centímetros (o milímetros si se trata de la anchura de una película o cinta) redondeando al número entero más cercano. @es
scope note: Includes one or more dimensions. Includes the height of the resource, measured parallel to the spine, for printed textual and notated music resources. Includes the height by width of two-dimensional cartographic resources. Includes the height by width by depth of three-dimensional cartographic resources, excluding globes and sections of spheres. Includes the diameter for cartographic resources that are globes, sections of spheres, and two-dimensional circular forms. Includes additional dimensions such as the dimensions of a map when folded, or the dimensions of individual sheets of a collectively described group, or the individual dimensions of mounted sheets, of cartographic resources. Includes the height by width of two-dimensional multimedia resources, sound recordings, videorecordings, and still and moving images (wallcharts, microfiches, slides, transparencies, pictures, etc.). Includes the diameter, followed in parentheses by the abbreviation "diam." or its equivalent in another language, for circular forms of multimedia resources, sound recordings, videorecordings, and still and moving images. Includes the length of the vertical axis, followed in parentheses by "oval" or its equivalent, for oval forms of multimedia resources, sound recordings, videorecordings, and still and moving images. Includes two dimensions statements for the open and folded states of folded sheets of multimedia resources, sound recordings, videorecordings, and still and moving images. Includes height by width by depth (or height alone when appropriate) of three-dimensional multimedia resources, sound recordings, videorecordings, and still and moving images (dioramas, etc.). Includes the gauge of the film or width of the tape for multimedia resources, sound recordings, videorecordings, and still and moving images employing film or magnetic tape. Includes the dimensions of the physical carrier itself, irrespective of the external dimensions of any container, of electronic resources. Inclu…
scope note: Incluye una o más dimensiones. Incluye la longitud del recurso, medida paralelelamente al lomo, para recursos textuales impresos y música notada. Incluye la longitud por la anchura en recursos cartográficos bidimensionales. Incluye la longitud por la anchura por la profundidad en recursos cartográficos tridimensionales, excluyendo los globos terráqueos y secciones de esferas. Incluye el diámetro para recursos cartográficos que son globos, secciones de esferas y recursos circulares en dos dimensiones. Incluye dimensiones adicionales de recursos cartográficos como las dimensiones de un mapa plegado, o las dimensiones de hojas individuales de un grupo descrito colectivamente, o de dimensiones individuales de hojas montadas. Incluye la altura por la anchura de recursos multimedia bidimensionales, grabaciones sonoras, videograbaciones e imágenes fijas y en movimiento (murales, microfichas, diapositivas, transparencias, imágenes, etc). Incluye el diámetro, seguido entre paréntesis de la abreviatura “diam.” o su equivalente en otra lengua, para las formas circulares de recursos multimedia, grabaciones sonoras, videograbaciones, e imágenes fijas y en movimiento. Incluye la longitud del eje vertical, seguido entre paréntesis por “oval” o su equivalente, para formas ovales de recursos multimedia, grabaciones sonoras, videograbaciones e imágenes fijas y en movimiento. Incluye mención de dos dimensiones para el estado plegado o abierto de hojas plegadas de recursos multimedia, grabaciones sonoras, videograbaciones, e imágenes fijas y en movimiento. Incluye la altura por anchura por profundidad (o solamente la longitud cuando sea apropiado) de recursos multimedia tridimensionales, grabaciones sonoras, videograbaciones, e imágenes fijas y en movimiento (dioramas, etc.) Incluye la anchura de la película o cinta para recursos multimedia, grabaciones sonoras, videograbaciones e imágenes fijas y en movimiento empleados en películas o cintas magnéticas. Incluye las dimensiones de cual… @es

has media type
type: Property
domain: Resource
label: tiene tipo de medio @es
name: hasMediaType
status: Published
definition: Relates a resource to a category that records the type or types of carrier used to convey the content.
definition: Relaciona un recurso con una categoría que refleja el tipo o tipos de soportes utilizados para transmitir el contenido. @es
scope note: Categories generally reflect the format of the storage medium and housing of a carrier in combination with the type of intermediation device required to render, view, run, etc., the content of a resource.
scope note: Las categorías reflejan, en general, el formato del medio de almacenamiento y alojamiento de un soporte en combinación con el tipo de dispositivo de intermediación necesario para representar, ver, poner en funcionamiento, etc., el contenido de un recurso. @es

has music format statement area
type: Property
domain: Resource
label: tiene área de mención de formato musical @es
range: Music Format Statement Area Encoding Scheme
name: hasMusicFormatStatementArea
status: Published
definition: Relaciona un recurso que es música notada con una mención que incluye la mención de formato musical y las menciones de formato musical paralelas. @es
definition: Relates a resource that is notated music to a statement including the music format statement and parallel music format statements.

has parallel place of publication, production, distribution
type: Property
domain: Resource
label: tiene lugar paralelo de publicación, producción, distribución @es
name: hasParallelPaceOfPublicationProductionDistribution
status: Published
definition: Relaciona un recurso con el nombre de un lugar de publicación, producción y/o distribución en la lengua y escritura del título propiamente dicho cuando el nombre aparece en la fuente prescrita de información para el recurso en más de una lengua o escritura. @es
definition: Relates a resource to the name of the place of publication, production and/or distribution in the language and script of the title proper when the name appears on the prescribed source of information for the resource in more than one language or script.
scope note: If the criterion in the definition does not apply, the form of name made prominent by typography or, if there is no typographical distinction, the form of name that appears first is used.

has note on other relationships
type: Property
domain: Resource
label: tiene nota de otras relaciones @es
name: hasNoteOnOtherRelationships
status: Published
definition: Relates a resource to a note on other relationships between it and other resources, including the nature of the relationship, the title, the key title and ISSN of the other resource or resources.
definition: Relaciona un recurso con una nota sobre otras relaciones entre él y otros recursos, incluyendo la naturaleza de la relación, el título, título clave e ISSN del otro recurso o recursos. @es
scope note: Incluye recursos publicados conjuntamente y descritos por separado. @es
scope note: Includes resources published together and described separately.

Statement Of Printing Or Manufacture Encoding Scheme
type: Class
label: Esquema de codificación de mención de impresión o fabricación @es
subclass of: ISBD Syntax Encoding Scheme
name: StatementOfPrintingOrManufactureEncodingScheme
status: Published
definition: Esquema de codificación utilizado para la mención de impresión o fabricación. @es
definition: Syntax Encoding Scheme for the statement of printing or manufacture.

has note on bibliographic history
type: Property
domain: Resource
label: tiene nota de historia bibliográfica @es
sub property of: has note
name: hasNoteOnBibliographicHistory
status: Published
definition: Relates a resource to a note relating to the edition being described or the bibliographic history of the work.
definition: Relaciona un recurso con una nota relativa a la edición que se describe o a la historia bibliográfica de la obra. @es

has extent
type: Property
domain: Resource
label: tiene extensión @es
name: hasExtent
status: Published
definition: Relaciona un recurso con los nombres y números de la unidad o unidades físicas que constituyen el recurso. @es
definition: Relates a resource to the names and numbers of the physical unit or units constituting the resource.

has resource identifier
type: Property
domain: Resource
label: tiene identificador del recurso @es
has subproperty: has standard identifier
has subproperty: has fingerprint
has subproperty: has label name and catalogue number
name: hasResourceIdentifier
status: Published
definition: Relates a resource to an identifier.
scope note: Includes any number or alphanumeric designation associated with and identifying a resource according to an international standard, such as an International Standard Book Number or an International Standard Serial Number, or a designation assigned by a publisher. Includes notes considered important to users of the catalogue.
scope note: Incluye cualquier número o designación alfanumérica asociada que identifica un recurso de acuerdo a una norma internacional, como el International Standard Book Number o el International Standard Serial Number, o una denominación asignada por un editor. Incluye notas consideradas importantes para los usuarios del catálogo. @es

has additional edition statement
type: Property
domain: Resource
label: tiene mención de edición adicional @es
name: hasAdditionalEditionStatement
status: Published
definition: Relaciona un recurso a una mención que lo identifica como perteneciente a una edición o impresión dentro de una edición, o a una edición equivalente a la primera edición mencionada, o cuando el recurso presenta diferencias significativas de contenido con respecto a otras impresiones de la edición más amplia a la que pertenece. @es
definition: Relates a resource to a statement identifying it as belonging to an edition or impression within an edition, or to an edition that is equivalent to the first named edition, or when the resource has significant differences in content from other impressions of the larger edition to which it belongs.

is item reflected in
type: Property
domain: C1004
range: Resource
name: isItemReflectedIn
status: Published
inverse of: has item aspect
definition: Relates an item to a bibliographic resource that reflects it.

has parallel title statement of series or multipart monographic resource
type: Property
domain: Resource
name: hasParallelTitleStatementOfSeriesOrMultipartMonographicResource
status: Published
definition: Relates a resource that is a series or multipart monographic resource to a statement of its parallel title.

has parallel statement of responsibility of series or multipart monographic resource
type: Property
domain: Resource
label: tiene mención de responsabilidad paralela de serie o recurso monográfico multiparte @es
name: hasParallelStatementOfResponsibilityOfSeriesOrMultipartMonographicResource
status: Published
definition: Relaciona un recurso que es una publicación seriada o recurso monográfico multiparte con uno o más nombres, frases, o grupos de caracteres relativos a la identificación y/o función de cualquier persona o entidad corporativa responsable de contribuir a la creación o realización del contenido intelectual o artístico de una obra contenida en el recurso, presentada en la fuente de información preferida para el recurso como equivalente en otra lengua o escritura. @es
definition: Relates a resource that is a series or multipart monographic resource to one or more names, phrases, or groups of characters relating to the identification and/or function of any persons or corporate bodies responsible for or contributing to the creation or realisation of the intellectual or artistic content of a work contained in the resource, presented on the preferred source of information for the resource as an equivalent in another language or script.

has track configuration
type: Property
domain: Resource
label: tiene configuración de pistas @es
name: hasTrackConfiguration
status: Published
definition: Relaciona un recurso que es un rollo sonoro grabado en cuatro o más pistas con la configuración de sus pistas. @es
definition: Relates a resource that is a sound reel recorded on four or more tracks to its track configuration.

Resource Identifier Statement Encoding Scheme
type: Class
subclass of: ISBD Syntax Encoding Scheme
name: ResourceIdentifierStatementEncodingScheme
status: Published
definition: Syntax Encoding Scheme for the resource identifier statement.

Published
type: Concept

Publication, Production, Distribution, Etc Area Encoding Scheme
type: Class
label: Esquema de codificación del área de publicación, producción, distribución, etc. @es
subclass of: ISBD Syntax Encoding Scheme
name: PublicationProductionDistributionEtcAreaEncodingScheme
status: Published
definition: Esquema de codificación utilizado para el área de publicación, producción, distribución, etc. (Área 4). @es
definition: Syntax Encoding Scheme for the publication, production, distribution, etc. area (Area 4).

has reduction ratio
type: Property
domain: Resource
label: tiene proporción de reducción @es
name: hasReductionRatio
status: Published
definition: Relates a resource that is a microform to an indication of the reduction ratio.
definition: Relaciona un recurso que es una microforma con una indicación de su proporción de reducción. @es
scope note: Where possible the ratio is expressed numerically. The terms "low reduction" (up to 15x), "high reduction" (31x–60x), "very high reduction" (61x– 90x) and "ultra-high reduction" (91x and upwards) or their equivalents in another language and/or script are used in cases where the reduction ratio cannot be specified exactly.

has note on material description
type: Property
domain: Resource
label: tiene nota sobre descripción del material @es
sub property of: has note
name: hasNoteOnMaterialDescription
status: Published
definition: Relaciona un recurso con una nota sobre el área de descripción del material. @es
definition: Relates a resource to a note on the material description area.
scope note: Incluye incluir información adicional de la descripción física del recurso y menciones sobre peculiaridades físicas concretas. Las notas deben realizarse sobre el material anejo o sobre detalles físicos anteriores de un recurso integrable. @es
scope note: Includes additional physical description of the resource, and statements on particular physical peculiarities. Notes may also be made on accompanying material or on earlier physical details of an integrating resource.

has place of printing or manufacture
type: Property
domain: Resource
label: tiene lugar de impresión o fabricación @es
name: hasPlaceOfPrintingOrManufacture
status: Published
definition: Relaciona un recurso al nombre del lugar asociado en el recurso con su impresión o fabricación. @es
definition: Relates a resource to the name of the place associated on the resource with its printing or manufacture.

has common title of parallel title
type: Property
domain: Resource
label: tiene título común de título paralelo @es
name: hasCommonTitleOfParallelTitle
status: Published
definition: Relaciona un recurso con aquella parte del título que es común a un grupo de recursos relacionados, que además tiene sus diferentes títulos de sección, presentado como equivalente en otra lengua o escritura en la fuente de información preferida del recurso. @es
definition: Relates a resource to that part of the title that is carried by a group of related resources in addition to their different section titles, presented on the preferred source of information for the resource as an equivalent in another language or script.

has material or type of resource specific area
type: Property
domain: Resource
label: tiene área específica de material o tipo de recurso @es
range: Edition Area Encoding Scheme
name: hasMaterialOrTypeOfResourceSpecificArea
status: Published
definition: Relaciona un recurso con una mención que incluye datos que son exclusivos de una clase particular de material o tipo de recurso. @es
definition: Relates a resource to a statement including data that are unique to a particular class of material or type of resource.

has parallel other title information
type: Property
domain: Resource
label: tiene información complementaria del título paralela @es
sub property of: has title
name: hasParallelOtherTitleInformation
status: Published
definition: Relates a resource to other title information presented on the preferred source of information for the resource as an equivalent in another language or script.
definition: Relaciona un recurso con información complementaria del título que se presenta en la fuente de información preferida para el recurso como un equivalente en otra lengua o escritura. @es

has parallel music format statement
type: Property
domain: Resource
label: tiene mención de formato musical paralela @es
name: hasParallelMusicFormatStatement
status: Published
definition: Relaciona un recurso que es música notada con un equivalente en otra lengua lengua o escritura de la mención de formato musical (un término o frase que representa la forma física en la que se presenta). @es
definition: Relates a resource that is notated music to an equivalent of a music format statement (a term or phrase representing the physical form in which it is presented) in another language or script and presented as equivalent.

has note providing a summary
type: Property
domain: Resource
label: tiene nota de provisión de sumario @es
sub property of: has note
name: hasNoteProvidingASummary
status: Published
definition: Relates a resource to a note providing a factual, non-evaluative account of the subject coverage.
definition: Relaciona un recurso con una nota que proporciona un informe objetivo, no evaluativo, de la cobertura temática. @es
scope note: Puede basarse en las menciones encontradas en el recurso, en su envase o en el material textual que lo acompaña. También puede incluir información sobre el uso de técnicas o procedimientos especiales. @es
scope note: May draw upon statements found on the resource, its container or accompanying textual matter. Information on the use of special techniques or processes may also be included.

Specific Material Designation And Extent Encoding Scheme
type: Class
label: Esquema de codificación de designación específica del material y extensión @es
subclass of: ISBD Syntax Encoding Scheme
name: SpecificMaterialDesignationAndExtentEncodingScheme
status: Published
definition: Esquema de codificación utilizado para la designación específica del material y extensión. @es
definition: Syntax Encoding Scheme for the specific material designation and extent.

has statement of projection
type: Property
domain: Resource
label: tiene mención de proyección @es
name: hasStatementOfProjection
status: Published
definition: Relaciona un recurso cartográfico con el nombre y propiedades de un dibujo sistemático de líneas sobre una superficie plana que representa los paralelos de latitud y los meridianos de longitud de la Tierra o una sección de la Tierra u otra esfera celeste. @es
definition: Relates a resource that is cartographic to the name and properties of a systematic drawing of lines on a plane surface to represent the parallels of latitude and the meridians of longitude of the Earth or a section of the Earth or other celestial sphere.

has parallel title of series or multipart monographic resource
type: Property
domain: Resource
label: tiene título paralelo de serie o recurso monográfico multiparte @es
name: hasParallelTitleOfSeriesOrMultipartMonographicResource
status: Published
definition: Relaciona un recurso que es una serie o recurso monografico multiparte con un título en otra lengua o escritura diferente a la del título propiamente dicho y presentado como un equivalente del título propiamente dicho en la fuente preferida de información. @es
definition: Relates a resource that is a series or multipart monographic resource to a title in another language or script than the title proper and presented as an equivalent of the title proper on the preferred source of information.

has other title information
type: Property
domain: Resource
label: tiene información complementaria del título @es
sub property of: has title
name: hasOtherTitleInformation
status: Published
definition: Relates a resource to a word or phrase, or a group of characters, appearing in conjunction with, and subordinate to, the title proper of the resource.
definition: Relaciona un recurso con una palabra oexpresión, o grupo de caracteres que aparecen en conjunción con y subordinados al título propiamente dicho del recurso. @es
scope note: La información complementaria del título puede incluir variantes de título que aparecen en la misma fuente que el título propiamente dicho. @es
scope note: Other title information can include variant titles appearing on the same source as the title proper.

has expression aspect
type: Property
domain: Resource
range: C1002
name: hasExpressionAspect
status: Published
inverse of: is expression reflected in
definition: Relates a bibliographic resource to an expression reflected in it.

has name of publisher, producer, distributor statement
type: Property
domain: Resource
label: tiene mención del nombre del editor, productor o distribuidor @es
range: Name Of Publisher, Producer, Distributor Statement Encoding Scheme
name: hasNameOfPublisherProducerDistributorStatement
status: Published
definition: Relaciona un recurso con una mención que incluye el nombre del editor, productor, distribuidor y la mención de editor, productor, distribuidor paralela. @es
definition: Relates a resource to a statement including the name of publisher, producer, distributor, and the parallel statement of publisher, producer, distributor.

has dependent title of series or multipart monographic resource
type: Property
domain: Resource
label: tiene título dependiente de serie o recurso monográfico multiparte @es
name: hasDependentTitleOfSeriesOrMultipartMonographicResource
status: Published
definition: Relaciona un recurso que es una serie o recurso monográfico multiparte con un título que por sí mismo es insuficiente para identificar el recurso y que requiere la adición del título común, o el título del recurso principal o el título de la serie principal. @es
definition: Relates a resource that is a series or multipart monographic resource to a title that by itself is insufficient to identify the resource and that requires the addition of the common title, or the title of the main resource or the title of the main series.

has playing speed
type: Property
domain: Resource
label: tiene velocidad de reproducción @es
name: hasPlayingSpeed
status: Published
definition: Relaciona un recurso con su velocidad de reproducción. @es
definition: Relates a resource to its playing speed.

has note on reproduction
type: Property
domain: Resource
label: tiene nota de reproducción @es
sub property of: has note
name: hasNoteOnReproduction
status: Published
definition: Relaciona un recurso que es una reproducción exacta de otro recurso con una nota sobre el título del recurso original (cuando es diferente del de la reproducción) y sus datos de publicación. @es
definition: Relates a resource that is is an exact reproduction of another resource to a note on the title of the original resource (when different from the title of the reproduction) and its publication details.
scope note: Includes facsimile reproductions or other photographic (or micro-) reproductions of a printed title, sound cassette copies of a sound disc, videotape reproductions of a motion picture, digitisations. Includes the frequency of the original resource.
scope note: Se incluyen reproducciones facsimilares u otras reproducciones fotográficas o micro-reproducciones de un título impreso, copias en cassette de un disco de sonoro, reproducciones en cita de vídeo de una película, digitalizaciones. Se incluye la frecuencia del recurso original. @es

ISBD Syntax Encoding Scheme
type: Class
label: Esquema de codificación de sintaxis ISBD @es
subclass of: Datatype
has sub class: Series And Multipart Monographic Resource Area Encoding Scheme
has sub class: Resource Identifier Statement Encoding Scheme
has sub class: Terms Of Availability Statement Encoding Scheme
has sub class: Content Form And Media Type Statement Encoding Scheme
has sub class: Note Area Encoding Scheme
has sub class: Material Description Area Encoding Scheme
has sub class: Compound Title Of Parallel Title Encoding Scheme
has sub class: Name Of Publisher, Producer, Distributor Statement Encoding Scheme
has sub class: Edition Area Encoding Scheme
has sub class: Publication, Production, Distribution, Etc Area Encoding Scheme
has sub class: Material Or Type Of Resource Specific Area Encoding Scheme
has sub class: Title Proper (Compound) Of Series Or Multipart Monographic Resource Encoding Scheme
has sub class: Parallel Title (Compound) Of Series Or Multipart Monographic Resource Encoding Scheme
has sub class: Title And Statement Of Responsibility Area Encoding Scheme
has sub class: Place Of Publication, Production, Distribution Statement Encoding Scheme
has sub class: Other Physical Details Encoding Scheme
has sub class: Statement Of Coordinates And Equinox Encoding Scheme
has sub class: Compound Title Of Title Proper Encoding Scheme
has sub class: Specific Material Designation And Extent Encoding Scheme
has sub class: Content Form And Media Type Area Encoding Scheme
has sub class: Statement Of Printing Or Manufacture Encoding Scheme
has sub class: Numbering Area Encoding Scheme
has sub class: Mathematical Data Area Encoding Scheme
has sub class: Music Format Statement Area Encoding Scheme
has sub class: Resource Identifier And Terms Of Availability Area Encoding Scheme
name: ISBDSyntaxEncodingScheme
status: Published
definition: Esquema de codificación de sintaxis utilizado en la Descripción Bibliográfica Internacional Normalizada (ISBD). @es
definition: Syntax encoding scheme used by International Standard Bibliographic Description (ISBD).

has qualification to identifier
type: Property
domain: Resource
label: tiene aclaración para el identificador @es
name: hasQualificationToIdentifier
status: Published
definition: Relaciona un recurso con una breve mención que califica, explica o corrige el identificador. @es
definition: Relates a resource to a brief statement that qualifies, explains, or corrects the identifier.

has composition of material
type: Property
domain: Resource
label: tiene composición de material @es
name: hasCompositionOfMaterial
status: Published
definition: Relaciona un recurso con una palabra o frase que indica el material del que está compuesto. @es
definition: Relates a resource to a word or phrase indicating the material of which it is composed.

has music format statement
type: Property
domain: Resource
label: tiene mención de formato musical @es
name: hasMusicFormatStatement
status: Published
definition: Relates a resource that is notated music to a term or phrase representing the physical form in which it is presented.
definition: Relaciona un recurso de música notada con un término o frase que representa la forma física en la cual se presenta. @es
scope note: Incluye partitura, partes. También se le conoce como formato de presentación musical. @es
scope note: Includes score, parts. Also known as musical presentation format.

has parallel title (compound) of series or multipart monographic resource
type: Property
domain: Resource
label: tiene título paralelo (compuesto) de serie o recurso monográfico multiparte @es
range: Parallel Title (Compound) Of Series Or Multipart Monographic Resource Encoding Scheme
name: hasParallelTitleCompoundOfSeriesOrMultipartMonographicResource
status: Published
definition: Relates a resource that is a series or multipart monograph to a title consisting of a common title and a dependent title, with or without a dependent title designation, in another language or script than the title proper and presented as an equivalent of the title proper on the prescribed source or sources of information.

has numeric designation
type: Property
domain: Resource
label: tiene designación numérica @es
name: hasNumericDesignation
status: Published
definition: Relaciona un recurso que es una publicación seriada con su designación numérica. @es
definition: Relates a resource that is a serial to its numeric designation.
scope note: A numeric designation is given as it appears, except that arabic numerals are given in place of other numerals or spelled-out numbers and multiple levels of numbering are given in a hierarchical order. A numeric designation may include alphabetic or other characters as well as numbers. Words in the designation may be abbreviated.
scope note: Una designación numérica se da tal y como aparezca, excepto que se dan números arábigos en lugar de números no arábigos o números expresados textualente y numeraciones en múltiples niveles que sean dadas en order jerárquico. Una designación numérica puede incluir letras u otros caracteres además de números. Las palabras de la designación pueden abreviarse. @es

has noise reduction
type: Property
domain: Resource
label: tiene reducción de ruido @es
name: hasNoiseReduction
status: Published
definition: Relaciona un recurso con la reducción de ruido que emplea. @es
definition: Relates a resource to the noise reduction it employs.

Note Area Encoding Scheme
type: Class
label: Esquema de codificación del área de notas @es
subclass of: ISBD Syntax Encoding Scheme
name: NoteAreaEncodingScheme
status: Published
definition: Esquema de codificación utilizado para el área de notas (Área 7). @es
definition: Syntax Encoding Scheme for the note area (Area 7).

has note on bibliographic reference
type: Property
domain: Resource
label: tiene nota de referencia bibliográfica @es
sub property of: has note
name: hasNoteOnBibliographicReference
status: Published
definition: Relates a resource that is an older monographic resource to a citation, given in a standard and abbreviated form, to a description of the resource in a list describing older monographic resources.
definition: Relaciona un recurso monográfico antiguo con una cita, de forma abreviada y normalizada de la descripción del recurso, en una lista que describe recursos monográficos antiguos. @es
scope note: The note may contain more than one citation.
scope note: La nota debe contener más de una cita. @es

has specific material designation and extent
type: Property
domain: Resource
label: tiene designación específica del material y extensión @es
range: Specific Material Designation And Extent Encoding Scheme
name: hasSpecificMaterialDesignationAndExtent
status: Published
definition: Relates a resource to a statement including the specific material designation, the extent, the pagination statement (if a printed resource), and the playing time (if the resource has an inherent durational aspect).
definition: Relaciona un recurso con una mención incluyendo la designación específica de material, la extension, la mención de paginación (si es un recurso impreso) y la duración (si el recurso tiene un aspecto inherente de duración).

has content form
type: Property
domain: Resource
label: tiene forma del contenido @es
name: hasContentForm
status: Published
definition: Relaciona un recurso con una categoría que refleja la forma o formas fundamentales en que se expresa el contenido. @es
definition: Relates a resource to a category that reflects the fundamental form or forms in which the content is expressed.

has content form and media type statement
type: Property
domain: Resource
label: tiene mención de forma del contenido y de tipo de medio @es
range: Content Form And Media Type Statement Encoding Scheme
name: hasContentFormAndMediaTypeStatement
status: Published
definition: Relaciona un recurso con una mención que comprende tres elementos, cada uno tomado de listas cerradas: la forma del contenido, que son uno o más términos que reflejan la forma o formas fundamentales en que se expresa el contenido del recurso; la calificación del contenido, que especifica el tipo, naturaleza sensorial, dimensiones y/o la presencia/ausencia de movimiento en el recurso que se describe; y el tipo de medio, que indica el tipo o tipos de soporte utilizados para transmitir el contenido del recurso. @es
definition: Relates a resource to a statement comprising three elements, each taken from closed lists: the content form, one or more terms reflecting the fundamental form or forms in which the content of a resource is expressed; the content qualification, specifying the type, sensory nature, dimensionality, and/or presence or absence of motion for the resource being described; and the media type, indicating the type or types of carrier used to convey the content of the resource.

has series and multipart monographic resource area
type: Property
domain: Resource
label: tiene área de serie y recurso monográfico multiparte @es
range: Series And Multipart Monographic Resource Area Encoding Scheme
name: hasSeriesAndMultipartMonographicResourceArea
status: Published
definition: Relaciona un recurso con una mención que incluye el título propiamente dicho de una serie o recurso monográfico multiparte, el título paralelo de la serie o recurso monográfico multiparte, la información complementaria del título de la serie o recurso monográfico multiparte, la información complementaria del título paralela de la serie o recurso monográfico multiparte, la mención de resposabilidad relativa a la serie o recurso monográfico multiparte, la mención de resposabilidad paralela de la serie o recurso monográfico multiparte, el numero internacional normalizado de la serie o recurso monográfico multiparte y la numeración de la serie o recurso monográfico multiparte. @es
definition: Relates a resource to a statement including the title proper of a series or multipart monographic resource, the parallel title of a series or multipart monographic resource, the other title information of a series or multipart monographic resource, the parallel other title information of a series or multipart monographic resource, the statement of responsibility relating to a series or multipart monographic resource, the parallel statement of responsibility relating to a series or multipart monographic resource, the international standard number of a series or multipart monographic resource, and the numbering within a series or multipart monographic resource.

has parallel additional edition statement
type: Property
domain: Resource
label: tiene mención de edición adicional paralela @es
name: hasParallelAdditionalEditionStatement
status: Published
definition: Relaciona un recurso con una palabra o frase, o grupo de caracteres que indican que el recurso pertenece a una edición que se presenta en la fuente de información preferida para el recurso y que se muestra como equivalente en otra lengua o escritura. @es
definition: Relates a resource to a word or phrase, or a group of characters, indicating that a resource belongs to an edition presented on the preferred source of information for the resource as an equivalent in another language or script.

has bibliographic format of older monographic resource
type: Property
domain: Resource
label: tiene formato bibliográfico de recurso monográfico antiguo @es
name: hasBibliographicFormatOfOlderMonographicResource
status: Published
definition: Relaciona un recurso que es un recurso monográfico antiguo con una designación normalizada elegida por la agencia de catalogación. @es
definition: Relates a resource that is an older monographic resource to a standard designation as chosen by the cataloguing agency.
scope note: Por ejemplo: 1º, 2º, 4º, 8º, 12º, etc. Incluye la altura de la cubierta exterior de la publicación, medida paralelamente al lomo, o la del recurso cuando no está encuadernado, si se puede establecer que el recurso tiene una encuadernación normalizada del editor. Incluye el formato supuesto, seguido de interrogación, cuando no se ha podido determinar el formato. Se excluyen las dimensiones si no se puede establecer que el recurso tiene la encuadernación o envoltorio normalizado por el editor. @es
scope note: e.g. 1 °, 2 °, 4 °, 8 °, 12 °, etc. Includes the height of the outer case, measured parallel to the spine, or of the resource when it is not bound, if it can be established that the resource is in a standardized publisher's binding or in publisher's wrappers. Includes the assumed format followed by a question mark when the format cannot be determined. Excludes dimensions if it cannot be established that the resource is in a standardized publisher's binding or in publisher's wrappers.

has note on relationship between continuing resources
type: Property
domain: Resource
label: tiene nota de relación entre recursos continuados @es
sub property of: has note
name: hasNoteOnRelationshipBetweenContinuingResources
status: Published
definition: Relates a resource that is a continuing resource to a note on a continuing resource that it is related to.
definition: Relaciona un recurso que es un recurso continuado con una nota sobre otro recurso continuado con el que está relacionado. @es

has terms of availability statement
type: Property
domain: Resource
range: Terms Of Availability Statement Encoding Scheme
name: hasTermsOfAvailabilityStatement
status: Published
definition: Relates a resource to a statement of terms of availability.

Place Of Publication, Production, Distribution Statement Encoding Scheme
type: Class
label: Esquema de codificación de mención de lugar de publicación, producción o distribución @es
subclass of: ISBD Syntax Encoding Scheme
name: PlaceOfPublicationProductionDistributionStatementEncodingScheme
status: Published
definition: Esquema de codificación utilizada para la mención de lugar de publicación, producción o distribución. @es
definition: Syntax Encoding Scheme for the place of publication, production, distribution statement.

has right ascension and declination
type: Property
domain: Resource
label: tiene ascensión recta y declinación @es
sub property of: has coordinates
name: hasRightAscensionAndDeclination
status: Published
definition: Relaciona un recurso cartográfico con su ascensión recta (la distancia angular medida desde el Equinoccio de primavera hacia el Este a lo largo del Ecuador, al círculo horario a través del cuerpo celeste, en valores de 0 a 24 horas) y la declinación (la distancia angular de un cuerpo sobre la esfera celeste medida en 90 grados Norte o Sur, con el Ecuador celeste a través del círculo horario del cuerpo celeste; comparable a la latitud de la esfera terrestre). @es
definition: Relates a resource that is cartographic to its right ascension (the angular distance measured eastward on the Equator from the vernal equinox to the hour circle through the celestial body, from 0 to 24 hours), and declination (the angular distance to a body on the celestial sphere measured north or south through 90 degrees from the celestial equator along the hour circle of the body; comparable to latitude on the terrestrial sphere).
scope note: Aplicar también a las cartas celestes. @es
scope note: Applies also to celestial charts.

has international standard number of series or multipart monographic resource
type: Property
domain: Resource
label: tiene número normalizado internacional de serie o recurso monográfico multiparte @es
name: hasInternationalStandardNumberOfSeriesOrMultipartMonographicResource
status: Published
definition: Relaciona un recurso que es una serie o recurso monográfico multiparte con un número normalizado internacional relacionado con él. @es
definition: Relates a resource that is a series or multipart monographic resource to an international standard number relating to it.

has work aspect
type: Property
domain: Resource
range: C1001
name: hasWorkAspect
status: Published
inverse of: is work reflected in
definition: Relates a bibliographic resource to a work reflected in it.

has parallel edition statement
type: Property
domain: Resource
label: tiene mención de edición paralela @es
name: hasParallelEditionStatement
status: Published
definition: Relaciona un recurso con un equivalente de la mención de edición (término, frase o grupo de caracteres que indican que el recurso pertenece a una edición) en otra lengua o escritura. @es
definition: Relates a resource to an equivalent of an edition statement (a word or phrase, or a group of characters, indicating that the resource belongs to an edition) in another language or script.

has parallel title statement
type: Property
domain: Resource
name: hasParallelTitleStatement
status: Published
definition: Relates a resource to a statement of its parallel title.

has addition to parallel place of publication
type: Property
domain: Resource
label: tiene adición al lugar de publicación paralelo @es
name: hasAdditionToParallelPlaceOfPublication
status: Published
definition: Relaciona un recurso con el nombre de un lugar de mayor rango como por ejemplo, páis, estado, etc., y, si se considera necesario para la identificación, la dirección completa del editor, productor o distribuidor, en la lengua y escritura del título propiamente dicho cuando el nombre aparece en la fuente prescrita de información para el recurso en más de una lengua o escritura. @es
definition: Relates a resource to the name of a larger place such as a country, state, etc. and, if it is considered necessary for identification, the full address of the publisher, producer or distributor, in the language and script of the title proper when the name appears on the prescribed source of information for the resource in more than one language or script.

has groove size
type: Property
domain: Resource
label: tiene tamaño del surco @es
name: hasGrooveSize
status: Published
definition: Relaciona un recurso que es un disco sonoro analógico con el tamaño del surco. @es
definition: Relates a resource that is an analogue sound disc to its groove size.

Content Form And Media Type Statement Encoding Scheme
type: Class
label: Esquema de codificación de mención de forma del contenido y de tipo de medio @es
subclass of: ISBD Syntax Encoding Scheme
name: ContentFormAndMediaTypeStatementEncodingScheme
status: Published
definition: Esquema de codificación utilizado para el mención de forma del contenido y de tipo de medio. @es
definition: Syntax Encoding Scheme for the content form and media type statement.

Edition Area Encoding Scheme
type: Class
label: Esquema de codificación del área de edición @es
subclass of: ISBD Syntax Encoding Scheme
name: EditionAreaEncodingScheme
status: Published
definition: Esquema de codificación utilizado para el área de edición (Área 2). @es
definition: Syntax Encoding Scheme for the edition area (Area 2).

has statement of responsibility relating to an additional edition statement
type: Property
domain: Resource
label: tiene mención de responsabilidad relativa a una mención de edición adicional @es
name: hasStatementOfResponsibilityRelatingToAnAdditionalEditionStatement
status: Published
definition: Relaciona un recurso a uno o más nombres, frases o grupo de caracteres relacionados con la identificación y/o función de personas o entidades corporativas responsables de, o que contribuyen a, la creación o realización del contenido intelectual o artístico de una mención de edición adicional de una obra contenida en el recurso. @es
definition: Relates a resource to one or more names, phrases, or groups of characters relating to the identification and/or function of any persons or corporate bodies responsible for or contributing to the creation or realisation of the intellectual or artistic content of an additional edition statement of a work contained in the resource.

has note on material type or resource specific type
type: Property
domain: Resource
label: tiene nota sobre tipo de material o tipo específico de recurso @es
sub property of: has note
name: hasNoteOnMaterialTypeOrResourceSpecificType
status: Published
definition: Relaciona un recurso con una nota sobre el área de material o tipo específico de recurso. @es
definition: Relates a resource to a note on the material or type of resource specific area.

has name of publisher, producer, distributor
type: Property
domain: Resource
label: tiene nombre de editor, productor, distribuidor @es
name: hasNameOfPublisherProducerDistributor
status: Published
definition: Relaciona un recurso con el nombre de la persona o entidad corporativa que aparece en el recurso que lleva a cabo, respectivamente, la publicación, producción y/o distribución o las actividades de difusión del recurso. @es
definition: Relates a resource to the name of the person or corporate body appearing on the resource that effects respectively the publication, production and/or distribution or release activities for the resource.

has parallel dependent title designation of series or multipart monographic resource
type: Property
domain: Resource
label: tiene designación de título dependiente paralelo de serie o recurso monográfico multiparte @es
name: hasParallelDependentTitleDesignationOfSeriesOrMultipartMonographicResource
status: Published
definition: Relaciona un recurso que es una serie o un recurso monográfico multiparte con la numeración que por sí sola o en conjunción con un título dependiente sirve para distinguir un recurso de dos o más recursos relacionados que tienen un título común, presentada como equivalente en otra lengua o escritura en la fuente de información preferida del recurso. @es
definition: Relates a resource that is a series or multipart monographic resource to numbering that alone or in conjunction with a dependent title serves to distinguish one of two or more related resources having a common title, presented on the preferred source of information for the resource as an equivalent in another language or script.

has title and statement of responsibility area
type: Property
domain: Resource
label: tiene área de título y mención de responsabilidad @es
range: Title And Statement Of Responsibility Area Encoding Scheme
name: hasTitleAndStatementOfResponsibilityArea
status: Published
definition: Relates a resource to a statement including the title proper, parallel titles, other title information, and statements of responsibility.
definition: Relaciona un recurso con una mención que incluye el título propiamente dicho, títulos paralelos, información complementaria del título y menciones de responsabilidad. @es

has dependent title of title proper
type: Property
domain: Resource
label: tiene título dependiente de título propiamente dicho @es
name: hasDependentTitleOfTitleProper
status: Published
definition: Relates a resource to a title that by itself is insufficient to identify the resource and that requires the addition of the common title, or the title of the main resource or the title of the main series.
definition: Relaciona un recurso con un título que por sí mismo es insuficiente para identificar el recurso y que requiere la adición del título común, o del título del recurso principal o del título de la serie principal. @es
scope note: Ejemplos de esto son los títulos de sección, algunos títulos de hojas individuales de series de mapas, algunos títulos de suplementos, algunos títulos de subseries y los títulos de algunas partes de un recurso monográfico multiparte. @es
scope note: Examples are section titles, some titles of individual sheets of a map series, some supplement titles and some titles of subseries and the titles of some parts of a multipart monographic resource.

has title of individual work by same author
type: Property
domain: Resource
label: tiene título de obra individual del mismo autor @es
sub property of: has title
name: hasTitleOfIndividualWorkBySameAuthor
status: Published
definition: Relaciona un recurso con el título de una obra individual cuando el recurso se compone de dos o más obras sin título colectivo. @es
definition: Relates a resource to the title of an individual work when the resource comprises two or more works without a collective title.

Music Format Statement Area Encoding Scheme
type: Class
label: Esquema de codificación del área de mención de formato musical @es
subclass of: ISBD Syntax Encoding Scheme
name: MusicFormatStatementAreaEncodingScheme
status: Published
definition: Esquema de codificación utilizado para el área de mención de formato musical (Área 3 para recursos de música notada). @es
definition: Syntax Encoding Scheme for the music format statement area (Area 3 for notated music resources).

has note on mode of access
type: Property
domain: Resource
label: tiene nota sobre modo de acceso @es
sub property of: has note
name: hasNoteOnModeOfAccess
status: Published
definition: Relates a resource that is a remote access electronic resource to a note on the mode of access, preceded by the phrase "Mode of access:" (or its equivalent in another language).
definition: Relaciona un recurso electrónico remotocon una nota sobre el modo de acceso, precedido de la frase “Modo de acceso:” (o su equivalente en otra lengua). @es

has note on copy in hand
type: Property
domain: Resource
label: tiene nota sobre el ejemplar que se describe @es
label: Incluye notas relativas a las características físicas del ejemplar, notas relativas a ejemplares “encuadernados con”, notas de procedencia y notas de acción. @es
sub property of: has note
name: hasNoteOnCopyInHand
status: Published
definition: Relaciona un recurso con una nota sobre el ejemplar que se está catalogando. @es
definition: Relates a resource to a note on the copy being catalogued.
scope note: Includes notes relating to the physical characteristics of the copy, notes relating to "bound with" copies, provenance notes, and action notes.

has accompanying material statement
type: Property
domain: Resource
label: tiene mención de material anejo @es
name: hasAccompanyingMaterialStatement
status: Published
definition: Relaciona un recurso con una mencion de material anejo (cualquier parte separada físicamente del recurso que se ha publicado (o existe intención de que se publique) al mismo tiempo y destinado para ser utilizado con el recurso). @es
definition: Relates a resource to a statement on accompanying material (any physically separable part of the resource that is issued (or intended to be issued) at the same time and intended to be used with the resource).

has title proper
type: Property
domain: Resource
label: tiene título propiamente dicho @es
sub property of: has title
name: hasTitleProper
status: Published
definition: Relates a resource to the title proper (the chief name of a resource, i.e. the title of a resource in the form in which it appears on the preferred source of information for the resource).
definition: Relaciona un recurso con el título propiamente dicho (el nombre principal de un recurso, es decir, el título de un recurso en la forma en la que aparece en la fuente preferida de información para el recurso). @es
scope note: The title proper includes any alternative title, but excludes parallel titles and other title information. In the case of a section or some supplements and some titles of subseries or parts, the title proper can consist of two or more components: the common title (or the title of the main series or of the multipart monographic resource), the dependent title and the dependent title designation. For resources containing several individual works the title proper is the collective title. Resources containing several individual works and lacking a collective title are considered not to have a title proper. A series or subseries also has its own title proper.
scope note: El título propiamente dicho incluye cualquier título alternativo, pero excluye títulos paralelos e información complementaria del título. En el caso de una sección o algunos suplementos y algunos títulos de subseries o partes, el título propiamente dicho puede consistir en dos o más componentes: el título común (o el título de la serie principal o del recurso monográfico multiparte), el título dependiente y la designación del título dependiente. Para recursos que contienen varias obras individuales, el título propiamente dicho es el título colectivo. Se considera que un recurso no tiene título propiamente dicho cuando contiene varias obras individuales y no existe un título colectivo. Una serie o subserie tiene también su títulopropiamente dicho. @es

has statement of printing or manufacture
type: Property
domain: Resource
label: tiene mención de impresión o fabricación @es
range: Statement Of Printing Or Manufacture Encoding Scheme
name: hasStatementOfPrintingOrManufacture
status: Published
definition: Relates a resource to a statement including the place of printing or manufacture, the name of printer or manufacturer, and the date of printing or manufacture.
definition: Relaciona un recurso con una mención que incluye el lugar de impresión o fabricación, el nombre del impresor o fabricante y la fecha de impresión o fabricación. @es

has specific material designation
type: Property
domain: Resource
label: tiene designación específica del material @es
name: hasSpecificMaterialDesignation
status: Published
definition: Relaciona un recurso con un término que indica la clase específica de material (generalmente la clase de objeto físico) al que pertenece, y el número de unidades. @es
definition: Relates a resource to a term indicating the specific class of material (usually the class of physical object) to which it belongs, and the number of units.

has resource identifier statement
type: Property
domain: Resource
range: Resource Identifier Statement Encoding Scheme
name: hasResourceIdentifierStatement
status: Published
definition: Relates a resource to a statement of its identifier.

Compound Title Of Title Proper Encoding Scheme
type: Class
label: Esquema de codificación del título compuesto de título propiamente dicho @es
subclass of: ISBD Syntax Encoding Scheme
name: CompoundTitleOfTitleProperEncodingScheme
status: Published
definition: Esquema de codificación utilizado para el título compuesto del título propiamente dicho. @es
definition: Syntax Encoding Scheme for the compound title of the title proper.

has note on translations
type: Property
domain: Resource
label: tiene nota de traducciones @es
sub property of: has note
name: hasNoteOnTranslations
status: Published
definition: Relates a resource that contains a work that is a translation to a note on the original title of the work, or, where appropriate, the key title and ISSN.
definition: Relaciona un recurso que contiene una obra que es una traducción con una nota sobre el título original de la obra o, cuando sea apropiado, el título clave e ISSN. @es
scope note: La notas sobre traducciones se pueden incluir en las notas sobre contenido cuando el recurso contiene varias obras individuales. Se excluyen notas sobre la lengua del título. Se excluyen notas sobre ediciones de un recurso que aparecen simultáneamente en varias lenguas. @es
scope note: Notes on translations may be included in the notes on contents when the resource contains several individual works. Excludes notes on the language of the title. Excludes notes on editions of a resource appearing simultaneously in different languages.

has fingerprint
type: Property
domain: Resource
label: tiene identificador tipográfico @es
sub property of: has resource identifier
name: hasFingerprint
status: Published
definition: Relaciona un recurso monográfico antiguo con un número de caracteres procedentes de un número regulado de lugares en el texto de un recurso, considerado como un sustituto de un número normalizado. @es
definition: Relates a resource that is an older monographic resource to a number of characters drawn from a number of uniform places in the text of the resource, considered as a substitute for a standard number.
scope note: Todavía tiene que determinarse por acuerdo internacional una fórmula definitiva para el identificador tipográfico. Hasta que se lleve a cabo ese acuerdo, se pueden utilizar las diferentes formas de identificadores tipográficos. @es
scope note: A definitive formula for fingerprint has yet to be determined by international agreement. Until such an agreement is made, various forms of fingerprint can be used.

has pagination
type: Property
domain: Resource
label: tiene paginación @es
name: hasPagination
status: Published
definition: Relaciona un recurso de texto impreso con la numeración secuencial de páginas. @es
definition: Relates a resource that is a printed text to the sequential numbering of the pages.
scope note: Incluye la numeración de hojas, columnas, etc. @es
scope note: Includes notated music and cartographic resources as well as printed textual resources.
scope note: Includes the numbering of leaves, columns, etc.

has key title
type: Property
domain: Resource
label: tiene título clave @es
name: hasKeyTitle
status: Published
definition: Relates a resource that is a continuing resource to the unique name assigned to it by the ISSN Network.
definition: Relaciona un recurso continuado con un nombre único que le ha asignado la Red ISSN. @es
scope note: El título clave se da incluso si es idéntico al título propiamente dicho del recurso continuado. No se da si el ISSN al que se aplica no aparece. @es
scope note: The key title is given even when it is identical to the title proper of the continuing resource. It is not given if the ISSN to which it applies is not given.

has title
type: Property
domain: Resource
label: tiene título @es
has subproperty: has title of individual work by different author
has subproperty: has parallel title
has subproperty: has other title information
has subproperty: has parallel other title information
has subproperty: has title of individual work by same author
has subproperty: has title proper
name: hasTitle
status: Published
definition: Relaciona un recurso con una palabra, frase, o grupo de caracteres que normalmente aparecen en el recurso, que es el nombre del recurso o de la obra (o cualquiera de un grupo de obras individuales) contenida en él. @es
definition: Relates a resource to a word or phrase, or a group of characters, usually appearing on the resource, that is the name of the resource or the work (or any one of a group of individual works) contained in it.
scope note: A title proper; a title of individual work by the same author in a resource lacking a collective title; a title of an individual work by a different author in a resource lacking a collective title; a parallel title; other title information; or parallel other title information.
scope note: Un título propiamente dicho, un título de obra individual por el mismo autor en un recurso que carece de titulo colectivo; un título de una obra individual por un autor diferente en un recurso que carece de título colectivo; un título paralelo; información complementaria de título; u otra información complementaria de título paralelo. @es

is manifestation reflected in
type: Property
domain: C1003
range: Resource
name: isManifestationReflectedIn
status: Published
inverse of: has manifestation aspect
definition: Relates a manifestation to a bibliographic resource that reflects it.

has standard identifier
type: Property
domain: Resource
label: tiene identificador normalizado @es
sub property of: has resource identifier
name: hasStandardIdentifier
status: Published
definition: Relates a resource to a standard identifier preceded by its customary label.
definition: Relaciona un recurso con un identificador normalizado precedido de su etiqueta convencional. @es
scope note: Customary labels include "ISBN", "ISSN", "ISMN".
scope note: Como etiquetas convencionales se incluyen “ISBN”, “ISSN”, “ISMN”. @es

has number of sound channels
type: Property
domain: Resource
label: tiene número de canales de sonido @es
name: hasNumberOfSoundChannels
status: Published
definition: Relaciona un recurso con el número de sus canales de sonido. @es
definition: Relates a resource to the number of its sound channels.

Material Description Area Encoding Scheme
type: Class
label: Esquema de codificación del área de descripción material @es
subclass of: ISBD Syntax Encoding Scheme
name: MaterialDescriptionAreaEncodingScheme
status: Published
definition: Esquema de codificación utilizado para el área de descripción material (Área 5). @es
definition: Syntax Encoding Scheme for the material description area (Area 5).

has presence or absence of sound
type: Property
domain: Resource
label: tiene presencia o ausencia de sonido @es
name: hasPresenceOrAbsenceOfSound
status: Published
definition: Relaciona un recurso que incluye sonido como una característica integral con las abreviaturas “son.” (para “sonoro”) o “sil.” (para “silencio”) (o sus equivalentes en otra lengua). @es
definition: Relates a resource that includes sound as an integral feature to the abbreviations "sd." (for sound) or "si." (for silent) (or their equivalents in another language).
scope note: Omitted if the presence of sound is implicit in the specific material designation.
scope note: Se omite si la presencia de sonido está implícita en la designación específica del material. @es

has note on series and multipart monographic resources
type: Property
domain: Resource
label: tiene nota de serie o recurso monográfico multiparte @es
sub property of: has note
name: hasNoteOnSeriesAndMultipartMonographicResources
status: Published
definition: Relaciona un recurso con una nota sobre el área de serie y recurso monográfico. @es
definition: Relates a resource to a note on the series and monographic resources area.
scope note: Incluye notas que dan información sobre la serie o recurso monográfico multiparte en el que el recurso ha sido publicado, y notas sobre los editores de la serie. @es
scope note: Includes notes giving information about a series or multipart monographic resource in which the resource has been issued, and notes on series editors.

has name of printer or manufacturer
type: Property
domain: Resource
label: tiene nombre de impresor o fabricante @es
name: hasNameOfPrinterOrManufacturer
status: Published
definition: Relaciona un recurso con el nombre de la persona o entidad corporativa que aparece en el recurso que efectúa la impresión o fabricación del recurso. @es
definition: Relates a resource to the name of the person or corporate body appearing on the resource that effects the printing or manufacturing of the resource.

has dependent title of parallel title
type: Property
domain: Resource
label: tiene título dependiente de título paralelo @es
name: hasDependentTitleOfParallelTitle
status: Published
definition: Relaciona un recurso con un título que por sí mismo es insuficiente para identificar el recurso y que requiere de la adición el título común, o del título del recurso principal o del título de la serie principal, presentado como equivalente en otra lengua o escritura en la fuente de información preferida del recurso. @es
definition: Relates a resource to a title that by itself is insufficient to identify the resource and that requires the addition of the common title, or the title of the main resource or the title of the main series, presented on the preferred source of information for the resource as an equivalent in another language or script.

has publication, production, distribution, etc area
type: Property
domain: Resource
label: tiene área de publicación, producción, distribución, etc. @es
range: Publication, Production, Distribution, Etc Area Encoding Scheme
name: hasPublicationProductionDistributionEtcArea
status: Published
definition: Relates a resource to a statement including the place of publication, production and/or distribution; the name of publisher, producer, and/or distributor; the date of publication, production, and/or distribution; the place of printing or manufacture; the name of printer or manufacturer; and the date of printing or manufacture.
definition: Relaciona un recurso con una mención que incluye el lugar de publicación, producción y/o distribución; el nombre del editor, productor y/o distribuidor; la fecha de publicación, producción y/o distribución; el lugar de impresión o fabricación; el nombre del impresor o fabricante, y la fecha de impresión o fabricación. @es
scope note: Cubre todos los tipos de publicación, producción, distribución, edición y actividades de difusión relacionadas con los recursos. @es
scope note: Covers all types of publication, production, distribution, issuing and release activities connected with resources.

has parallel statement of responsibility relating to title
type: Property
domain: Resource
label: tiene mención de responsabilidad paralela al título @es
name: hasParallelStatementOfResponsibilityRelatingToTitle
status: Published
definition: Relaciona un recurso con una mención de responsabilidad que se presenta en la fuente de información preferida para el recurso como un equivalente en otra lengua o escritura. @es
definition: Relates a resource to a statement of responsibility presented on the preferred source of information for the resource as an equivalent in another language or script.

has subsequent numbering system
type: Property
domain: Resource
label: tiene sistema sucesivo de numeración @es
name: hasSubsequentNumberingSystem
status: Published
definition: Relaciona un recurso que es una publicación seriada con una nueva secuencia de numeración (la identificación de cada uno de los sucesivos fascículos o partes). @es
definition: Relates a resource that is a serial to a new sequence of numbering (the identification of each of the successive issues or parts).
scope note: Normally, the serial carries a designation, such as "new series", "second series", etc., to indicate that a new sequence of numbering, not a new serial, is intended. The designation of the new sequence, if any, is included. The numbering system can include a numeral, a letter, any other character, or the combination of these, with or without an accompanying word ("volume", "number", etc.), and, or, a chronological designation.
scope note: Generalmente, la publicación seriada lleva una designación, como “nueva serie”, “segunda serie”, etc.., con la que se indica una nueva secuencia de numeración, no una nueva publicación. Se incluye, si existe, la designación de la nueva secuencia. El sistema de numeración puede incluir un numeral, una letra o cualquier otro carácter, o una combinación de ellos, con o sin una palabra que lo acompañe (“volumen, número, etc.) y/o una designación cronológica. @es

has note on use or audience
type: Property
domain: Resource
label: tiene nota de uso o destinatario @es
sub property of: has note
name: hasNoteOnUseOrAudience
status: Published
definition: Relates a resource to a note providing non-evaluative information as to the potential or recommended use of the resource and/or the intended audience.
definition: Relaciona un recurso con una nota que proporciona información no evaluativa sobre el uso potencial o recomendado del recurso y/o sobre los destinatarios a los que está dirigido. @es
scope note: Normalmente se obtienen de menciones de dentro o fuera del recurso. Incluye especificaciones de restricciones en el uso. @es
scope note: Normally taken from statements on or in the resource. Includes specification of restrictions on use.

Other Physical Details Encoding Scheme
type: Class
label: Esquema de codificación de otros detalles físicos @es
subclass of: ISBD Syntax Encoding Scheme
name: OtherPhysicalDetailsEncodingScheme
status: Published
definition: Esquema de codificación utilizada para otros detalles físicos. @es
definition: Syntax encoding scheme for other physical details.

has statement of coordinates and equinox
type: Property
domain: Resource
label: tiene mención de coordenadas y equinoccio @es
range: Statement Of Coordinates And Equinox Encoding Scheme
name: hasStatementOfCoordinatesAndEquinox
status: Published
definition: Relaciona un recurso cartográfico con una mención que incluye las coordenadas y equinoccio. @es
definition: Relates a resource that is cartographic to a statement including the coordinates and equinox.

has other title information of series or multipart monographic resource
type: Property
domain: Resource
label: tiene información complementaria del título de serie o recurso monográfico multiparte @es
name: hasOtherTitleInformationOfSeriesOrMultipartMonographicResource
status: Published
definition: Relates a resource that is a series or multipart monographic resource to a word or phrase, or a group of characters, appearing in conjunction with or subordinate to the title of the resource.
definition: Relaciona un recurso que es una serie o recurso monográfico multiparte con una palabra, frase o grupo de caracteres que aparecen asociados, o subordinados al título del recurso. @es
scope note: La información complementaria del título se indica cuando aparece en la fuente de información prescrita y es necesaria para la identificación del recurso bibliográfico más amplio o bien se considera importante para los usuarios del catálogo. La mención de edición relativa a la serie o subserie se da como información complementaria de título cuando es necesaria para la identificación de la serie. @es
scope note: Other title information is given when it appears on the prescribed source of information and is necessary for identification of the larger bibliographic resource or otherwise considered important to users of the catalogue. An edition statement relating to a series or subseries is given as other title information when necessary for identification of the series.

has statement of responsibility relating to title
type: Property
domain: Resource
label: tienen mención de responsabilidad relativa al título @es
name: hasStatementOfResponsibilityRelatingToTitle
status: Published
definition: Relates a resource to one or more names, phrases, or groups of characters relating to the identification and/or function of any persons or corporate bodies responsible for or contributing to the creation or realisation of the intellectual or artistic content of a work contained in the resource.
definition: Relaciona un recurso con uno o más nombres, frases, o grupos de caracteres relacionados con la identificación y/o función de cualquier persona o entidad corporativa responsables de, o que contribuyen a, la creación o realización del contenido intelectual o artístico de una obra contenida en el recurso. @es
scope note: A statement of responsibility is not constructed when there is no such statement on the resource. A statement of responsibility can relate to such entities as: writers, composers, performers, graphic artists, choreographers, arrangers, cartographers, programmers, principal investigators, animators, etc., whose work is embodied in the resource, whether directly (e.g. author of text, editor, compiler, translator, illustrator, engraver, cartographer, composer, arranger, choreographer), or indirectly (e.g. author of the novel on which a film script is based, author of the work on which the software is based, adapters of an already existing work), whether in the same medium as the original or in another; collectors of various data, persons responsible for the direction of a performed work; organizations, or individuals or corporate bodies sponsoring the work of any of the above (with intellectual and not merely financial sponsorship), producers of a popular music recording;.production companies and individuals such as producers, directors, or others having some degree of overall responsibility for a work; individuals who have specific responsibilities when in the context of a particular film, or particular type of film, they have a major creative role (e.g. cinematographers, writers of screenplays or animators of animated films); developers and designers, whose work involves the creation of the content of a resource or its realisation (e.g. game designer); entities having specific responsibilities in the context of a particular resource or particular type of resource (e.g. project directors of survey data, video director).
scope note: No se construye una mención de responsabilidad cuando no hay mención en el recurso. Una mención de responsabilidad puede relacionar ciertas entidades como: escritores, compositores, realizadores, artistas gráficos, coreógrafos, arreglistas, cartógrafos, programadores, investigadores principales, animadores, etc., cuya obra está presente en el recurso, bien directamente (p. ej., autor del texto, editor, compilador, traductor, ilustrador, grabador, cartógrafo, compositor, arreglista, coreógrafo), o indirectamente (p. ej., autor de la novela en la que se basa un guión cinematográfico, autor de una obra en la que se basa un software, adaptadores de una obra ya existente), tanto si está en el mismo medio que el original o en otro, recopiladores de información diversa, personas responsables de la dirección de una obra interpretada, organizaciones, individuos o entidades corporativas que patrocinan la obra de cualquiera de los anteriores (con patrocinion intelectual y no meramente financiero), productores de grabaciones de música popular, personas y compañias de producción como productores, directores u otros que tienen algún grado de responsabilidad sobre una obra; personas que tienen responsabilidades específicas en el contexto de una película, o tipo concreto de película, aquellos que tienen un rol creativo (por ejemplo cinematógrafos, escritores de guiones o dibujantes en películas de animación); desarrolladores y diseñadores, cuyo trabajo implica la creación del contenido de un recurso o su realización (p. ej. diseñador de juegos); entidades que tienen responsabilidades específicas en el contexto de un recurso concreto o tipo de recurso en particular (p. ej. directores de proyectos de datos estadísticos, director de video). @es

has item aspect
type: Property
domain: Resource
range: C1004
name: hasItemAspect
status: Published
inverse of: is item reflected in
definition: Relates a bibliographic resource to an item reflected in it.

has title statement
type: Property
domain: Resource
name: hasTitleStatement
status: Published
definition: Relates a resource to a statement of its title.

has dependent title designation of series or multipart monographic resource
type: Property
domain: Resource
label: tiene designación de título dependiente de serie o recurso monográfico multiparte @es
name: hasDependentTitleDesignationOfSeriesOrMultipartMonogaphicResource
status: Published
definition: Relaciona un recurso que es una serie o recurso monográfico multiparte con una numeración que por sí sola o en conjunción con un título dependiente sirve para distinguir uno de dos o más recursos relacionados que tienen un título común. @es
definition: Relates a resource that is a series or multipart monographic resource to numbering that alone or in conjunction with a dependent title serves to distinguish one of two or more related resources having a common title.

has recording method
type: Property
domain: Resource
label: tiene método de grabación @es
name: hasRecordingMethod
status: Published
definition: Relaciona un recurso que es un disco sonoro analógico con su método de grabación. @es
definition: Relates a resource that is an analogue sound disc to its recording method.

has note area
type: Property
domain: Resource
label: tiene área de notas @es
range: Note Area Encoding Scheme
name: hasNoteArea
status: Published
definition: Relates a resource to a statement including notes on any descriptive information that has not been given in other areas of the description.
definition: Relaciona un recurso con una mención que incluye notas sobre cualquier información descriptiva que no se haya dado en otras áreas de la descripción. @es
scope note: Se utiliza cuando se considera de importancia para los usuarios de los registros bibliográficos. @es
scope note: Used when considered to be important to users of bibliographic records.

Parallel Title (Compound) Of Series Or Multipart Monographic Resource Encoding Scheme
type: Class
label: Esquema de codificación del título paralelo (compuesto) de serie o recurso monográfico multiparte @es
subclass of: ISBD Syntax Encoding Scheme
name: ParallelTitleCompoundOfSeriesOrMultipartMonographicResourceEncodingScheme
status: Published
definition: Esquema de codificación utilizado para el título paralelo (compuesto) de serie o recurso monográfico multiparte. @es
definition: Syntax Encoding Scheme for the parallel title (compound) of a series or multipart monograph.

has note on relationship to other resources
type: Property
domain: Resource
label: tiene nota de relación con otros recursos @es
sub property of: has note
name: hasNoteOnRelationshipToOtherResources
status: Published
definition: Relaciona un recurso con una nota de relación con otros recursos. @es
definition: Relates a resource to a note on relationship to other resources.

Content Form And Media Type Area Encoding Scheme
type: Class
label: Esquema de codificación del área de forma del contenido y de tipo de medio @es
subclass of: ISBD Syntax Encoding Scheme
name: ContentFormAndMediaTypeAreaEncodingScheme
status: Published
definition: Esquema de codificación utilizado para el área de forma del contenido y de tipo de medio (Área 0). @es
definition: Syntax Encoding Scheme for the content form and media type area (Area 0).

has note on binding
type: Property
domain: Resource
label: tiene nota sobre la encuadernación @es
sub property of: has note
name: hasNoteOnBinding
status: Published
definition: Relaciona un recurso con una nota sobre la encuadernación como fue publicada por el editor. @es
definition: Relates a resource to a note on the binding as issued by the publisher.
scope note: Se excluye una encuadernación específica de un ejemplar que se tiene en la mano. @es
scope note: Excludes a binding specific to a copy in hand.