Getty Vocabulary Program ontology
type: Ontology
created: 2014-02-15
modified: 2015-03-25
preferred namespace uri: http://vocab.getty.edu/ontology#
change note: 2.0 changes: replaced gvp:broaderTransitive with gvp:broaderExtended; 3.0 changes: replaced schema:startDate, endDate with gvp:estStart, estEnd; added ULAN). See details in referenced links
preferred namespace prefix: gvp
creator: Ontotext Corp
imports: skos-thes
change note: Version 2.0
change note: Version 3.0
creator: Getty Research Institute
imports: core
imports: skos-xl
type: Vocabulary
type: NamedIndividual
comment: The GVP Ontology defines classes, properties and values (skos:Concepts) used in GVP LOD. As of version 3.0, it is complete regarding AAT, TGN and ULAN, and will be extended in time with more elements needed for other GVP vocabularies (CONA). It uses the SKOS, SKOS-XL, ISO 25964; DC, DCT, BIBO, FOAF, BIO, Schema, PROV, WGS84 ontologies, but we import only the first 3
version info: 3.0

dissolutionLocation
type: AnnotationProperty
comment: The place where the Organization was dissolved
description: The place where the Organization was dissolved. Schema has properties foundationLocation and dissolutionDate but no dissolutionLocation. In contrast, for a person all 4 properties are present: birth/death place/date. We posted issue https://github.com/schemaorg/schemaorg/issues/302, which looks like it will have a positive outcome in the far future. And we define the property here
domain: Organization
type: ObjectProperty
range: Place

contributorAlternatePreferred
type: AnnotationProperty
description: Contributor for which the term is Alternate Preferred. Range is foaf:Agent
sub property of: contributor
type: ObjectProperty
domain: Label
range: Agent

contributorNonPreferred
type: AnnotationProperty
description: Contributor for which the term is Non-preferred. Range is foaf:Agent. Example: "Lycra" is non-preferred term for WHS
comment: Contributor for which the term is Non-preferred. Range is foaf:Agent
example: "Lycra" is non-preferred term for WHS
sub property of: contributor
type: ObjectProperty
domain: Label
range: Agent

contributorPreferred
type: AnnotationProperty
comment: Contributor for which the term is Preferred. Range is foaf:Agent
description: Contributor for which the term is Preferred. Range is foaf:Agent. Example: "organza" is preferred term for WHS
example: "organza" is preferred term for WHS
sub property of: contributor
type: ObjectProperty
domain: Label
range: Agent

related to - any
type: ObjectProperty
type: SymmetricProperty
scope note: generic relationship, not explained
example: gulf red is related to light red (pigment)
description: any - related to - any; generic relationship, not explained. Example: gulf red is related to light red (pigment)
preferred label: aat2000_related_to
domain: Concept
range: Concept
sub property of: related

aat2001_formerly_referred_to
type: ObjectProperty
type: SymmetricProperty
description: any - formerly referred - any. Example: gigues formerly referred to fiddles
title: formerly referred to - any
example: gigues formerly referred to fiddles
domain: Concept
range: Concept
sub property of: related

distinguished from - any
type: ObjectProperty
type: SymmetricProperty
description: any - distinguished from - any. Example: historic farms are distinguished from abandoned farms; naive art is distinguished from outsider art
example: naive art is distinguished from outsider art
example: historic farms are distinguished from abandoned farms
preferred label: aat2100_distinguished_from
domain: Concept
range: Concept
sub property of: related

meaning/usage overlaps with - any
type: ObjectProperty
type: SymmetricProperty
preferred label: aat2110_meaning-usage_overlaps_with
example: scribes has meaning/usage that overlaps with copyists
example: chimney hoods has meaning/usage that overlaps with chimney caps
description: any - meaning/usage overlaps with - any. Example: chimney hoods has meaning/usage that overlaps with chimney caps; scribes has meaning/usage that overlaps with copyists
domain: Concept
range: Concept
sub property of: related

aat2203_associated_with
type: ObjectProperty
type: SymmetricProperty
description: activity/event/[process/function] - [is] associated with - activity/event/[process/function]. Example: Easter is associated with Lent; cavalry exercises are associated with dressage
example: Easter is associated with Lent
example: cavalry exercises are associated with dressage
title: associated with - activity/event
domain: Concept
range: Concept
sub property of: related

causes/is required - activity/event
type: ObjectProperty
example: on-demand printing causes/is required for on-demand publishing
description: activity/event/[process/function] - causes/is required for - activity/event/[process/function]. Example: on-demand printing causes/is required for on-demand publishing; preserving causes/is required for preservation
example: preserving causes/is required for preservation
preferred label: aat2205_causes-is_required
inverse of: caused by/requires - activity/event
range: Concept
domain: Concept
sub property of: related

caused by/requires - activity/event
type: ObjectProperty
description: activity/event/[process/function] - [is] caused by/dependent upon - activity/event/[process/function]. Example: on-demand publishing is caused by/requires on-demand printing; preservation is caused by/requires preserving
example: on-demand publishing is caused by/requires on-demand printing
example: preservation is caused by/requires preserving
preferred label: aat2206_caused_by-requires
domain: Concept
range: Concept
sub property of: related

locus/setting for - things
type: ObjectProperty
preferred label: aat2208_locus-setting_for
description: locus/setting - [is] locus/setting for - things. Example: glassworks (buildings) are the locus/setting for glassware; caves are the locus/setting for cave paintings
example: glassworks (buildings) are the locus/setting for glassware
example: caves are the locus/setting for cave paintings
inverse of: aat2209_used-located_in
range: Concept
domain: Concept
sub property of: related

aat2209_used-located_in
type: ObjectProperty
example: glassware is used/located in glassworks (buildings)
title: used/located in - locus/setting
example: cave paintings are located in caves
description: things -used/located in - locus/setting. Example: glassware is used/located in glassworks (buildings); cave paintings are located in caves
domain: Concept
range: Concept
sub property of: related

produce - things
type: ObjectProperty
example: punches (marking tools) produce punchwork
example: stereoscopic cameras produce stereoscopic photographs
description: things/[equipment] - produce - things. Example: stereoscopic cameras produce stereoscopic photographs; punches (marking tools) produce punchwork
preferred label: aat2211_produce
inverse of: aat2212_produced_by
domain: Concept
range: Concept
sub property of: related

aat2212_produced_by
type: ObjectProperty
description: things - [are] produced by - things/[equipment]. Example: stereoscopic photographs are produced by stereoscopic cameras; punchwork is produced by punches (marking tools)
example: punchwork is produced by punches (marking tools)
example: stereoscopic photographs are produced by stereoscopic cameras
title: produced by - things
range: Concept
domain: Concept
sub property of: related

required for - things
type: ObjectProperty
example: eyelets are required for broderie anglaise
preferred label: aat2215_required_for
description: things - [are] required for - things. Example: eyelets are required for broderie anglaise; compact discs are required for compact disc players
example: compact discs are required for compact disc players
inverse of: require - things
range: Concept
domain: Concept
sub property of: related

require - things
type: ObjectProperty
example: broderie anglaise requires eyelets
description: things - require - things [in order to exist or work]. Example: broderie anglaise requires eyelets; compact disc players require compact discs
example: compact disc players require compact discs
preferred label: aat2216_require
domain: Concept
range: Concept
sub property of: related

aat2218_used-function_as
type: ObjectProperty
description: things - [are] used/function as - things. Example: arc lamps are used/function as lighthouse lamps; toile peinte is used/function as cartoons (working drawings)
example: arc lamps are used/function as lighthouse lamps
title: used/function as - things
example: toile peinte is used/function as cartoons (working drawings)
inverse of: have form - things
range: Concept
domain: Concept
sub property of: related

have form - things
type: ObjectProperty
example: cartoons (working drawings) have the form of toile peinte
description: things - have form [of] - things. Example: lighthouse lamps have the form of arc lamps; cartoons (working drawings) have the form of toile peinte
example: lighthouse lamps have the form of arc lamps
preferred label: aat2219_have_form
range: Concept
domain: Concept
sub property of: related

act upon - genus/species
type: ObjectProperty
preferred label: aat2221_act_upon
example: jockeys act upon Equus caballus(species)
example: tappers act upon Acer saccharum(species)
description: [actors having] role - act upon - genus/species. Example: jockeys act upon Equus caballus(species); tappers act upon Acer saccharum(species)
inverse of: aat2222_are_acted_upon
range: Concept
domain: Concept
sub property of: related

aat2222_are_acted_upon
type: ObjectProperty
title: are acted upon - role
example: Acer saccharum(species) is acted upon by tappers
example: Equus caballus(species) is acted upon by jockeys
description: genus/species - is acted upon [by] - [actors having] role. Example: Equus caballus(species) is acted upon by jockeys; Acer saccharum(species) is acted upon by tappers
range: Concept
domain: Concept
sub property of: related

aat2281_have_counterpart
type: ObjectProperty
type: SymmetricProperty
example: duchesses have counterpart dukes
title: have counterpart - role
example: godesses have counterpart gods
description: role -[is] counterpart to - role. Example: duchesses have counterpart dukes; godesses have counterpart gods
range: Concept
domain: Concept
sub property of: related

practiced/studied by - role
type: ObjectProperty
example: Egyptology is practiced/studied by Egyptologists
description: field [of study, genre]/discipline - [is] practiced/studied by - a role. Example: Egyptology is practiced/studied by Egyptologists; architectural history is practiced/studied by architectural historians
preferred label: aat2285_practiced-studied_by
example: architectural history is practiced/studied by architectural historians
inverse of: aat2286_practice-study
domain: Concept
range: Concept
sub property of: related

aat2286_practice-study
type: ObjectProperty
description: [actor having] role - practice/study - field [of study, genre]/discipline. Example: Egyptologists practice/study Egyptology; architectural historians practice/study architectural history
example: Egyptologists practice/study Egyptology
title: practice/study - field/discipline
example: architectural historians practice/study architectural history
domain: Concept
range: Concept
sub property of: related

locus/setting for - role
type: ObjectProperty
example: libraries (buildings) are the locus/setting of libraries (institutions)
description: locus/setting - [is] locus setting for - [actor or institution having] role. Example: roperies are the locus/setting of rope-makers; convents (built complexes) are the locus/setting of nuns; libraries (buildings) are the locus/setting of libraries (institutions)
example: convents (built complexes) are the locus/setting of nuns
preferred label: aat2291_locus-setting_for
example: roperies are the locus/setting of rope-makers
inverse of: aat2292_work-live_in
range: Concept
domain: Concept
sub property of: related

aat2292_work-live_in
type: ObjectProperty
title: work/live in - locus/setting
example: libraries (institutions) live/work in libraries (buildings)
description: [actor or institution having] role - work/live/[exist] in - locus/setting. Example: rope-makers live/work in roperies; nuns live/work in convents (nunneries); libraries (institutions) live/work in libraries (buildings)
example: rope-makers live/work in roperies
example: nuns live/work in convents (nunneries)
range: Concept
domain: Concept
sub property of: related

locus/setting for - locus/setting
type: ObjectProperty
example: mountain ranges are the locus/setting for mountains
example: nations are the locus/setting for national capitals
preferred label: aat2294_locus-setting_for
description: locus/setting - [is] locus setting for - locus/setting. Example: nations are the locus/setting for national capitals; mountain ranges are the locus/setting for mountains
inverse of: aat2295_located_in
range: Concept
domain: Concept
sub property of: related

aat2295_located_in
type: ObjectProperty
title: located in - locus/setting
example: mountains are located in mountain ranges
description: locus/setting - [is] located in - locus/setting. Example: national capitals are located in nations; mountains are located in mountain ranges
example: national capitals are located in nations
range: Concept
domain: Concept
sub property of: related

performed by - role
type: ObjectProperty
example: clockmaking is performed by clockmakers
preferred label: aat2311_performed_by
example: curating is performed by curators
description: activity/event/[process/function] - [is] performed by - [actors having] a role. Example: clockmaking is performed by clockmakers; curating is performed by curators
inverse of: aat2312_perform
range: Concept
domain: Concept
sub property of: related

aat2312_perform
type: ObjectProperty
example: curators perform curating
description: [actors having] a role - perform - activity/event/process. Example: clockmakers perform clockmaking; curators perform curating
title: perform - activity/event
example: clockmakers perform clockmaking
domain: Concept
range: Concept
sub property of: related

aat2315_used_by
type: ObjectProperty
description: material - [is] used by - [actor having] role. Example: precious stone is used by lapidiaries; brass (alloy) is used by braziers (metalworkers)
example: brass (alloy) is used by braziers (metalworkers)
title: used by - role
example: precious stone is used by lapidiaries
inverse of: aat2316_use
domain: Concept
range: Concept
sub property of: related

aat2316_use
type: ObjectProperty
example: lapidaries use precious stone
title: use - material
example: braziers (metalworkers) use brass (alloy)
description: [actors having] role - use - material. Example: lapidaries use precious stone; braziers (metalworkers) use brass (alloy)
domain: Concept
range: Concept
sub property of: related

aat2318_involved_in
type: ObjectProperty
description: [actors having] role -[are] involved - activity/event. Example: bridegrooms are involved in weddings; martyrs are involved in martyrdoms
example: bridegrooms are involved in weddings
example: martyrs are involved in martyrdoms
title: involved in - activity/event
inverse of: aat2319_involves
domain: Concept
range: Concept
sub property of: related

aat2319_involves
type: ObjectProperty
example: martyrdoms involve martyrs
example: weddings involve bridegrooms
description: activity/event - involves - [actors having] role. Example: weddings involve bridegrooms; martyrdoms involve martyrs
title: involves - role
domain: Concept
range: Concept
sub property of: related

used by - role
type: ObjectProperty
preferred label: aat2321_used_by
example: surveying instruments are used by surveyors
description: things/equipment - [are] used by - [actors having] role. Example: violoncellos are used by violoncellists; surveying instruments are used by surveyors
example: violoncellos are used by violoncellists
inverse of: use - things
range: Concept
domain: Concept
sub property of: related

use - things
type: ObjectProperty
example: violoncellists use violoncellos
preferred label: aat2322_use
description: [actors having] role - use - things/equipment. Example: violoncellists use violoncellos; surveyors use surveying instruments
example: surveyors use surveying instruments
domain: Concept
range: Concept
sub property of: related

created by - role
type: ObjectProperty
example: drawings are created by draftsmen
preferred label: aat2325_created_by
example: poems are created by poets
description: things - [are] created by - [actors having] role. Example: drawings are created by draftsmen; poems are created by poets
inverse of: aat2326_create
range: Concept
domain: Concept
sub property of: related

aat2326_create
type: ObjectProperty
description: [actors having] role - create - things. Example: draftsmen create drawings; poets create poems
example: draftsmen create drawings
title: create - things
example: poets create poems
range: Concept
domain: Concept
sub property of: related

involved with - things
type: ObjectProperty
example: actors (performing artists) are involved with motion pictures (visual works)
example: sitters are involved with portraits
preferred label: aat2328_involved_with
description: [actors having] role - [are] involved in- things. Example: sitters are involved with portraits; actors (performing artists) are involved with motion pictures (visual works)
inverse of: aat2329_involves
domain: Concept
range: Concept
sub property of: related

aat2329_involves
type: ObjectProperty
example: portraits involve sitters
title: involves - role
description: things - involve - [actors having] role. Example: portraits involve sitters; motion pictures (visual works) involve actors (performing artists)
example: motion pictures (visual works) involve actors (performing artists)
range: Concept
domain: Concept
sub property of: related

aat2332_affiliated_with
type: ObjectProperty
description: [actors having] role - [are] affiliated with - role [organization]. Example: students are affiliated with schools (organizations); dukes are affiliated with duchies
example: dukes are affiliated with duchies
title: affiliated with - role
example: students are affiliated with schools (organizations)
inverse of: aat2333_have_affiliates
domain: Concept
range: Concept
sub property of: related

aat2333_have_affiliates
type: ObjectProperty
example: duchies have as affiliates dukes
description: role [organizations] - have affiliates - [actors having] role. Example: schools (organizations) have as affiliates students; duchies have as affiliates dukes
title: have affiliates - role
example: schools (organizations) have as affiliates students
range: Concept
domain: Concept
sub property of: related

aat2335_associated_with
type: ObjectProperty
title: associated with - style/period/culture
example: popes are associated with Roman Catholicism
description: [actors having] role - [are] associated with - style/period/culture/[religion/ideology]. Example: abstract artists are associated with Abstract (fine arts style); popes are associated with Roman Catholicism
example: abstract artists are associated with Abstract (fine arts style)
inverse of: aat2336_has_associates
range: Concept
domain: Concept
sub property of: related

aat2336_has_associates
type: ObjectProperty
example: Roman Catholicism has associates popes
example: Abstract (fine arts style) has associates abstract artists
title: has associates - role
description: style/period/culture/[relgion] - has associates - [actors having] role. Example: Abstract (fine arts style) has associates abstract artists; Roman Catholicism has associates popes
range: Concept
domain: Concept
sub property of: related

focus of - field/discipline
type: ObjectProperty
description: any - [is] focus of - field [of study]/discipline. Example: manuscripts are the focus of codicology; music is the focus of musicology; Plantae (kingdom) is the focus of botany
preferred label: aat2397_focus_of
example: music is the focus of musicology
example: Plantae (kingdom) is the focus of botany
example: manuscripts are the focus of codicology
inverse of: focuses on - any
range: Concept
domain: Concept
sub property of: related

focuses on - any
type: ObjectProperty
example: bontany focuses on Plantae (kingdom)
preferred label: aat2398_focuses_on
description: field [of study]/discipline - focuses on - any. Example: codicology focuses on manuscripts; musicology focuses on music; bontany focuses on Plantae (kingdom)
example: musicology focuses on music
example: codicology focuses on manuscripts
domain: Concept
range: Concept
sub property of: related

aat2408_locus-setting_for
type: ObjectProperty
example: schools (buildings) are the locus/setting for education
title: locus/setting for - field/discipline
description: locus/setting - [is] locus/setting for - field of study/discipline. Example: schools (buildings) are the locus/setting for education; hospitals (buildings) are the locus/setting for medicine (discipline)
example: hospitals (buildings) are the locus/setting for medicine (discipline)
inverse of: aat2409_takes_place_in
range: Concept
domain: Concept
sub property of: related

aat2409_takes_place_in
type: ObjectProperty
example: education takes place in schools (buildings)
example: medicine (discipline) takes place in hospitals (buildings)
description: field of study/discipline - takes place in - locus/setting. Example: education takes place in schools (buildings); medicine (discipline) takes place in hospitals (buildings)
title: takes place in - locus/setting
range: Concept
domain: Concept
sub property of: related

involved in - field/discipline
type: ObjectProperty
example: journalistic photography is involved in photojournalism (discipline)
preferred label: aat2411_involved_in
example: gardening is involved in horticulture
description: activity/event/[process/function] - [is] involved in - field/discipline. Example: journalistic photography is involved in photojournalism (discipline); gardening is involved in horticulture
inverse of: aat2412_involves
range: Concept
domain: Concept
sub property of: related

aat2412_involves
type: ObjectProperty
description: field/discipline - involves - activity/event/[process/function]. Example: photojournalism (discipline) involves journalistic photography; horticulture involves gardening
example: photojournalism (discipline) involves journalistic photography
example: horticulture involves gardening
title: involves - activity/event
domain: Concept
range: Concept
sub property of: related

required for - activity/event
type: ObjectProperty
example: pewter is required for pewtersmithing
description: material - [is] required for - activity/event/[process/function]. Example: dye is required for dying; pewter is required for pewtersmithing
preferred label: aat2415_required_for
example: dye is required for dying
inverse of: aat2416_requires
domain: Concept
range: Concept
sub property of: related

aat2416_requires
type: ObjectProperty
description: activity/event/[process/function] - requires - material. Example: dying requires dye; pewtersmithing requires pewter
example: pewtersmithing requires pewter
title: requires - material
example: dying requires dye
range: Concept
domain: Concept
sub property of: related

aat2418_uses
type: ObjectProperty
example: astronomy uses astronomical instruments
example: divination [discipline] uses divination objects
description: field [of study]/discipline - uses - things/[equipment]. Example: astronomy uses astronomical instruments; divination [discipline] uses divination objects
title: uses - things
inverse of: used for - field/discipline
domain: Concept
range: Concept
sub property of: related

used for - field/discipline
type: ObjectProperty
example: astronomical instruments are used for astronomy
description: things/[equipment] - [are] used for - field [of study]/discipline. Example: astronomical instruments are used for astronomy; divination objects are used for divination [discipline]
example: divination objects are used for divination [discipline]
preferred label: aat2419_used_for
domain: Concept
range: Concept
sub property of: related

aat2421_locus-setting_for
type: ObjectProperty
description: locus/setting - [is] locus/setting for - activity/event/[process/function]. Example: smelters (metalworking plants) are the locus/setting for smelting; pilgrimage centers are the locus/setting for pilgrimages
example: pilgrimage centers are the locus/setting for pilgrimages
example: smelters (metalworking plants) are the locus/setting for smelting
title: locus/setting for - activity/event
inverse of: aat2422_takes_place_in
range: Concept
domain: Concept
sub property of: related

aat2422_takes_place_in
type: ObjectProperty
example: smelting takes place in smelters (metalworking plants)
example: pilgrimages take place in pilgrimage centers
description: activity/event/[process/function] - takes place in - locus/setting. Example: smelting takes place in smelters (metalworking plants); pilgrimages take place in pilgrimage centers
title: takes place in - locus/setting
domain: Concept
range: Concept
sub property of: related

produced by - activity/event/process
type: ObjectProperty
example: paper is produced by papermaking
preferred label: aat2424_produced_by
description: material - [is] produced by - activity/event/process. Example: wire is produced by wiredrawing; paper is produced by papermaking
example: wire is produced by wiredrawing
inverse of: aat2425_produces
range: Concept
domain: Concept
sub property of: related

aat2425_produces
type: ObjectProperty
description: activity/event/process - produces - material. Example: wiredrawing produces wire; papermaking produces paper
title: produces - material
example: papermaking produces paper
example: wiredrawing produces wire
range: Concept
domain: Concept
sub property of: related

produced by - activity/event/process
type: ObjectProperty
example: forgeries are produced by forging (copying)
description: things - [are] produced by - activity/event/process. Example: vase paintings (visual works) are produced by vase painting (image making); forgeries are produced by forging (copying)
example: vase paintings (visual works) are produced by vase painting (image making)
preferred label: aat2427_produced_by
inverse of: produces - things
domain: Concept
range: Concept
sub property of: related

produces - things
type: ObjectProperty
description: activity/event/process - produces - things. Example: vase painting (image making) produces vase paintings (visual works); forging (copying) produces forgeries
example: vase painting (image making) produces vase paintings (visual works)
preferred label: aat2428_produces
example: forging (copying) produces forgeries
range: Concept
domain: Concept
sub property of: related

required for - activity/event/process
type: ObjectProperty
description: things/equipment - [are] required for - activity/event/process. Example: painting equipment is required for painting (image making); dowels are required for doweling
example: painting equipment is required for painting (image making)
example: dowels are required for doweling
preferred label: aat2431_required_for
inverse of: aat2432_requires
domain: Concept
range: Concept
sub property of: related

aat2432_requires
type: ObjectProperty
description: activity/event/process - requires - things/equipment. Example: painting (image making) requires painting equipment; doweling requires dowels
example: doweling requires dowels
example: painting (image making) requires painting equipment
title: requires - things
domain: Concept
range: Concept
sub property of: related

aat2434_contextualized_in
type: ObjectProperty
example: funeral books are contextualized in funerals
description: things - [are] context for - activity/event/process. Example: funeral books are contextualized in funerals; Christmas trees are contextualized in Christmas
example: Christmas trees are contextualized in Christmas
title: contextualized in - activity/event/process
inverse of: context for - things
range: Concept
domain: Concept
sub property of: related

context for - things
type: ObjectProperty
example: funerals are the context for funeral books
example: Christmas is the context for Christmas trees
description: activity/event/process - [is] contextualized in - thing. Example: funerals are the context for funeral books; Christmas is the context for Christmas trees
preferred label: aat2435_context_for
domain: Concept
range: Concept
sub property of: related

made of/require - material
type: ObjectProperty
example: ivories (sculptures) are made of/require ivory
preferred label: aat2501_made_of-require
description: things - [are] made of/require - material. Example: obsidian mirrors are made of/require obsidian; ivories (sculptures) are made of/require ivory
example: obsidian mirrors are made of/require obsidian
inverse of: material for - things
domain: Concept
range: Concept
sub property of: related

material for - things
type: ObjectProperty
preferred label: aat2502_material_for
example: ivory is material for ivories (sculptures)
example: obsidian is material for obsidian mirrors
description: material - [is] material for - things. Example: obsidian is material for obsidian mirrors; ivory is material for ivories (sculptures)
domain: Concept
range: Concept
sub property of: related

aat2504_used-located_in
type: ObjectProperty
description: material - [is] used/located in - locus/setting. Example: tephra is used/located in [at] volcanoes; brick (clay product) is used/located in brickworks (factories)
example: brick (clay product) is used/located in brickworks (factories)
title: used/located in - locus/setting
example: tephra is used/located in [at] volcanoes
inverse of: aat2505_locus-setting_for
domain: Concept
range: Concept
sub property of: related

aat2505_locus-setting_for
type: ObjectProperty
description: locus/setting - [is] locus/setting for - material. Example: volcanoes are locus/setting for tephra; brickworks (factories) are locus/setting for brick (clay product)
example: volcanoes are locus/setting for tephra
example: brickworks (factories) are locus/setting for brick (clay product)
title: locus/setting for - material
domain: Concept
range: Concept
sub property of: related

aat2507_produce-process
type: ObjectProperty
example: groundwater is produced/processed by water wells
title: produce/process - material
example: cotton (fiber) is produced/processed by cotton gins
description: things/[equipment] - produce/process - material. Example: cotton (fiber) is produced/processed by cotton gins; groundwater is produced/processed by water wells
inverse of: aat2508_produced-processed_by
domain: Concept
range: Concept
sub property of: related

aat2508_produced-processed_by
type: ObjectProperty
example: cotton gins produce/process cotton (fiber)
description: material - [is] produced/processed by - things/[equipment]. Example: cotton gins produce/process cotton (fiber); waterwells produce/process groundwater
example: waterwells produce/process groundwater
title: produced/processed by - things
domain: Concept
range: Concept
sub property of: related

aat2551_reflect-produced_by
type: ObjectProperty
example: Judaica reflects/is produced by Judaism
description: things - reflect/[are] produced by - style/period/culture/[religion/ideology]. Example: Nasca lines reflect/are produced by Nasca [culture]; Judaica reflects/is produced by Judaism
example: Nasca lines reflect/are produced by Nasca [culture]
title: reflect/produced by - style/period/culture
inverse of: reflected in/produces - things
range: Concept
domain: Concept
sub property of: related

reflected in/produces - things
type: ObjectProperty
example: Judaism produces/is reflected in Judaica
example: Nasca [culture] produces/is reflected in Nasca lines
description: style/period/culture/[religion/ideology] - [is] reflected in/produces - things. Example: Nasca [culture] produces/is reflected in Nasca lines; Judaism produces/is reflected in Judaica
preferred label: aat2552_reflected_in-produces
range: Concept
domain: Concept
sub property of: related

reflects - style/period/culture
type: ObjectProperty
example: red-figure vase painting reflects Red-figure [style]
description: activity/event - reflects - style/period/culture /[religion/ideology]. Example: dhokra (casting technique) reflects Dhokra (culture); red-figure vase painting reflects Red-figure [style]
example: dhokra (casting technique) reflects Dhokra (culture)
preferred label: aat2554_reflects
inverse of: reflected in - activity/event
domain: Concept
range: Concept
sub property of: related

reflected in - activity/event
type: ObjectProperty
example: Red-figure [style] is reflected in red-figure vase painting
example: Dhokra (culture) is reflected in dhokra (casting technique)
description: style/period/culture /[religion/ideology] - [is] reflected in activity/event. Example: Dhokra (culture) is reflected in dhokra (casting technique); Red-figure [style] is reflected in red-figure vase painting
preferred label: aat2555_reflected_in
range: Concept
domain: Concept
sub property of: related

aat2557_reflects
type: ObjectProperty
example: church history reflects Christianity
example: bugatu [dance discipline] reflects Buddhism
example: classics (discipline) reflects Ancient Greek [culture]
description: field/discipline - reflects - style/period/culture /[religion/ideology]. Example: bugatu [dance discipline] reflects Buddhism; church history reflects Christianity; classics (discipline) reflects Ancient Greek [culture]
title: reflects - style/period/culture
inverse of: aat2558_reflected_in
domain: Concept
range: Concept
sub property of: related

aat2558_reflected_in
type: ObjectProperty
example: Buddhism is reflected in bugatu [dance discipline]
description: style/period/culture /[religion/ideology] - [is] reflected in field/discipline. Example: Buddhism is reflected in bugatu [dance discipline]; Christianity is reflected in church history; Ancient Greek [culture] is reflected in classics (discipline)
example: Christianity is reflected in church history
example: Ancient Greek [culture] is reflected in classics (discipline)
title: reflected in - field/discipline
range: Concept
domain: Concept
sub property of: related

locus/setting for - style/period/culture
type: ObjectProperty
preferred label: aat2562_locus-setting_for
example: First Nations reserves are the locus/setting for First Nations (culture)
description: locus/setting - [is] locus/setting for - style/period/culture/[religion/ideology]. Example: First Nations reserves are the locus/setting for First Nations (culture); agraharas are the locus/setting for Brahmanism
example: agraharas are the locus/setting for Brahmanism
inverse of: located in - locus/setting
domain: Concept
range: Concept
sub property of: related

located in - locus/setting
type: ObjectProperty
description: style/period/culture/[religion/ideology] - is located/[reflected] in - locus/setting. Example: First Nations (culture) is located/reflected in First Nations reserves; Brahmanism is located/reflected in agraharas
example: Brahmanism is located/reflected in agraharas
preferred label: aat2563_located_in
example: First Nations (culture) is located/reflected in First Nations reserves
domain: Concept
range: Concept
sub property of: related

aat2601_possessed_by-existing_in
type: ObjectProperty
example: adulthood is possessed by/existing in adults
description: attributes /associated concepts - [is] possessed by/existing in - role [of actors]. Example: adulthood is possessed by/existing in adults; nomadism is possessed by/existing in nomads
title: possessed by/existing in - role
example: nomadism is possessed by/existing in nomads
inverse of: aat2602_possess-exist_in
domain: Concept
range: Concept
sub property of: related

aat2602_possess-exist_in
type: ObjectProperty
description: role [of actors] - possess/exist in - attributes /associated concepts. Example: adults possess/exist in adulthood; nomads possess/exist in [state of] nomadism
example: nomads possess/exist in [state of] nomadism
title: possess/exist in - attributes /associated concepts
example: adults possess/exist in adulthood
range: Concept
domain: Concept
sub property of: related

aat2604_possessed_by-existing_in
type: ObjectProperty
example: ruined [condition] is possessed by/existing in ruins
description: attributes /associated concepts - [is] possessed by/existing in - things. Example: boudoir (photograph size) is possessed by/existing in boudoir photographs; ruined [condition] is possessed by/existing in ruins
example: boudoir (photograph size) is possessed by/existing in boudoir photographs
title: possessed by/existing in - things
inverse of: possess/exist in - attributes /associated concepts
range: Concept
domain: Concept
sub property of: related

possess/exist in - attributes /associated concepts
type: ObjectProperty
example: boudoir photographs possess/exist in boudoir (photograph size)
example: ruins possess/exist in ruined [contition]
description: things - possess/exist in - attributes /associated concepts. Example: boudoir photographs possess/exist in boudoir (photograph size); ruins possess/exist in ruined [contition]
preferred label: aat2605_possess-exist_in
range: Concept
domain: Concept
sub property of: related

aat2607_caused_by-requires
type: ObjectProperty
example: creases (condition) is caused by/requires creasing (process)
title: caused by/requires - activity/event
example: watertightness is caused by/requires waterproofing
description: attributes /associated concepts - [is] caused by/requires - an activity/event/[process/function]. Example: watertightness is caused by/requires waterproofing; creases (condition) is caused by/requires creasing (process)
inverse of: causes/required for - attributes /associated concepts
range: Concept
domain: Concept
sub property of: related

causes/required for - attributes /associated concepts
type: ObjectProperty
preferred label: aat2608_causes-required_for
example: waterproofing causes/is required for watertighness
example: creasing (process) causes/is required for creases (condition)
description: activity/event/[process/function] - causes/[is] required for - [a] state/condition/attributes. Example: waterproofing causes/is required for watertighness; creasing (process) causes/is required for creases (condition)
domain: Concept
range: Concept
sub property of: related

aat2612_possessed_by-existing_in
type: ObjectProperty
description: attributes /associated concepts - is possessed by/existing in - material. Example: dry rot is possessed by/existing in wood(plant material); dielectric properties are possessed by/existing in dielectric (material)
example: dry rot is possessed by/existing in wood(plant material)
example: dielectric properties are possessed by/existing in dielectric (material)
title: possessed by/existing in - material
inverse of: aat2613_possess-exist_in
domain: Concept
range: Concept
sub property of: related

aat2613_possess-exist_in
type: ObjectProperty
example: wood(plant material) possesses/exists in [condition of] dry rot
description: material - possesses/exists in - condition/state/[property]. Example: wood(plant material) possesses/exists in [condition of] dry rot; dielectric (material) possesses/exists in dielectric properties
title: possess/exist in - attributes /associated concepts
example: dielectric (material) possesses/exists in dielectric properties
range: Concept
domain: Concept
sub property of: related

conjuncted with - things
type: ObjectProperty
type: SymmetricProperty
example: dining tables are conjuncted with dining chairs
description: things - [are] conjuncted with - things. Example: cups are conjuncted with saucers; dining tables are conjuncted with dining chairs
example: cups are conjuncted with saucers
preferred label: aat2801_conjuncted_with
domain: Concept
range: Concept
sub property of: related

aat2802_exemplified_by
type: ObjectProperty
description: material - [is] exemplified by - brand name. Example: petrolium jelly is exemplified by Vaseline (TM); polytetrafluoroethyelene is exemplified by Teflon (TM)
example: polytetrafluoroethyelene is exemplified by Teflon (TM)
example: petrolium jelly is exemplified by Vaseline (TM)
title: exemplified by - brand name
inverse of: aat2803_example_of
domain: Concept
range: Concept
sub property of: related

aat2803_example_of
type: ObjectProperty
description: brand name - [is] example of - material. Example: Vaseline (TM) is an example of petrolium jelly; Teflon (TM) is an example of polytetrafluoroethyelene
example: Teflon (TM) is an example of polytetrafluoroethyelene
title: example of - material
example: Vaseline (TM) is an example of petrolium jelly
range: Concept
domain: Concept
sub property of: related

aat2805_contextualized_in
type: ObjectProperty
example: predellas are contextualized in altarpieces
title: contextualized in - things
description: [smaller] things - [are] contextualized in - [larger] things. Example: predellas are contextualized in altarpieces; chapters are contextualized in books
example: chapters are contextualized in books
inverse of: provide context - things
domain: Concept
range: Concept
sub property of: related

provide context - things
type: ObjectProperty
description: [larger] things - provide context [for] - [smaller] things. Example: altarpieces provide context for predellas; books provide context for chapters
example: altarpieces provide context for predellas
example: books provide context for chapters
preferred label: aat2806_provide_context
domain: Concept
range: Concept
sub property of: related

derived from common source - material
type: ObjectProperty
type: SymmetricProperty
description: material - [is] derived from common source [as] - material. Example: malachite (mineral) is derived from common source with azurite (mineral); mustard(material) is derived from common source with mustard oil
example: mustard(material) is derived from common source with mustard oil
preferred label: aat2807_derived_from_common_source
example: malachite (mineral) is derived from common source with azurite (mineral)
domain: Concept
range: Concept
sub property of: related

coexisted with - style/period/culture
type: ObjectProperty
type: SymmetricProperty
description: style/period/culture/[religion/ideology] - coexisted with - style/period/culture/[religion/ideology]. Example: Sangoan coexisted with Fauresmith; Early Minoan coexisted with Prepalatial
example: Sangoan coexisted with Fauresmith
example: Early Minoan coexisted with Prepalatial
preferred label: aat2809_coexisted_with
domain: Concept
range: Concept
sub property of: related

preceded - style/period/culture
type: ObjectProperty
example: Impressionist preceded Abstract Impressionist
preferred label: aat2811_preceded
description: style/period/culture/[religion/ideology] - preceded - style/period/culture/[religion/ideology]. Example: Impressionist preceded Abstract Impressionist; Acheulian preceded Micoquian
example: Acheulian preceded Micoquian
inverse of: followed - style/period/culture
domain: Concept
range: Concept
sub property of: related

followed - style/period/culture
type: ObjectProperty
example: Micoquian followed Acheulian
description: style/period/culture/[religion/ideology] - followed - style/period/culture/[religion/ideology]. Example: Abstract Impressionism followed Impressionist; Micoquian followed Acheulian
example: Abstract Impressionism followed Impressionist
preferred label: aat2812_followed
domain: Concept
range: Concept
sub property of: related

aat2814_constituent_of
type: ObjectProperty
example: iron oxide is a constituent of desert varnish
example: titanium white is a constituent of composite white
title: constituent of - material
description: material - [is] constituent of - material. Example: titanium white is a constituent of composite white; iron oxide is a constituent of desert varnish
inverse of: composed of - material
range: Concept
domain: Concept
sub property of: related

composed of - material
type: ObjectProperty
description: material - [is] composed of - material. Example: composite white is composed of titanium white; desert varnish is composed of iron oxide
example: desert varnish is composed of iron oxide
example: composite white is composed of titanium white
preferred label: aat2815_composed_of
range: Concept
domain: Concept
sub property of: related

derived/made from - material
type: ObjectProperty
description: material - [is] derived/made from - material. Example: gypsum is derived/made from from anhydrite; wood board is derived/made from timber (lumber)
example: wood board is derived/made from timber (lumber)
preferred label: aat2817_derived-made_from
example: gypsum is derived/made from from anhydrite
inverse of: aat2818_source_for
domain: Concept
range: Concept
sub property of: related

aat2818_source_for
type: ObjectProperty
example: timber (lumber) is the source for wood board
description: material - [is] source for - material. Example: anhydrite is the source for gypsum; timber (lumber) is the source for wood board
title: source for - material
example: anhydrite is the source for gypsum
range: Concept
domain: Concept
sub property of: related

based on - any
type: ObjectProperty
description: any - [is] based on - any. Example: Neo-Gothic is based on Gothic (Medieval); curved [form attribute] is based on curves (geometric figures); pencils are based on plummets
example: curved [form attribute] is based on curves (geometric figures)
example: pencils are based on plummets
preferred label: aat2821_based_on
example: Neo-Gothic is based on Gothic (Medieval)
inverse of: aat2822_basis_of
domain: Concept
range: Concept
sub property of: related

aat2822_basis_of
type: ObjectProperty
example: curves (geometric figures) are the basis of curved [form attribute]
title: basis of - any
example: Gothic (Medieval) is the basis of Neo-Gothic
description: any - [is] basis of - any. Example: Gothic (Medieval) is the basis of Neo-Gothic; curves (geometric figures) are the basis of curved [form attribute]; plummets are the basis of pencils
example: plummets are the basis of pencils
domain: Concept
range: Concept
sub property of: related

aat2824_has_parallels_with
type: ObjectProperty
type: SymmetricProperty
example: Lagozza [culture] has parallels with Chasseen [culture]
description: style/period/culture/[religion/ideology] - has parallels with - style/period/culture/[religion/ideology]. Example: Lagozza [culture] has parallels with Chasseen [culture]; Gnathian (pottery style) has parallels with West Slope (pottery style)
example: Gnathian (pottery style) has parallels with West Slope (pottery style)
title: has parallels with - style/period/culture
range: Concept
domain: Concept
sub property of: related

aat2826_used_with
type: ObjectProperty
type: SymmetricProperty
title: used with - material
example: watercolor paper is used with watercolor (paint)
example: arriccio is used with intonaco
description: material - [is] used with - material. Example: watercolor paper is used with watercolor (paint); arriccio is used with intonaco
range: Concept
domain: Concept
sub property of: related

aat2828_use-require
type: ObjectProperty
description: things - use/require - material. Example: oil paintings use/require varnish; wine glasses use/require wine
example: oil paintings use/require varnish
title: use/require - material
example: wine glasses use/require wine
inverse of: used/required for - things
range: Concept
domain: Concept
sub property of: related

used/required for - things
type: ObjectProperty
description: material - [is] required/used for - things. Example: varnish is used/required for oil paintings; wine is required/used for wine glasses
preferred label: aat2829_used-required_for
example: wine is required/used for wine glasses
example: varnish is used/required for oil paintings
range: Concept
domain: Concept
sub property of: related

associated with - genus/species
type: ObjectProperty
type: SymmetricProperty
example: Amphiprioninae (subfamily) [clown fish] is associated with Actiniaria (order) [sea anemone]
description: genus/species/[other living organism term] - [is] associated with - genus/species. Example: Anthonomus grandis (species) [boll weevil] is associated with Gossypium (genus) [cotton]; Amphiprioninae (subfamily) [clown fish] is associated with Actiniaria (order) [sea anemone]
example: Anthonomus grandis (species) [boll weevil] is associated with Gossypium (genus) [cotton]
preferred label: aat2831_associated_with
domain: Concept
range: Concept
sub property of: related

aat2833_ancestor_of
type: ObjectProperty
example: Equus asinus is the ancestor of donkeys
description: genus/species - is ancestor of - another genus/species. Example: Canis lupus is the ancestor of Canis familiaris; Equus asinus is the ancestor of donkeys
example: Canis lupus is the ancestor of Canis familiaris
title: ancestor of - genus/species
inverse of: aat2834_decendant_of
domain: Concept
range: Concept
sub property of: related

aat2834_decendant_of
type: ObjectProperty
example: Canis familiaris is the descendant of Canis lupus
description: genus/species - is decendant of - genus/species. Example: Canis familiaris is the descendant of Canis lupus; donkeys are the descendents of Equus asinus
example: donkeys are the descendents of Equus asinus
title: decendant of - genus/species
range: Concept
domain: Concept
sub property of: related

aat2836_derived-made_from
type: ObjectProperty
example: k?kaku are derived/made from Phormium tenax (species)
example: ostrich-egg cups are derived/made from Struthio camelus (species)
title: derived/made from - genus/species
description: things - [are] derived/made from - genus/species [or its parts]. Example: k?kaku are derived/made from Phormium tenax (species); ostrich-egg cups are derived/made from Struthio camelus (species)
inverse of: aat2837_source_for
range: Concept
domain: Concept
sub property of: related

aat2837_source_for
type: ObjectProperty
title: source for - things
description: genus/species [or its parts] - [is] source for - things. Example: Phormium tenax (species) is the source for k?kaku; Struthio camelus(species) is the source for ostrich-egg cups
example: Struthio camelus(species) is the source for ostrich-egg cups
example: Phormium tenax (species) is the source for k?kaku
domain: Concept
range: Concept
sub property of: related

aat2841_derived-made_from
type: ObjectProperty
description: material - [is] derived/made from - genus/species. Example: alpaca (wool) is derived from Vicugna pacos (species); maple (wood) is derived from Acer (genus)
title: derived/made from - genus/species
example: maple (wood) is derived from Acer (genus)
example: alpaca (wool) is derived from Vicugna pacos (species)
inverse of: aat2842_source_for
domain: Concept
range: Concept
sub property of: related

aat2842_source_for
type: ObjectProperty
example: Acer (genus) is the source for maple (wood)
description: genus/species - [is] source for - material. Example: Vicugna pacos (species) is the source for alpaca (wool); Acer (genus) is the source for maple (wood)
example: Vicugna pacos (species) is the source for alpaca (wool)
title: source for - material
domain: Concept
range: Concept
sub property of: related

aat2845_used-located_in
type: ObjectProperty
description: genus/species - [is] used/located in - locus/setting. Example: Elephantidae(family) are used/located in elephant houses; Vitaceae (family) is used/located in vineyards
example: Elephantidae(family) are used/located in elephant houses
title: used/located in - locus/setting
example: Vitaceae (family) is used/located in vineyards
inverse of: aat2846_locus-setting_for
range: Concept
domain: Concept
sub property of: related

aat2846_locus-setting_for
type: ObjectProperty
description: locus/setting - [is] locus/setting for - genus/species. Example: elephant houses are the locus/setting for Elephantidae(family); vineyards are the locus/setting of Vitaceae (family)
example: vineyards are the locus/setting of Vitaceae (family)
example: elephant houses are the locus/setting for Elephantidae(family)
title: locus/setting for - genus/species
range: Concept
domain: Concept
sub property of: related

aat2848_involved_in
type: ObjectProperty
example: Equus caballus (species) is involved in polo(field sport)
description: genus/species - is involved in - activity/event. Example: bulls (animals) are involved in bullfighting; Equus caballus (species) is involved in polo(field sport)
example: bulls (animals) are involved in bullfighting
title: involved in - activity/event
inverse of: involves - genus/species
range: Concept
domain: Concept
sub property of: related

involves - genus/species
type: ObjectProperty
description: activity/event - involves - genus/species. Example: bullfighting involves bulls (animals); polo (field sport) involves Equus caballus (species)
example: polo (field sport) involves Equus caballus (species)
example: bullfighting involves bulls (animals)
preferred label: aat2849_involves
range: Concept
domain: Concept
sub property of: related

involved with - things
type: ObjectProperty
preferred label: aat2852_involved_with
example: Camelus (genus) is involved with camel saddles
example: Rosa (genus) is involved with rose bowls
description: genus/species - [is] involved with - things/[equipment]. Example: Rosa (genus) is involved with rose bowls; Camelus (genus) is involved with camel saddles
inverse of: aat2853_involve
domain: Concept
range: Concept
sub property of: related

aat2853_involve
type: ObjectProperty
description: things/[equipment] - involve - genus/species. Example: rose bowls involve Rosa (genus); camel saddles involve Camelus (genus)
example: camel saddles involve Camelus (genus)
title: involve - genus/species
example: rose bowls involve Rosa (genus)
domain: Concept
range: Concept
sub property of: related

characteristic of - style/period/culture
type: ObjectProperty
description: language - [is] characteristic of - style/period/culture. Example: Afar (language) is characteristic of Afar (culture); Celtic (language) was characteristic of Celtic (culture)
example: Celtic (language) was characteristic of Celtic (culture)
example: Afar (language) is characteristic of Afar (culture)
preferred label: aat2875_characteristic_of
inverse of: aat2876_characterized_by
domain: Concept
range: Concept
sub property of: related

aat2876_characterized_by
type: ObjectProperty
description: style/period/culture - [is] characterized by - language. Example: Afar (culture) is characterized by Afar (language); Celtic (culture) is characterized by Celtic (language)
title: characterized by - language
example: Afar (culture) is characterized by Afar (language)
example: Celtic (culture) is characterized by Celtic (language)
range: Concept
domain: Concept
sub property of: related

preceded/source for - language
type: ObjectProperty
description: language - preceded/[is] source for - language. Example: Ancient Greek (language) preceded/is source for Greek (modern language); Ancient Egyptian (language) preceded/is source for Egyptian, Coptic (language)
example: Ancient Egyptian (language) preceded/is source for Egyptian, Coptic (language)
example: Ancient Greek (language) preceded/is source for Greek (modern language)
preferred label: aat2878_preceded-source_for
inverse of: followed/developed from - language
domain: Concept
range: Concept
sub property of: related

followed/developed from - language
type: ObjectProperty
example: Greek (modern language) followed/developed from Ancient Greek (language)
example: Egyptian, Coptic (language) followed/developed from Ancient Egyptian (language)
description: language - followed/developed from - language. Example: Greek (modern language) followed/developed from Ancient Greek (language); Egyptian, Coptic (language) followed/developed from Ancient Egyptian (language)
preferred label: aat2879_followed-developed_from
domain: Concept
range: Concept
sub property of: related

aat2881_reflected_in
type: ObjectProperty
example: Sanskrit is reflected in Vedas
description: language - [is] reflected in - things. Example: Greek (language) is reflected in Greek alphabet; Sanskrit is reflected in Vedas
example: Greek (language) is reflected in Greek alphabet
title: reflected in - things
inverse of: reflect - language
range: Concept
domain: Concept
sub property of: related

reflect - language
type: ObjectProperty
example: Greek alphabet reflects Greek (language)
description: things - reflect - language. Example: Greek alphabet reflects Greek (language); Vedas reflect Sanskrit
example: Vedas reflect Sanskrit
preferred label: aat2882_reflect
domain: Concept
range: Concept
sub property of: related

involved with - any
type: ObjectProperty
example: Celtic crosses (design motif) are involved with Celtic culture
example: insect damage is involved with infestation
preferred label: aat2884_involved_with
description: attributes /associated concepts - [are] involved with - any. Example: climate is involved with climate change; insect damage is involved with infestation; Celtic crosses (design motif) are involved with Celtic culture
example: climate is involved with climate change
inverse of: aat2885_involves
domain: Concept
range: Concept
sub property of: related

aat2885_involves
type: ObjectProperty
description: any - involves - attributes /associated concepts. Example: climate change involves climate; infestation involves insect damage; Celtic culture involves Celtic crosses (design motif)
example: Celtic culture involves Celtic crosses (design motif)
title: involves - attributes /associated concepts
example: infestation involves insect damage
example: climate change involves climate
range: Concept
domain: Concept
sub property of: related

exemplified by - brand name
type: ObjectProperty
example: photothermographic transfer prints are exemplified by Pictrography (TM) prints
preferred label: aat2891_exemplified_by
description: things - [are] exemplied by - brand name. Example: photothermographic transfer prints are exemplified by Pictrography (TM) prints
inverse of: example of - things
range: Concept
domain: Concept
sub property of: related

example of - things
type: ObjectProperty
description: brand name - [is] example of - things. Example: Pictrography (TM) prints are examples of photothermographic transfer prints
example: Pictrography (TM) prints are examples of photothermographic transfer prints
preferred label: aat2892_example_of
domain: Concept
range: Concept
sub property of: related

aat2894_exemplified_by
type: ObjectProperty
example: deacidification [process/function] is exemplified by Papersave Process (TM)
description: activity/event/[process/function] - [is] exemplified by - brand name. Example: deacidification [process/function] is exemplified by Papersave Process (TM)
title: exemplified by - brand name
inverse of: aat2895_example_of
domain: Concept
range: Concept
sub property of: related

aat2895_example_of
type: ObjectProperty
description: brand name - [is] example of - activity/event/[process/function]. Example: Papersave Process (TM) is example of deacidification [process/function]
example: Papersave Process (TM) is example of deacidification [process/function]
title: example of - activity/event
range: Concept
domain: Concept
sub property of: related

miscellaneous relationship - any
type: ObjectProperty
type: SymmetricProperty
description: any - [has] miscellaneous relationship [to] - any. Example: Conditions and Effects has miscellaneous relationship with Processes and Techniques
example: Conditions and Effects has miscellaneous relationship with Processes and Techniques
preferred label: aat2900_miscellaneous_relationship
domain: Concept
range: Concept
sub property of: related

agentType
type: ObjectProperty
description: Type of a ULAN PersonConcept or GroupConcept. Domain is ULAN concept, range is AAT concept
range: Subject
domain: Subject

agentTypeNonPreferred
type: ObjectProperty
description: A secondary type of a ULAN Person or Corporate body. Domain is ULAN concept, range is AAT concept. Example: Non-preferred types of "Albrecht Duerer Workshop" (ULAN) include "printmakers" and painters" (AAT)
comment: A secondary type of a ULAN Person or Corporate body. Domain is ULAN concept, range is AAT concept
example: Non-preferred types of "Albrecht Duerer Workshop" (ULAN) include "printmakers" and painters" (AAT)
domain: Subject
range: Subject
sub property of: agentType

agentTypePreferred
type: ObjectProperty
description: The primary type of a ULAN Person or Corporate body. Domain is ULAN concept, range is AAT concept. Example: The preferred type of "Albrecht Duerer Workshop" (ULAN) is "workshop" (AAT)
example: The preferred type of "Albrecht Duerer Workshop" (ULAN) is "workshop" (AAT)
domain: Subject
range: Subject
sub property of: agentType

biography
type: ObjectProperty
description: Biography of an ULAN agent. Domain is schema:Person/Organization, range is gvp:Biography. The preferred biography fields are also directly available in the Person/Organization
range: Biography

biographyNonPreferred
type: ObjectProperty
comment: Non-preferred biography of an ULAN agent. Domain is schema:Person/Organization, range is gvp:Biography
range: Biography
sub property of: biography

biographyPreferred
type: ObjectProperty
comment: Preferred biography of an ULAN agent. Domain is schema:Person/Organization, range is gvp:Biography. The biography fields are also directly available in the Person/Organization
range: Biography
sub property of: biography

broader
type: ObjectProperty
description: Parents of a subject. Each broader is also Preferred|NonPreferred and Partitive|Instantial|Generic
range: Subject
domain: Subject

broaderExtended
type: ObjectProperty
example: Mt Athos has ancestor places (BTPE) World, Europe, Greece, Macedonia, Pangaíon Óros regional division; and place types (BTIE) inhabited place; and orthodox religious center, Christian religious center, religious center
comment: Appropriate ancestors. Meaningful closure of gvp:broader for query expansion. Use this, not skos:broaderTransitive
description: Appropriate ancestors. Meaningful closure of gvp:broader for query expansion. Use this, not skos:broaderTransitive. Example: Mt Athos has ancestor places (BTPE) World, Europe, Greece, Macedonia, Pangaíon Óros regional division; and place types (BTIE) inhabited place; and orthodox religious center, Christian religious center, religious center
domain: Subject
range: Subject

broaderGeneric
type: ObjectProperty
description: BTG (Genus/Species, "is a") relation. We also infer iso-thes:broaderGeneric, which goes only between Concepts. Example: calcite (AAT) BTG mineral (AAT)
comment: BTG (Genus/Species, "is a") relation. We also infer iso-thes:broaderGeneric, which goes only between Concepts
example: calcite (AAT) BTG mineral (AAT)
domain: Subject
range: Subject
sub property of: broader
sub property of: broaderGenericExtended

broaderGenericExtended
type: ObjectProperty
description: Ancestors (Generic). Meaningful closure of gvp:broaderGeneric. Infers iso:broaderGeneric for pairs of directly related skos:Concepts. Example: <anvils and anvil accessories> BTG <forging and metal-shaping tools> BTG <forging and metal-shaping equipment>, so <anvils and anvil accessories> BTGE <forging and metal-shaping equipment>
example: <anvils and anvil accessories> BTG <forging and metal-shaping tools> BTG <forging and metal-shaping equipment>, so <anvils and anvil accessories> BTGE <forging and metal-shaping equipment>
comment: Ancestors (Generic). Meaningful closure of gvp:broaderGeneric. Infers iso:broaderGeneric for pairs of directly related skos:Concepts
range: Subject
domain: Subject
sub property of: broaderExtended
property chain axiom: broaderGeneric

broaderInstantial
type: ObjectProperty
description: BTI (Kind/Instance, "example of") relation. We also infer iso-thes:broaderInstantial, which goes only between Concepts. Example: Rembrandt van Rijn BTI Persons/Artists (ULAN)
comment: BTI (Kind/Instance, "example of") relation. We also infer iso-thes:broaderInstantial, which goes only between Concepts
example: Rembrandt van Rijn BTI Persons/Artists (ULAN)
domain: Subject
range: Subject
sub property of: broader
sub property of: broaderInstantialExtended

broaderInstantialExtended
type: ObjectProperty
example: Mt Athos (TGN) BTI orthodox religious center (AAT) BTG Christian religious center (AAT), so Mt Athos (TGN) BTIE Christian religious center (AAT)
description: Ancestors (Instantial). Meaningful closure of gvp:broaderInstantial. Infers iso:broaderInstantial for pairs of directly related skos:Concepts.
domain: Subject
range: Subject
sub property of: broaderExtended
property chain axiom: broaderGeneric

broaderNonConcept
type: ObjectProperty
description: Chain of gvp:broader from Concept to GuideTerms, without intervening Concept
range: GuideTerm
domain: Concept

broaderNonPreferred
type: ObjectProperty
example: Non-preferred: "baking dishes" BTG "dishes (vessels)" (AAT)
comment: Auxiliary parents of a subject. Very often there are several non-preferred parents (poly-hierarchy). Can use to mark such parents with [N] in displays
description: Auxiliary parents of a subject. Very often there are several non-preferred parents (poly-hierarchy). Can use to mark such parents with [N] in displays . Example: Non-preferred: "baking dishes" BTG "dishes (vessels)" (AAT)
range: Subject
domain: Subject
sub property of: broader

broaderPartitive
type: ObjectProperty
comment: BTP (Part/Whole, "part of") relation. We also infer iso-thes:broaderPartitive, which goes only between Concepts
description: BTP (Part/Whole, "part of") relation. We also infer iso-thes:broaderPartitive, which goes only between Concepts. Example: Tuscany (TGN) BTP Italy (TGN)
example: Tuscany (TGN) BTP Italy (TGN)
domain: Subject
range: Subject
sub property of: broader
sub property of: broaderPartitiveExtended

broaderPartitiveExtended
type: ObjectProperty
comment: Ancestors (Partitive). Meaningful closure of gvp:broaderPartitive. Infers iso:broaderPartitive for pairs of directly related skos:Concepts
example: anvil components BTP <anvils and anvil accessories> BTG <forging and metal-shaping tools>, so anvil components BTPE <forging and metal-shaping tools>
description: Ancestors (Partitive). Meaningful closure of gvp:broaderPartitive. Infers iso:broaderPartitive for pairs of directly related skos:Concepts. Example: anvil components BTP <anvils and anvil accessories> BTG <forging and metal-shaping tools>, so anvil components BTPE <forging and metal-shaping tools>
range: Subject
domain: Subject
sub property of: broaderExtended
property chain axiom: broaderGeneric
property chain axiom: broaderPartitive

broaderPreferred
type: ObjectProperty
comment: Main parent of a subject. Needed to display the hierarchy
description: Main parent of a subject. Needed to display the hierarchy. Example: Preferred: "baking dishes" (AAT) BTG "bakeware" (AAT); Sofia (TGN) BTP Bulgaria (TGN)
example: Preferred: "baking dishes" (AAT) BTG "bakeware" (AAT); Sofia (TGN) BTP Bulgaria (TGN)
range: Subject
domain: Subject
sub property of: broader
sub property of: broaderPreferredExtended

broaderPreferredExtended
type: ObjectProperty
comment: Preferred Ancestors. Meaningful closure of gvp:broaderPreferred. Needed to display the hierarchy
example: Mt Athos has preferred ancestor places (BTPE) World, Europe, Greece, Macedonia, Pangaíon Óros regional division; and prefererd place type (BTIE) inhabited place
description: Preferred Ancestors. Meaningful closure of gvp:broaderPreferred. Needed to display the hierarchy. Example: Mt Athos has preferred ancestor places (BTPE) World, Europe, Greece, Macedonia, Pangaíon Óros regional division; and prefererd place type (BTIE) inhabited place
range: Subject
domain: Subject

eventNonPreferred
type: ObjectProperty
comment: Non-preferred life event of an ULAN agent. Domain is schema:Person/Organization, range is bio:Event
range: Event
sub property of: event

eventPreferred
type: ObjectProperty
comment: Preferred life event of an ULAN agent. Domain is schema:Person/Organization, range is bio:Event
range: Event
sub property of: event

historicFlag
type: ObjectProperty
description: Historic Flag
range: Concept

nationalityNonPreferred
type: ObjectProperty
description: Non-preferred nationality/culture/race/ethnicity/religion/sexual orientation of an ULAN agent. Domain is schema:Person/Organization, range is AAT concept
sub property of: nationality
range: Subject

nationalityPreferred
type: ObjectProperty
description: Preferred nationality/culture/race/ethnicity/religion/sexual orientation of an ULAN agent. Domain is schema:Person/Organization, range is AAT concept
sub property of: nationality
range: Subject

parentString
type: ObjectProperty
description: Preferred labels of *all* of the subject's preferred ancestors, listed bottom up. Useful to show the subject's full context. Display version of gvp:broaderPreferredExtended. Example for baking dishes [300226882]: bakeware, <vessels for cooking food>, <containers for cooking food>, <culinary containers>, <containers by function or context>, containers (receptacles), Containers (Hierarchy Name), Furnishings and Equipment (Hierarchy Name), Objects Facet
note: Display version of gvp:broaderPreferredExtended
comment: Preferred labels of *all* of the subject's preferred ancestors, listed bottom up. Useful to show the subject's full context
example: Example for baking dishes [300226882]: bakeware, <vessels for cooking food>, <containers for cooking food>, <culinary containers>, <containers by function or context>, containers (receptacles), Containers (Hierarchy Name), Furnishings and Equipment (Hierarchy Name), Objects Facet
domain: Subject
range: Literal
type: DatatypeProperty

parentStringAbbrev
type: ObjectProperty
description: Preferred labels of *some* of the subject's preferred ancestors, listed bottom up. Useful to show the subject's context. Shortened display version of gvp:broaderPreferredExtended. Example for baking dishes [300226882]: bakeware, <vessels for cooking food>, ... Furnishings and Equipment (Hierarchy Name)
note: Shortened display version of gvp:broaderPreferredExtended
example: Example for baking dishes [300226882]: bakeware, <vessels for cooking food>, ... Furnishings and Equipment (Hierarchy Name)
comment: Preferred labels of *some* of the subject's preferred ancestors, listed bottom up. Useful to show the subject's context
domain: Subject
range: Literal
type: DatatypeProperty

placeType
type: ObjectProperty
comment: Type for a TGN place. Domain is TGN concept (AdminPlaceConcept or PhysPlaceConcept), range is AAT Concept
example: Machupicchu, Peru has preferred type "deserted settlement" (current) and non-preferred type "Inca center" (historic)
description: Type for a TGN place. Domain is TGN concept (AdminPlaceConcept or PhysPlaceConcept), range is AAT Concept. Example: Machupicchu, Peru has preferred type "deserted settlement" (current) and non-preferred type "Inca center" (historic)
domain: Subject
range: Subject

placeTypeNonPreferred
type: ObjectProperty
example: A non-preferred type of Machupicchu, Peru is "Inca center" (historical)
description: A secondary type for a TGN Place. Domain is TGN concept, range is AAT concept. Example: A non-preferred type of Machupicchu, Peru is "Inca center" (historical)
comment: A secondary type for a TGN Place. Domain is TGN concept, range is AAT concept
range: Subject
domain: Subject
sub property of: placeType

placeTypePreferred
type: ObjectProperty
description: The primary type of a TGN Place. Domain is TGN concept, range is AAT concept. Example: The preferred place type of Machupicchu, Peru is "deserted settlement" (current)
example: The preferred place type of Machupicchu, Peru is "deserted settlement" (current)
comment: The primary type of a TGN Place. Domain is TGN concept, range is AAT concept
domain: Subject
range: Subject
sub property of: placeType

prefLabelGVP
type: ObjectProperty
description: Term preferred by the Getty Vocabulary Program. The language is usually English. Applicable to AAT, ULAN, TGN. Used with skosxl:prefLabel
domain: Subject
range: Label

prefLabelLoC
type: ObjectProperty
comment: Term preferred by Library of Congress, thus used for cataloging according to AACR2. Applicable to AAT and ULAN. Used with skosxl:prefLabel
domain: Subject
range: Label

qualifier
type: ObjectProperty
comment: Clarifies and disambiguates terms with the same spelling but different meaning. Appended in parentheses to gvp:term, forming skosxsl:literalForm. Every qualifier is in the same language as the term
example: Rhea (vessels)=rhyta (a kind of drinking vessel) vs rhea (species)=Boehmeria nivea (Chinese grass)
description: Clarifies and disambiguates terms with the same spelling but different meaning. Appended in parentheses to gvp:term, forming skosxsl:literalForm. Every qualifier is in the same language as the term. Example: "Rhea (vessels)"=rhyta (a kind of drinking vessel) vs "Rhea (species)"=Boehmeria nivea (Chinese grass)
range: Literal
domain: Label
type: DatatypeProperty

sourceAlternatePreferred
type: ObjectProperty
example: "Kayseri" is alternate preferred in Webster's New Geographical Dictionary (1988)
comment: Source for which the term is Alternate Preferred. Range is bibo:Document or bibo:DocumentPart
description: Source for which the term is Alternate Preferred. Range is bibo:Document or bibo:DocumentPart. Example: "Kayseri" is alternate preferred in Webster's New Geographical Dictionary (1988)
sub property of: source
range: Document
domain: Label

sourceNonPreferred
type: ObjectProperty
comment: Source for which the term is Non-preferred. Range is bibo:Document or bibo:DocumentPart
example: "Panderma" is non-preferred in Webster's New Geographical Dictionary (1988)
description: Source for which the term is Non-preferred. Range is bibo:Document or bibo:DocumentPart. Example: "Panderma" is non-preferred in Webster's New Geographical Dictionary (1988)
sub property of: source
range: Document
domain: Label

sourcePreferred
type: ObjectProperty
comment: Source for which the term is Preferred. Range is bibo:Document or bibo:DocumentPart
description: Source for which the term is Preferred. Range is bibo:Document or bibo:DocumentPart. Example: "Isfahan" is preferred in Webster's New Geographical Dictionary (1988)
example: "Isfahan" is preferred in Webster's New Geographical Dictionary (1988)
sub property of: source
range: Document
domain: Label

term
type: ObjectProperty
comment: Term (label), used as the basic (prefix) part of skosxsl:literalForm
range: Literal
domain: Label
type: DatatypeProperty

termDisplay
type: ObjectProperty
description: Term Display
range: Concept
domain: Label

termFlag
type: ObjectProperty
description: Term Flag
range: Concept
domain: Label

termKind
type: ObjectProperty
description: Term Kind
range: Concept
domain: Label

termPOS
type: ObjectProperty
description: Part of Speech
range: Concept
domain: Label

termType
type: ObjectProperty
description: Term Type
range: Concept
domain: Label

related to - any
type: ObjectProperty
type: SymmetricProperty
description: any - related to - any. Example: Fountains Abbey is related to Studley Royal; Austria-Hungary is related to Magyarorszag
example: Austria-Hungary is related to Magyarorszag
preferred label: tgn3000_related_to
example: Fountains Abbey is related to Studley Royal
range: Concept
domain: Concept
sub property of: related

distinguished from - any
type: ObjectProperty
type: SymmetricProperty
example: The Ancient Mesopotamian Kingdom 'Assyria' is distinguished from the Roman Province of the same name
description: any - distinguished from - any. Example: The Ancient Mesopotamian Kingdom 'Assyria' is distinguished from the Roman Province of the same name
preferred label: tgn3001_distinguished_from
range: Concept
domain: Concept
sub property of: related

possibly identified as - place
type: ObjectProperty
type: SymmetricProperty
preferred label: tgn3005_possibly_identified_as
example: The lost settlement of Sharuhen is possibly identified as Tel el-Far'ah (As Suwayda', Syria) (deserted settlement)
description: place - possibly identified as - place. Example: The lost settlement of Sharuhen is possibly identified as Tel el-Far'ah (As Suwayda', Syria) (deserted settlement)
domain: Concept
range: Concept
sub property of: related

formerly identified as - place
type: ObjectProperty
type: SymmetricProperty
description: place - formerly identified as - place; New. Example: The deserted settlement of Machupicchu was formerly identified as Tampu Tocco
example: The deserted settlement of Machupicchu was formerly identified as Tampu Tocco
preferred label: tgn3006_formerly_identified_as
scope note: New
range: Concept
domain: Concept
sub property of: related

tgn3101_near-adjacent_to
type: ObjectProperty
type: SymmetricProperty
example: Saint Paul (Minnesota, USA), is linked to its 'Twin City' Minneapolis (Hennepin county, Minnesota, USA)
title: near/adjacent to - any
description: any - near/adjacent to - any. Example: Saint Paul (Minnesota, USA), is linked to its 'Twin City' Minneapolis (Hennepin county, Minnesota, USA)
domain: Concept
range: Concept
sub property of: related

tgn3102_coextensive_with
type: ObjectProperty
type: SymmetricProperty
example: Kings county (New York, USA) is coextensive with Brooklyn (New York, USA)
description: place - coextensive with - place. Example: Kings county (New York, USA) is coextensive with Brooklyn (New York, USA)
title: coextensive with - place
domain: Concept
range: Concept
sub property of: related

meaning/usage overlaps with - any
type: ObjectProperty
type: SymmetricProperty
example: Judaea (Israel) (historical region) meaning/usage overlaps with Holy Land (Asia) (historical region)
description: any - meaning/usage overlaps with - any. Example: Judaea (Israel) (historical region) meaning/usage overlaps with Holy Land (Asia) (historical region)
preferred label: tgn3110_meaning-usage_overlaps_with
range: Concept
domain: Concept
sub property of: related

tgn3201_capital_of
type: ObjectProperty
example: Thecapital of Maxima Caesariensis from 296 to 800 CE was London
title: capital of - nation
description: city - capital of - nation. Example: Thecapital of Maxima Caesariensis from 296 to 800 CE was London
inverse of: capital is - city
domain: Concept
range: Concept
sub property of: related

capital is - city
type: ObjectProperty
description: nation - capital is - city. Example: London was the capital of Maxima Caesariensis from 296 to 800 CE
example: London was the capital of Maxima Caesariensis from 296 to 800 CE
preferred label: tgn3202_capital_is
domain: Concept
range: Concept
sub property of: related

ally of - nation
type: ObjectProperty
type: SymmetricProperty
preferred label: tgn3301_ally_of
description: nation - ally of - nation. Example: Siena, Arezzo, Pisa, and Pistoia were Ghibeline allies during the 13th and 14th centuries.
example: Siena, Arezzo, Pisa, and Pistoia were Ghibeline allies during the 13th and 14th centuries.
domain: Concept
range: Concept
sub property of: related

member of - union
type: ObjectProperty
example: Austria is a member of the European Union since 1915
description: nation - member of - union. Example: Austria is a member of the European Union since 1915; Belgium is a member of the European Union since 1958
example: Belgium is a member of the European Union since 1958
preferred label: tgn3317_member_of
inverse of: tgn3318_member_is
domain: Concept
range: Concept
sub property of: related

tgn3318_member_is
type: ObjectProperty
example: Belgium is a member of the European Union since 1958
title: member is - nation
example: Austria is a member of the European Union since 1915
description: union - member is - nation. Example: Austria is a member of the European Union since 1915; Belgium is a member of the European Union since 1958
range: Concept
domain: Concept
sub property of: related

moved from - place
type: ObjectProperty
description: place - moved from - place; Note: places that were physically moved from one location to another, often due to the threat or occurrence of natural disaster.. Example: Troupville, Georgia, USA was moved to Valdosta (Lowndes county, Georgia, USA)
example: Troupville, Georgia, USA was moved to Valdosta (Lowndes county, Georgia, USA)
preferred label: tgn3401_moved_from
scope note: Note: places that were physically moved from one location to another, often due to the threat or occurrence of natural disaster.
inverse of: moved to - place
domain: Concept
range: Concept
sub property of: related

moved to - place
type: ObjectProperty
preferred label: tgn3402_moved_to
description: place - moved to - place. Example: Valdosta (Lowndes county, Georgia, USA) moved from Troupville (Georgia, USA)
example: Valdosta (Lowndes county, Georgia, USA) moved from Troupville (Georgia, USA)
domain: Concept
range: Concept
sub property of: related

successor of - nation
type: ObjectProperty
description: nation - successor of - nation. Example: Iran (nation) is the successor of Persia
preferred label: tgn3411_successor_of
example: Iran (nation) is the successor of Persia
inverse of: tgn3412_predecessor_of
domain: Concept
range: Concept
sub property of: related

tgn3412_predecessor_of
type: ObjectProperty
example: Persia is the predecessor of Iran (nation)
description: nation - predecessor of - nation. Example: Persia is the predecessor of Iran (nation)
title: predecessor of - nation
range: Concept
domain: Concept
sub property of: related

historical connection - any
type: ObjectProperty
type: SymmetricProperty
example: Guyenne, France (historical region) has a historical connection to Gascogne (France) (historical region)
description: any - historical connection - any. Example: Guyenne, France (historical region) has a historical connection to Gascogne (France) (historical region)
preferred label: tgn3510_historical_connection
range: Concept
domain: Concept
sub property of: related

administrative dependent of - place
type: ObjectProperty
example: Luni (La Spezia province, Liguria, Italy) is the admisistrative dependent of Ortonovo (Massa-Carrara province, Tuscany, Italy)
description: place - administrative dependent of - place; New. Example: Luni (La Spezia province, Liguria, Italy) is the admisistrative dependent of Ortonovo (Massa-Carrara province, Tuscany, Italy)
scope note: New
preferred label: tgn3611_administrative_dependent_of
inverse of: administrative entity for - place
domain: Concept
range: Concept
sub property of: related

administrative entity for - place
type: ObjectProperty
description: place - administrative entity for - place. Example: Ortonovo (Massa-Carra province, Tuscany, Italy) is the administrative entity for Luni (La Spezia province, Liguria, Italy)
example: Ortonovo (Massa-Carra province, Tuscany, Italy) is the administrative entity for Luni (La Spezia province, Liguria, Italy)
preferred label: tgn3612_administrative_entity_for
domain: Concept
range: Concept
sub property of: related

ulan1000_related_to
type: ObjectProperty
type: SymmetricProperty
example: National Endowment for the Humanities is related to Connecticut Humanities Council
example: Frank Lloyd Wright is related to Francis Conroy Sullivan
description: any - related to - any. Example: Frank Lloyd Wright is related to Francis Conroy Sullivan; Herman Miller, Inc. is related to Irving Harper; National Endowment for the Humanities is related to Connecticut Humanities Council
example: Herman Miller, Inc. is related to Irving Harper
title: related to - any
domain: Concept
range: Concept
sub property of: related

ulan1003_associated_with
type: ObjectProperty
type: SymmetricProperty
description: any - associated with - any. Example: Richard Meier is associated with Renny B.Saltzman; United Nations is associated with World Bank
title: associated with - any
example: Richard Meier is associated with Renny B.Saltzman
example: United Nations is associated with World Bank
domain: Concept
range: Concept
sub property of: related

ulan1005_possibly_identified_with
type: ObjectProperty
type: SymmetricProperty
description: any - possibly identified with - any. Example: Master of the Saint John Altarpiece is possibly identified with Hughe Jacobsz; Bauart is possibly identified with Gruppe BAUart
title: possibly identified with - any
example: Bauart is possibly identified with Gruppe BAUart
example: Master of the Saint John Altarpiece is possibly identified with Hughe Jacobsz
range: Concept
domain: Concept
sub property of: related

ulan1006_formerly_identified_with
type: ObjectProperty
type: SymmetricProperty
description: any - formerly identified with - any. Example: Tommaso is formerly identified with Tommaso di Stefano Lunetti; GreenWorks is formerly identified with Mike Faha & Associates
example: GreenWorks is formerly identified with Mike Faha & Associates
title: formerly identified with - any
example: Tommaso is formerly identified with Tommaso di Stefano Lunetti
range: Concept
domain: Concept
sub property of: related

distinguished from - any
type: ObjectProperty
type: SymmetricProperty
example: The Noguchi Museum is distinguished form Isamu Noguchi Garden Museum Japan
example: Laura Theresa Alma-Tadema is distinguished from Lawrence Alma-Tadema
description: any - distinguished from - any. Example: Laura Theresa Alma-Tadema is distinguished from Lawrence Alma-Tadema; The Noguchi Museum is distinguished form Isamu Noguchi Garden Museum Japan
preferred label: ulan1007_distinguished_from
range: Concept
domain: Concept
sub property of: related

ulan1008_meaning_-usage_overlaps_with
type: ObjectProperty
type: SymmetricProperty
description: any - meaning /usage overlaps with - any. Example: The meaning or usage of unknown Zimbabwean overlaps with unknown Rodesian
example: The meaning or usage of unknown Zimbabwean overlaps with unknown Rodesian
title: meaning /usage overlaps with - any
domain: Concept
range: Concept
sub property of: related

ulan1101_teacher_of
type: ObjectProperty
example: Rivalz, Antoine was the teacher of Pierre Subleyras
title: teacher of - person
description: person - teacher of - person. Example: Rivalz, Antoine was the teacher of Pierre Subleyras
inverse of: ulan1102_student_of
range: Concept
domain: Concept
sub property of: related

ulan1102_student_of
type: ObjectProperty
description: person - student of - person. Example: Pierre Subleyras was the student of Rivalz, Antoine
example: Pierre Subleyras was the student of Rivalz, Antoine
title: student of - person
range: Concept
domain: Concept
sub property of: related

apprentice of - person
type: ObjectProperty
description: person - apprentice of - person. Example: Nicolas Hawksmoor was the apprentice of Christopher Wren
example: Nicolas Hawksmoor was the apprentice of Christopher Wren
preferred label: ulan1105_apprentice_of
inverse of: apprentice was - person
range: Concept
domain: Concept
sub property of: related

apprentice was - person
type: ObjectProperty
example: Nicolas Hawksmoor was the apprentice of Christopher Wren
description: person - apprentice was - person. Example: Nicolas Hawksmoor was the apprentice of Christopher Wren
preferred label: ulan1106_apprentice_was
range: Concept
domain: Concept
sub property of: related

influenced - person
type: ObjectProperty
example: Rembrandt van Rijn influenced Salomon Koninck
preferred label: ulan1107_influenced
description: person - influenced - person. Example: Rembrandt van Rijn influenced Salomon Koninck
inverse of: influenced by - person
range: Concept
domain: Concept
sub property of: related

influenced by - person
type: ObjectProperty
example: Salomon Koninck was influenced by Rembrandt van Rijn
preferred label: ulan1108_influenced_by
description: person - influenced by - person. Example: Salomon Koninck was influenced by Rembrandt van Rijn
domain: Concept
range: Concept
sub property of: related

master of - person
type: ObjectProperty
example: Peter Paul Rubens - master of Jan Thomas
description: person - master of - person. Example: Peter Paul Rubens - master of Jan Thomas
preferred label: ulan1111_master_of
inverse of: ulan1112_master_was
domain: Concept
range: Concept
sub property of: related

ulan1112_master_was
type: ObjectProperty
description: person - master was - person. Example: Peter Paul Rubens - master of Jan Thomas
example: Peter Paul Rubens - master of Jan Thomas
title: master was - person
range: Concept
domain: Concept
sub property of: related

fellow student of - person
type: ObjectProperty
type: SymmetricProperty
example: John Sloan was a fellow student of Thomas Hart Benton
example: Alexander Calder was a fellow student of John Sloan
preferred label: ulan1113_fellow_student_of
description: person - fellow student of - person. Example: Alexander Calder was a fellow student of John Sloan; John Sloan was a fellow student of Thomas Hart Benton
range: Concept
domain: Concept
sub property of: related

ulan1201_patron_of
type: ObjectProperty
example: Cosimo I, Grand-Duke of Tuscany was the patron of Donatello
description: person - patron of - person/firm/family. Example: Cosimo I, Grand-Duke of Tuscany was the patron of Donatello
title: patron of - person/firm/family
inverse of: ulan1202_patron_was
domain: Concept
range: Concept
sub property of: related

ulan1202_patron_was
type: ObjectProperty
title: patron was - person
description: person/firm/family - patron was - person. Example: The patron of Donatello was Cosimo I, Grand-Duke of Tuscany
example: The patron of Donatello was Cosimo I, Grand-Duke of Tuscany
domain: Concept
range: Concept
sub property of: related

ulan1203_donor_of
type: ObjectProperty
description: person/firm/family - donor of - person/firm/family. Example: Andrew W. Mellon was a donor of National Gallery of Art
title: donor of - person/firm/family
example: Andrew W. Mellon was a donor of National Gallery of Art
inverse of: ulan1204_donor_was
domain: Concept
range: Concept
sub property of: related

ulan1204_donor_was
type: ObjectProperty
description: person/firm/family - donor was - person/firm/family. Example: Donor to the National Gallery of Art was Andrew W. Mellon
example: Donor to the National Gallery of Art was Andrew W. Mellon
title: donor was - person/firm/family
domain: Concept
range: Concept
sub property of: related

client of - person/firm/family
type: ObjectProperty
example: The Chicago Herald was the client of Burnham and Root
description: person/firm/family - client of - person/firm/family. Example: The Chicago Herald was the client of Burnham and Root
preferred label: ulan1205_client_of
inverse of: ulan1206_client_was
domain: Concept
range: Concept
sub property of: related

ulan1206_client_was
type: ObjectProperty
description: person/firm/family - client was - person/firm/family. Example: Burnham and Root's client was the Chicago Herald
example: Burnham and Root's client was the Chicago Herald
title: client was - person/firm/family
range: Concept
domain: Concept
sub property of: related

artist to - person
type: ObjectProperty
description: person - artist to - person. Example: Artist to Louis XIV, King of France was Charles-Pierre Coustou
preferred label: ulan1211_artist_to
example: Artist to Louis XIV, King of France was Charles-Pierre Coustou
inverse of: ulan1212_artist_was
domain: Concept
range: Concept
sub property of: related

ulan1212_artist_was
type: ObjectProperty
example: Charles-Pierre Coustou was artist to Louis XIV, King of France
description: person - artist was - person. Example: Charles-Pierre Coustou was artist to Louis XIV, King of France
title: artist was - person
range: Concept
domain: Concept
sub property of: related

court artist to - person
type: ObjectProperty
example: Court artist to Gonzaga Vincenzo I, Duke of Mantua was Peter Paul Rubens
description: person - court artist to - person. Example: Court artist to Gonzaga Vincenzo I, Duke of Mantua was Peter Paul Rubens; court artist to Charles IV, King of Spain was Francisco de Goya
preferred label: ulan1213_court_artist_to
example: court artist to Charles IV, King of Spain was Francisco de Goya
inverse of: court artist was - person
domain: Concept
range: Concept
sub property of: related

court artist was - person
type: ObjectProperty
example: Francisco de Goya was court artist to Charles IV, King of Spain
example: Peter Paul Rubens was court artist to Gonzaga Vincenzo I, Duke of Mantua
description: person - court artist was - person. Example: Peter Paul Rubens was court artist to Gonzaga Vincenzo I, Duke of Mantua; Francisco de Goya was court artist to Charles IV, King of Spain
preferred label: ulan1214_court_artist_was
domain: Concept
range: Concept
sub property of: related

employee of - person
type: ObjectProperty
description: person/firm - employee of - person. Example: Employee of Christopher Wren was Jean Tijou
example: Employee of Christopher Wren was Jean Tijou
preferred label: ulan1217_employee_of
inverse of: ulan1218_employee_was
domain: Concept
range: Concept
sub property of: related

ulan1218_employee_was
type: ObjectProperty
description: person - employee was - person/firm. Example: Jean Tijou was an employee of Christopher Wren
example: Jean Tijou was an employee of Christopher Wren
title: employee was - person/firm
range: Concept
domain: Concept
sub property of: related

ulan1221_appointed_by
type: ObjectProperty
example: Pope Urban VIII appointed Virginio Cesarini
description: person - appointed by - person. Example: Pope Urban VIII appointed Virginio Cesarini
title: appointed by - person
inverse of: appointee of - person
domain: Concept
range: Concept
sub property of: related

appointee of - person
type: ObjectProperty
example: Virginio Cesarini was appointee by Pope Urban VIII
description: person - appointee of - person. Example: Virginio Cesarini was appointee by Pope Urban VIII
preferred label: ulan1222_appointee_of
domain: Concept
range: Concept
sub property of: related

crowned by - person
type: ObjectProperty
example: Pope Leo III crowned Emperor Charlemagne
description: person - crowned by - person. Example: Pope Leo III crowned Emperor Charlemagne
preferred label: ulan1223_crowned_by
inverse of: crowned - person
domain: Concept
range: Concept
sub property of: related

crowned - person
type: ObjectProperty
description: person - crowned - person. Example: Emperor Charlemagne was crowned by Pope Leo III
example: Emperor Charlemagne was crowned by Pope Leo III
preferred label: ulan1224_crowned
domain: Concept
range: Concept
sub property of: related

ulan1301_colleague_of
type: ObjectProperty
type: SymmetricProperty
title: colleague of - person
example: Titian was a colleague of Maria Giovanni Verdizotti
description: person - colleague of - person. Example: Titian was a colleague of Maria Giovanni Verdizotti
domain: Concept
range: Concept
sub property of: related

ulan1302_associate_of
type: ObjectProperty
type: SymmetricProperty
title: associate of - person
example: Frank Lloyd Wright was an associate of Giannini and Hilgart
description: person - associate of - person. Example: Frank Lloyd Wright was an associate of Giannini and Hilgart
domain: Concept
range: Concept
sub property of: related

collaborated with - person
type: ObjectProperty
type: SymmetricProperty
example: Pablo Picasso collaborated with Georges Braque
description: person - collaborated with - person. Example: Pablo Picasso collaborated with Georges Braque
preferred label: ulan1303_collaborated_with
range: Concept
domain: Concept
sub property of: related

worked with - person
type: ObjectProperty
type: SymmetricProperty
example: William Cleare worked with Christopher Wren
description: person - worked with - person. Example: William Cleare worked with Christopher Wren; Frank Lloyd Wright work with Aaron G. Green
preferred label: ulan1305_worked_with
example: Frank Lloyd Wright work with Aaron G. Green
domain: Concept
range: Concept
sub property of: related

ulan1306_performs_with
type: ObjectProperty
type: SymmetricProperty
description: person - performs with - person. Example: Harry Kipper performs with Harry Kipper (as part of 'The Kipper Kids')
title: performs with - person
example: Harry Kipper performs with Harry Kipper (as part of 'The Kipper Kids')
domain: Concept
range: Concept
sub property of: related

ulan1307_assistant_of
type: ObjectProperty
example: Bernard Castelli was assistant of Pablo Picasso
description: person - assistant of - person. Example: Bernard Castelli was assistant of Pablo Picasso
title: assistant of - person
inverse of: assisted by - person
domain: Concept
range: Concept
sub property of: related

assisted by - person
type: ObjectProperty
description: person - assisted by - person. Example: Pablo Picasso was assisted by Bernard Castelli
example: Pablo Picasso was assisted by Bernard Castelli
preferred label: ulan1308_assisted_by
range: Concept
domain: Concept
sub property of: related

ulan1309_advisor_of
type: ObjectProperty
title: advisor of - person
example: Thomas Cromwell, Earl of Essex was the advisor of Henry VIII, King of England
description: person - advisor of - person. Example: Thomas Cromwell, Earl of Essex was the advisor of Henry VIII, King of England
inverse of: advised by - person
range: Concept
domain: Concept
sub property of: related

advised by - person
type: ObjectProperty
example: Henry VIII, King of England was advised by Thomas Cromwell, Earl of Essex
description: person - advised by - person. Example: Henry VIII, King of England was advised by Thomas Cromwell, Earl of Essex
preferred label: ulan1310_advised_by
domain: Concept
range: Concept
sub property of: related

ulan1311_partner_of
type: ObjectProperty
type: SymmetricProperty
title: partner of - person
example: Frank Gehry and James Glymph are partners
description: person - partner of - person. Example: Frank Gehry and James Glymph are partners
range: Concept
domain: Concept
sub property of: related

ulan1313_partner_in
type: ObjectProperty
description: person - partner in - firm. Example: Parners of Adler and Sullivan included Louis H. Sullivan and Dankmar Adler
example: Parners of Adler and Sullivan included Louis H. Sullivan and Dankmar Adler
title: partner in - firm
inverse of: partner was - person
domain: Concept
range: Concept
sub property of: related

partner was - person
type: ObjectProperty
example: Louis H. Sullivan and Dankmar Adler were partners in Adler and Sullivan
description: firm - partner was - person. Example: Louis H. Sullivan and Dankmar Adler were partners in Adler and Sullivan
preferred label: ulan1314_partner_was
range: Concept
domain: Concept
sub property of: related

ulan1315_principal_in
type: ObjectProperty
example: Principal in Fontana Workshop was Orazio Fontana
description: person - principal in - firm. Example: Principal in Fontana Workshop was Orazio Fontana
title: principal in - firm
inverse of: principal was - person
range: Concept
domain: Concept
sub property of: related

principal was - person
type: ObjectProperty
description: firm - principal was - person. Example: Orazio Fontana was principal in Fontana Workshop
example: Orazio Fontana was principal in Fontana Workshop
preferred label: ulan1316_principal_was
range: Concept
domain: Concept
sub property of: related

member of - person/firm/group
type: ObjectProperty
description: firm/group - member of - person/firm/group. Example: A member of the Foundation of Documents of Architecture is the National Gallery of Art
example: A member of the Foundation of Documents of Architecture is the National Gallery of Art
preferred label: ulan1317_member_of
inverse of: ulan1318_member_was
domain: Concept
range: Concept
sub property of: related

ulan1318_member_was
type: ObjectProperty
example: The National Gallery of Art was/is a member of the Foundation of Documentation of Architecture
title: member was - firm/group
description: person/firm/group - member was - firm/group. Example: The National Gallery of Art was/is a member of the Foundation of Documentation of Architecture
range: Concept
domain: Concept
sub property of: related

school of - firm/group
type: ObjectProperty
description: person - school of - firm/group. Example: The school of Pierre Saalburg was the Architectural Association. School of Architecture
preferred label: ulan1321_school_of
example: The school of Pierre Saalburg was the Architectural Association. School of Architecture
inverse of: ulan1322_school_was
range: Concept
domain: Concept
sub property of: related

ulan1322_school_was
type: ObjectProperty
description: firm/group - school was - person. Example: Pierre Saalburg attended Architectural Association. School of Architecture
example: Pierre Saalburg attended Architectural Association. School of Architecture
title: school was - person
range: Concept
domain: Concept
sub property of: related

worked with - person
type: ObjectProperty
description: any - worked with - person. Example: Scarsellino and Domenichino worked with the Carracci family
example: Scarsellino and Domenichino worked with the Carracci family
preferred label: ulan1331_worked_with
inverse of: worker was - any
range: Concept
domain: Concept
sub property of: related

worker was - any
type: ObjectProperty
description: person - worker was - any. Example: Workers for the Carracci family included Scarsellino and Domenichino
preferred label: ulan1332_worker_was
example: Workers for the Carracci family included Scarsellino and Domenichino
range: Concept
domain: Concept
sub property of: related

ulan1411_successor_of
type: ObjectProperty
example: Richard Meier & Partners Architects LLP is the successor of Richard Meier & Associates
description: firm/group - successor of - firm/group. Example: Richard Meier & Partners Architects LLP is the successor of Richard Meier & Associates
title: successor of - firm/group
inverse of: predecessor of - firm/group
domain: Concept
range: Concept
sub property of: related

predecessor of - firm/group
type: ObjectProperty
example: Richard Meier & Associates is the predecessor of Richard Meier & Partners Architects LLP
description: firm/group - predecessor of - firm/group. Example: Richard Meier & Associates is the predecessor of Richard Meier & Partners Architects LLP
preferred label: ulan1412_predecessor_of
domain: Concept
range: Concept
sub property of: related

administration overlaps with - firm/group
type: ObjectProperty
type: SymmetricProperty
example: The administration of the Numismatic Collection overlaps with Bode Museum
description: firm/group - administration overlaps with - firm/group. Example: The administration of the Numismatic Collection overlaps with Bode Museum
preferred label: ulan1413_administration_overlaps_with
range: Concept
domain: Concept
sub property of: related

ulan1414_joint_venture_with
type: ObjectProperty
type: SymmetricProperty
description: firm/group - joint venture with - firm/group. Example: Schwetye Luchini Architects is in a joint venture with ACME Architects
title: joint venture with - firm/group
example: Schwetye Luchini Architects is in a joint venture with ACME Architects
range: Concept
domain: Concept
sub property of: related

founded by - firm/group
type: ObjectProperty
description: firm/group - founded by - firm/group. Example: National Gallery of Art was founded by United States Congress
preferred label: ulan1421_founded_by
example: National Gallery of Art was founded by United States Congress
inverse of: ulan1422_founded
range: Concept
domain: Concept
sub property of: related

ulan1422_founded
type: ObjectProperty
description: firm/group - founded - firm/group. Example: The United States Congress founded the National Gallery of Art
title: founded - firm/group
example: The United States Congress founded the National Gallery of Art
range: Concept
domain: Concept
sub property of: related

ulan1500_related_to
type: ObjectProperty
type: SymmetricProperty
example: Titian and Tizianello have a familial relationship with each other
title: related to - person
description: person - related to (familial relationship) - person. Example: Titian and Tizianello have a familial relationship with each other
domain: Concept
range: Concept
sub property of: related

sibling of - person
type: ObjectProperty
type: SymmetricProperty
example: Philippe Rubens is the sibling of Peter Paul Rubens
description: person - sibling of - person. Example: Philippe Rubens is the sibling of Peter Paul Rubens
preferred label: ulan1501_sibling_of
domain: Concept
range: Concept
sub property of: related

child of - person
type: ObjectProperty
preferred label: ulan1511_child_of
example: Rembrandt van Rijn is the child of Neeltgen Willemsdr van Zuydtbroeck
description: person - child of - person. Example: Rembrandt van Rijn is the child of Neeltgen Willemsdr van Zuydtbroeck
inverse of: ulan1512_parent_of
domain: Concept
range: Concept
sub property of: related

ulan1512_parent_of
type: ObjectProperty
example: Rembrandt van Rijn is the parent of Rumbertus van Rijn
description: person - parent of - person. Example: Rembrandt van Rijn is the parent of Rumbertus van Rijn
title: parent of - person
range: Concept
domain: Concept
sub property of: related

grandchild of - person
type: ObjectProperty
preferred label: ulan1513_grandchild_of
description: person - grandchild of - person. Example: Eric Lloyd Wright is the grandchild of Frank Lloyd Wright
example: Eric Lloyd Wright is the grandchild of Frank Lloyd Wright
inverse of: gandparent of - person
domain: Concept
range: Concept
sub property of: related

gandparent of - person
type: ObjectProperty
example: Frank Lloyd Wright is the grandparent of Eric Lloyd Wright
preferred label: ulan1514_gandparent_of
description: person - gandparent of - person. Example: Frank Lloyd Wright is the grandparent of Eric Lloyd Wright
range: Concept
domain: Concept
sub property of: related

ulan1515_great-grandparent_of
type: ObjectProperty
title: great-grandparent of - person
example: Albrecht Adam is the great-grandparent of Richard Benno Adam
description: person - great-grandparent of - person. Example: Albrecht Adam is the great-grandparent of Richard Benno Adam
inverse of: ulan1516_great-grandchild_of
domain: Concept
range: Concept
sub property of: related

ulan1516_great-grandchild_of
type: ObjectProperty
example: Richard Benno Adam is the great-grandchild of Albrecht Adam
title: great-grandchild of - person
description: person - great-grandchild of - person. Example: Richard Benno Adam is the great-grandchild of Albrecht Adam
range: Concept
domain: Concept
sub property of: related

cousin of - person
type: ObjectProperty
type: SymmetricProperty
example: Richard Meier and Frank Gehry are cousins
description: person - cousin of - person. Example: Richard Meier and Frank Gehry are cousins
preferred label: ulan1521_cousin_of
range: Concept
domain: Concept
sub property of: related

ulan1531_nephew-niece_of
type: ObjectProperty
description: person - nephew/niece of - person. Example: Jan Brueghel, the elder is the nephew/neice of Pieter Coecke van Aeist, the younger
title: nephew/niece of - person
example: Jan Brueghel, the elder is the nephew/neice of Pieter Coecke van Aeist, the younger
inverse of: ulan1532_uncle-aunt_of
range: Concept
domain: Concept
sub property of: related

ulan1532_uncle-aunt_of
type: ObjectProperty
description: person - uncle/aunt of - person. Example: Edouard Manet is the uncle/aunt of Julie Manet
example: Edouard Manet is the uncle/aunt of Julie Manet
title: uncle/aunt of - person
domain: Concept
range: Concept
sub property of: related

ulan1541_spouse_of
type: ObjectProperty
type: SymmetricProperty
example: Alfred Stieglitz and Georgia O'Keeffe were married to each other
description: person - spouse of - person. Example: Alfred Stieglitz and Georgia O'Keeffe were married to each other
title: spouse of - person
domain: Concept
range: Concept
sub property of: related

consort of - person
type: ObjectProperty
example: Empress Livia was the consort of Augustus, Emperor of Rome
description: person - consort of - person. Example: Empress Livia was the consort of Augustus, Emperor of Rome
preferred label: ulan1542_consort_of
inverse of: ulan1543_consort_was
domain: Concept
range: Concept
sub property of: related

ulan1543_consort_was
type: ObjectProperty
example: Augustus, Emperor of Rome's consort was Empress Livia
title: consort was - person
description: person - consort was - person. Example: Augustus, Emperor of Rome's consort was Empress Livia
domain: Concept
range: Concept
sub property of: related

significant other of - person
type: ObjectProperty
type: SymmetricProperty
example: Jeanne Hebuterne was the significant other of Amedeo Modigliani
description: person - significant other of - person. Example: Jeanne Hebuterne was the significant other of Amedeo Modigliani
preferred label: ulan1544_significant_other_of
domain: Concept
range: Concept
sub property of: related

ulan1547_romantic_partner_of
type: ObjectProperty
type: SymmetricProperty
example: Vincent van Gogh and Clasina Hoornik were romantic partners
example: Pablo Picasso and Gaby Lespinasse were romantic partners
description: person - romantic partner of - person. Example: Pablo Picasso and Gaby Lespinasse were romantic partners; Vincent van Gogh and Clasina Hoornik were romantic partners
title: romantic partner of - person
range: Concept
domain: Concept
sub property of: related

domestic partner of - person
type: ObjectProperty
type: SymmetricProperty
description: person - domestic partner of - person
preferred label: ulan1548_domestic_partner_of
domain: Concept
range: Concept
sub property of: related

ulan1550_relative_by_marriage
type: ObjectProperty
type: SymmetricProperty
title: relative by marriage - person
description: person - relative by marriage (in-law) - person. Example: Juana Galarza d Goicoechea and Francisco de Goya are related by marriage
example: Juana Galarza d Goicoechea and Francisco de Goya are related by marriage
range: Concept
domain: Concept
sub property of: related

sibling by marriage of - person
type: ObjectProperty
type: SymmetricProperty
description: person - sibling by marriage (step sibling) - person. Example: Peter Paul Rubens and Susanne Fourment are siblings by marriage
example: Peter Paul Rubens and Susanne Fourment are siblings by marriage
preferred label: ulan1551_sibling_by_marriage_of
domain: Concept
range: Concept
sub property of: related

parent by marriage of - person
type: ObjectProperty
example: Frans Hals is a parent by marriage of Pieter Gerritsz van Roestraten
description: person - parent by marriage (step parent) - person. Example: Frans Hals is a parent by marriage of Pieter Gerritsz van Roestraten
preferred label: ulan1552_parent_by_marriage_of
inverse of: child by marriage of - person
domain: Concept
range: Concept
sub property of: related

child by marriage of - person
type: ObjectProperty
preferred label: ulan1553_child_by_marriage_of
description: person - child by marriage (step child) - person. Example: Pieter Gerritsz van Roestraten is the child by marriage of Frans Hals
example: Pieter Gerritsz van Roestraten is the child by marriage of Frans Hals
domain: Concept
range: Concept
sub property of: related

ulan1554_adoptive_parent_of
type: ObjectProperty
example: Julius Caesar is the adoptive parent of Augustus, Emperor of Rome
description: person - adoptive parent of - person. Example: Julius Caesar is the adoptive parent of Augustus, Emperor of Rome
title: adoptive parent of - person
inverse of: adopted child of - person
range: Concept
domain: Concept
sub property of: related

adopted child of - person
type: ObjectProperty
example: Augusts, Emperor of Rome is the adopted child of Julius Caesar
description: person - adopted child of - person. Example: Augusts, Emperor of Rome is the adopted child of Julius Caesar
preferred label: ulan1555_adopted_child_of
range: Concept
domain: Concept
sub property of: related

half-sibling of - person
type: ObjectProperty
type: SymmetricProperty
example: Juan Bautista Monegro and Luis de Carbajal are half siblings
description: person - half-sibling of - person. Example: Juan Bautista Monegro and Luis de Carbajal are half siblings
preferred label: ulan1556_half-sibling_of
range: Concept
domain: Concept
sub property of: related

ulan1557_step-sibling_of
type: ObjectProperty
type: SymmetricProperty
title: step-sibling of - person
example: W. L. Wyllie and Lionel Percy Smythe are step-siblings
description: person - step-sibling of - person. Example: W. L. Wyllie and Lionel Percy Smythe are step-siblings
domain: Concept
range: Concept
sub property of: related

ulan1561_step-child_of
type: ObjectProperty
example: Hortense, Quene consort of Louis Bonaparte is the step-child of Napoleon I, Emperor of the French
title: step-child of - person
description: person - step-child of - person. Example: Hortense, Quene consort of Louis Bonaparte is the step-child of Napoleon I, Emperor of the French
inverse of: ulan1562_step-parent_of
domain: Concept
range: Concept
sub property of: related

ulan1562_step-parent_of
type: ObjectProperty
title: step-parent of - person
example: Napoleon I, Emperor of the French is the step-parent of Hortense, Quene consort of Louis Bonaparte
description: person - step-parent of - person. Example: Napoleon I, Emperor of the French is the step-parent of Hortense, Quene consort of Louis Bonaparte
domain: Concept
range: Concept
sub property of: related

ulan1571_guardian_of
type: ObjectProperty
example: John Hoskins, the elder was the guardian of Samuel Cooper
description: person - guardian of - person. Example: John Hoskins, the elder was the guardian of Samuel Cooper
title: guardian of - person
inverse of: ward of - person
range: Concept
domain: Concept
sub property of: related

ward of - person
type: ObjectProperty
description: person - ward of - person. Example: Samuel Cooper was a ward of John Hoskins, the elder
preferred label: ulan1573_ward_of
example: Samuel Cooper was a ward of John Hoskins, the elder
range: Concept
domain: Concept
sub property of: related

godparent of - person
type: ObjectProperty
example: Jean-Baptiste Goy is godparent of Jean I Nocret
preferred label: ulan1574_godparent_of
description: person - godparent of - person. Example: Jean-Baptiste Goy is godparent of Jean I Nocret
inverse of: godchild of - person
range: Concept
domain: Concept
sub property of: related

godchild of - person
type: ObjectProperty
description: person - godchild of - person. Example: Jean I Nocret is the godchild of Jean-Baptiste Goy
example: Jean I Nocret is the godchild of Jean-Baptiste Goy
preferred label: ulan1575_godchild_of
domain: Concept
range: Concept
sub property of: related

descendant of - person
type: ObjectProperty
example: Paolo Caliari is the descendant of Paolo Veronese
preferred label: ulan1581_descendant_of
description: person - descendant of - person. Example: Paolo Caliari is the descendant of Paolo Veronese
inverse of: ulan1582_ancestor_of
domain: Concept
range: Concept
sub property of: related

ulan1582_ancestor_of
type: ObjectProperty
description: person - ancestor of - person. Example: Paolo Veronese is the ancestor of Paolo Caliari
title: ancestor of - person
example: Paolo Veronese is the ancestor of Paolo Caliari
range: Concept
domain: Concept
sub property of: related

ulan1590_possibly_related_to
type: ObjectProperty
type: SymmetricProperty
description: person - possibly related to (familial relationship) - person. Example: A familial relationship between Ramon Destorrents, the younger and Ramon Destorrents, the elder is possible
title: possibly related to - person
example: A familial relationship between Ramon Destorrents, the younger and Ramon Destorrents, the elder is possible
domain: Concept
range: Concept
sub property of: related

ulan2550_friend_of
type: ObjectProperty
type: SymmetricProperty
description: person - friend of (personal relationship) - person. Example: Alfred Stieglitz and Frank Simon Herrmann were friends
example: Alfred Stieglitz and Frank Simon Herrmann were friends
title: friend of - person
range: Concept
domain: Concept
sub property of: related

founder of - institution
type: ObjectProperty
preferred label: ulan2572_founder_of
description: person - founder of - institution. Example: Louis Comfort Tiffany was the founder of Tiffany Glass & Decorating Company
example: Louis Comfort Tiffany was the founder of Tiffany Glass & Decorating Company
inverse of: ulan2573_founded_by
domain: Concept
range: Concept
sub property of: related

ulan2573_founded_by
type: ObjectProperty
description: institution - founded by - person. Example: Tiffany Glass & Decorating Company was founded by Louis Comfort Tiffany
example: Tiffany Glass & Decorating Company was founded by Louis Comfort Tiffany
title: founded by - person
domain: Concept
range: Concept
sub property of: related

ulan2574_director_of
type: ObjectProperty
description: person - director of - institution. Example: Jean Jans I directed Gobelins Tapestry Manufactory
title: director of - institution
example: Jean Jans I directed Gobelins Tapestry Manufactory
inverse of: directed by - person
domain: Concept
range: Concept
sub property of: related

directed by - person
type: ObjectProperty
preferred label: ulan2575_directed_by
description: institution - directed by - person. Example: Gobelins Tapestry Manufactory was directed by Jean Jans I
example: Gobelins Tapestry Manufactory was directed by Jean Jans I
domain: Concept
range: Concept
sub property of: related

patron of - person
type: ObjectProperty
description: person - patron of - person. Example: The patron of William Chambers was James Caulfiel, Earl of Charlemont
example: The patron of William Chambers was James Caulfiel, Earl of Charlemont
preferred label: ulan2576_patron_of
inverse of: patron was - person
domain: Concept
range: Concept
sub property of: related

patron was - person
type: ObjectProperty
description: person - patron was - person. Example: James Caulfiel, Earl of Charlemont was the patron of William Chambers
preferred label: ulan2577_patron_was
example: James Caulfiel, Earl of Charlemont was the patron of William Chambers
range: Concept
domain: Concept
sub property of: related

ulan2578_trustee_of
type: ObjectProperty
description: person - trustee of - institution. Example: George Douglas Haig was a trustee of the National Galleries of Scotland
example: George Douglas Haig was a trustee of the National Galleries of Scotland
title: trustee of - institution
inverse of: ulan2579_trustee_was
domain: Concept
range: Concept
sub property of: related

ulan2579_trustee_was
type: ObjectProperty
example: National Galleries of Scotland trustee was George Douglas Haig
title: trustee was - person
description: institution - trustee was - person. Example: National Galleries of Scotland trustee was George Douglas Haig
range: Concept
domain: Concept
sub property of: related

administrator of - institution
type: ObjectProperty
example: Georges Mathieu was the administrator of Societe nationale des chemins de fer Francais. Agence des gares
description: person - administrator of - institution. Example: Georges Mathieu was the administrator of Societe nationale des chemins de fer Francais. Agence des gares
preferred label: ulan2581_administrator_of
inverse of: administered by - person
domain: Concept
range: Concept
sub property of: related

administered by - person
type: ObjectProperty
example: Societe nationale des chemins de fer Francais. Agence des gares was administered by Georges Mathieu
preferred label: ulan2582_administered_by
description: institution - administered by - person. Example: Societe nationale des chemins de fer Francais. Agence des gares was administered by Georges Mathieu
domain: Concept
range: Concept
sub property of: related

ulan2650_publisher_was
type: ObjectProperty
description: person - publisher was - firm. Example: The publisher for Pierre Joseph Rossier was Negretti and Zambra
example: The publisher for Pierre Joseph Rossier was Negretti and Zambra
title: publisher was - firm
inverse of: publisher of - person
range: Concept
domain: Concept
sub property of: related

publisher of - person
type: ObjectProperty
description: firm - publisher of - person. Example: Negretti and Zambra was the publisher of Pierre Joseph Rossier
preferred label: ulan2651_publisher_of
example: Negretti and Zambra was the publisher of Pierre Joseph Rossier
domain: Concept
range: Concept
sub property of: related

ulan2674_professor_at
type: ObjectProperty
example: Paul Klee was a professor at Bauhaus
description: person - professor at - institution. Example: Paul Klee was a professor at Bauhaus
title: professor at - institution
inverse of: ulan2675_professor_was
domain: Concept
range: Concept
sub property of: related

ulan2675_professor_was
type: ObjectProperty
example: A professor at Bauhaus was Paul Klee
title: professor was - person
description: institution - professor was - person. Example: A professor at Bauhaus was Paul Klee
range: Concept
domain: Concept
sub property of: related

ulan2676_teacher_at
type: ObjectProperty
example: Willem De Kooning was a teacher at Black Mountain College
title: teacher at - institution
description: person - teacher at - institution. Example: Willem De Kooning was a teacher at Black Mountain College
inverse of: ulan2677_teacher_was
range: Concept
domain: Concept
sub property of: related

ulan2677_teacher_was
type: ObjectProperty
example: A teacher at Black Mountain College was Willem De Kooning
title: teacher was - person
description: institution - teacher was - person. Example: A teacher at Black Mountain College was Willem De Kooning
domain: Concept
range: Concept
sub property of: related

ulan2692_president_of
type: ObjectProperty
title: president of - institution
example: David K. E. Bruce was president of National Gallery of Art
description: person - president of - institution. Example: David K. E. Bruce was president of National Gallery of Art
inverse of: president was - person
range: Concept
domain: Concept
sub property of: related

president was - person
type: ObjectProperty
preferred label: ulan2693_president_was
example: A president of National Gallery of Art was David K. E. Bruce
description: institution - president was - person. Example: A president of National Gallery of Art was David K. E. Bruce
domain: Concept
range: Concept
sub property of: related

ulan2696_leader_of
type: ObjectProperty
description: person - leader of - institution. Example: Rush Harrison Kress was the leader of Samuel H. Kress Foundation
example: Rush Harrison Kress was the leader of Samuel H. Kress Foundation
title: leader of - institution
inverse of: ulan2697_leader_was
domain: Concept
range: Concept
sub property of: related

ulan2697_leader_was
type: ObjectProperty
example: The leader of Samuel H. Kress Foundation was Rush Harrison Kress
description: institution - leader was - person. Example: The leader of Samuel H. Kress Foundation was Rush Harrison Kress
title: leader was - person
range: Concept
domain: Concept
sub property of: related

ulan2778_owner_of
type: ObjectProperty
description: firm - owner of - person. Example: Walter Scott Lenox was the owner of Lenox China Co.
example: Walter Scott Lenox was the owner of Lenox China Co.
title: owner of - person
inverse of: owned by - firm
range: Concept
domain: Concept
sub property of: related

owned by - firm
type: ObjectProperty
example: Walter Scott Lenox was owned by Lenox China Co.
description: person - owned by - firm. Example: Walter Scott Lenox was owned by Lenox China Co.
preferred label: ulan2779_owned_by
domain: Concept
range: Concept
sub property of: related

dedicatee of - institution
type: ObjectProperty
description: person - dedicatee of - institution. Example: Auguste Rodin is the dedicatee of The Rodin Museum in Philadelphia
preferred label: ulan2781_dedicatee_of
example: Auguste Rodin is the dedicatee of The Rodin Museum in Philadelphia
inverse of: ulan2782_dedicated_to
range: Concept
domain: Concept
sub property of: related

ulan2782_dedicated_to
type: ObjectProperty
description: institution - dedicated to - person. Example: The Rodin Museum in Philadelphia is didicated to Auguste Rodin
title: dedicated to - person
example: The Rodin Museum in Philadelphia is didicated to Auguste Rodin
range: Concept
domain: Concept
sub property of: related

representative of - institution
type: ObjectProperty
description: person - representative of - institution. Example: The Noguch Museum - representative was Isamu Noguchi
example: The Noguch Museum - representative was Isamu Noguchi
preferred label: ulan2794_representative_of
inverse of: representative was - person
range: Concept
domain: Concept
sub property of: related

representative was - person
type: ObjectProperty
description: institution - representative was - person. Example: The Noguch Museum - representative was Isamu Noguchi
preferred label: ulan2795_representative_was
example: The Noguch Museum - representative was Isamu Noguchi
domain: Concept
range: Concept
sub property of: related

ulan2828_student_at
type: ObjectProperty
description: person - student at - institution. Example: Zdanek Rossman was a student at Bauhaus
example: Zdanek Rossman was a student at Bauhaus
title: student at - institution
inverse of: student was - person
range: Concept
domain: Concept
sub property of: related

student was - person
type: ObjectProperty
example: Bauhaus student was Zdanek Rossman
description: institution - student was - person. Example: Bauhaus student was Zdanek Rossman
preferred label: ulan2829_student_was
range: Concept
domain: Concept
sub property of: related

performer with - group
type: ObjectProperty
description: person - performer with - group
preferred label: ulan2840_performer_with
inverse of: performer was - person
range: Concept
domain: Concept
sub property of: related

performer was - person
type: ObjectProperty
description: group - performer was - person
preferred label: ulan2841_performer_was
range: Concept
domain: Concept
sub property of: related

displayOrder
type: DatatypeProperty
description: Display order of subject or term amongst its siblings. If all are 1 then use alphabetical. Domain is gvp:Subject or skosxl:Label
range: positiveInteger

estEnd
type: DatatypeProperty
description: Estimated end date of term, relation, type assignment, event, biography

estStart
type: DatatypeProperty
comment: Estimated start date of term, relation, type assignment, event, biography

AdminPlaceConcept
type: Class
subclass of: Subject
subclass of: Concept
description: Place defined by administrative boundaries and conditions, including inhabited places, nations, and empires. Used in TGN only. Example: Burgundy region in France (TGN)
comment: Place defined by administrative boundaries and conditions, including inhabited places, nations, and empires. Used in TGN only
example: Burgundy region in France (TGN)

Biography
type: Class
comment: Biography of a ULAN agent (schema:Person|Organization). Depending on the agent, has these fields: - schema:description: one-line-biography - gvp:estStart - schema:birthPlace | foundationLocation, pointing to TGN - gvp:estEnd - schema:deathPlace | dissolutionLocation, pointing to TGN - schema:gender, pointing to AAT (male, female, other) - dct:contributor The fields of the preferred biogrpahy are also available in the agent.

Concept
type: Class
subclass of: Subject
subclass of: Concept
description: Proper concept. Used in AAT only; TGN & ULAN have their own, e.g. gvp:PhysPlaceConcept & gvp:PersonConcept. Used for indexing and cataloguing. Example: rhyta (AAT)
example: rhyta (AAT)
comment: Proper concept. Used in AAT only; TGN & ULAN have their own, e.g. gvp:PhysPlaceConcept & gvp:PersonConcept. Used for indexing and cataloguing

Facet
type: Class
subclass of: ThesaurusArray
subclass of: Subject
example: Objects Facet (AAT), World (TGN), Artists (ULAN)
description: One of the major divisions of a vocabulary. Example: Objects Facet (AAT), World (TGN), Artists (ULAN)
comment: One of the major divisions of a vocabulary

GroupConcept
type: Class
subclass of: Subject
subclass of: Concept
comment: Two or more people who generally worked together to collectively create art. Not necessarily legally incorporated. A family of artists may be considered a "corporate body". Corresponds to crm:E74_Group, not its subclass crm:E40_Legal_Body
example: 500356337 Albrecht Duerer Workshop (ULAN)
description: Two or more people who generally worked together to collectively create art. Not necessarily legally incorporated. A family of artists may be considered a "corporate body". Corresponds to crm:E74_Group, not its subclass crm:E40_Legal_Body. Example: 500356337 Albrecht Duerer Workshop (ULAN)

GuideTerm
type: Class
subclass of: ThesaurusArray
subclass of: Subject
example: <vessels for serving and consuming food> (AAT), ulan:500353455 <named animals> under facet Non-Artists (ULAN)
comment: Guide Term: place holder to create a level in the hierarchy. Used in AAT and ULAN. Not used for indexing or cataloguing.
description: Guide Term: place holder to create a level in the hierarchy. Used in AAT and ULAN. Not used for indexing or cataloguing.. Example: <vessels for serving and consuming food> (AAT), ulan:500353455 <named animals> under facet Non-Artists (ULAN)

Hierarchy
type: Class
subclass of: ThesaurusArray
subclass of: Subject
example: Containers (Hierarchy Name) (AAT)
comment: Top of a hierarchy. Used in AAT only. Not used for indexing or cataloguing
description: Top of a hierarchy. Used in AAT only. Not used for indexing or cataloguing. Example: Containers (Hierarchy Name) (AAT)

ObsoleteSubject
type: Class
subclass of: Subject
example: 300375205 "shranks" (AAT) was merged to 300039264 "schranks" (AAT), so aat:300375205 dct:isReplacedBy aat:300039264
comment: Obsolete subject: moved out of the publishable hierarchy, or merged to another (pointed by dct:isReplacedBy)
description: Obsolete subject: moved out of the publishable hierarchy, or merged to another (pointed by dct:isReplacedBy). Example: 300375205 "shranks" (AAT) was merged to 300039264 "schranks" (AAT), so aat:300375205 dct:isReplacedBy aat:300039264

PersonConcept
type: Class
subclass of: Subject
subclass of: Concept
comment: A single individual. Usually people engaged in the design or creation of art or architecture ("Artists"); but may also include donors, patrons, rulers, sitters, art historians, etc ("Non-Artists")
description: A single individual. Usually people engaged in the design or creation of art or architecture ("Artists"); but may also include donors, patrons, rulers, sitters, art historians, etc ("Non-Artists"). Example: 500115493 Duerer, Albrecht (ULAN)
example: 500115493 Duerer, Albrecht (ULAN)

PhysAdminPlaceConcept
type: Class
subclass of: Subject
subclass of: Concept
example: 6003090 Kiik-Koba (TGN)
comment: Place that is both administrative and physical. Rarely used. Used in TGN only
description: Place that is both administrative and physical. Rarely used. Used in TGN only. Example: 6003090 Kiik-Koba (TGN)

PhysPlaceConcept
type: Class
subclass of: Subject
subclass of: Concept
comment: Physical feature, defined by its physical characteristics on planet Earth, including mountains, rivers, and oceans. Used in TGN only
example: Amazon River (TGN)
description: Physical feature, defined by its physical characteristics on planet Earth, including mountains, rivers, and oceans. Used in TGN only. Example: Amazon River (TGN)

ScopeNote
type: Class
description: Defines a GVP subject or provides usage information. Has fields: - dc:identifier: numeric ID, also used in the URL. - rdf:value: the note itself (as per SKOS Primer: 4.2 Advanced Documentation Features) with language tag - dct:language: matches the language tag - gvp:displayOrder, order of this note amongst others - gvp:historicFlag, vp:estStart, gvp:estEnd, rdfs:comment: Historic Information about applicability - dct:source or subproperties thereof - dct:contributor or subproperties thereof
comment: Defines a GVP subject or provides usage information. Has fields: - dc:identifier: numeric ID, also used in the URL. - rdf:value: the note itself (as per SKOS Primer: 4.2 Advanced Documentation Features) with language tag - dct:language: matches the language tag - gvp:displayOrder, order of this note amongst others - gvp:historicFlag, gvp:estStart, gvp:estEnd, rdfs:comment: Historic Information about applicability - dct:source or subproperties thereof - dct:contributor or subproperties thereof

Subject
type: Class
comment: Node in a GVP vocabulary hierarchy. May be Facet, GuideTerm, Hierarchy, Concept, AdminPlaceConcept, PhysPlaceConcept, PhysAdminPlaceConcept, or ObsoleteSubject. Implemented as skos:Concept or iso:ThesaurusArray and skos:Collection

UnknownPersonConcept
type: Class
subclass of: Subject
subclass of: Concept
example: 500355202 Unknown Bulgarian (modern) (ULAN)
comment: Unknown person representing a nationality/culture (the Unknown People by Culture facet)
description: Unknown person representing a nationality/culture (the Unknown People by Culture facet). Example: 500355202 Unknown Bulgarian (modern) (ULAN)

Ontotext Corp
type: NamedIndividual
type: Organization

Art and Architecture Thesaurus
type: NamedIndividual
type: ConceptScheme
created: 2014-02-20
preferred namespace prefix: aat
comment: The Art and Architecture Thesaurus concept scheme
creator: Ontotext Corp
creator: Getty Research Institute

Historic Flag concept scheme
type: NamedIndividual
type: ConceptScheme
description: Historic Flag concept scheme

Current
type: NamedIndividual
type: Concept
description: Valid/used currently
notation: C
scope note: Valid/used currently
in scheme: Historic Flag concept scheme

Both Current and Historic
type: NamedIndividual
type: Concept
description: Valid/used both in the past and currently. Example: Saint Petersburg (TGN)
scope note: Valid/used both in the past and currently
example: Saint Petersburg (TGN)
notation: B
in scheme: Historic Flag concept scheme

Historic
type: NamedIndividual
type: Concept
description: Valid/used in the past but not currently. Example: "Lutetia" is a historic name for "Paris" (TGN). "weyneschot" is a 16th-century spelling for "wainscoting" (AAT)
notation: H
example: "Lutetia" is a historic name for "Paris" (TGN). "weyneschot" is a 16th-century spelling for "wainscoting" (AAT)
scope note: Valid/used in the past but not currently
in scheme: Historic Flag concept scheme

Local Use
type: NamedIndividual
type: Concept
scope note: Used locally for Unidentified Named People mentioned in some document (ULAN only)
example: 500051176 Abinetti (ULAN) is an unknown artist mentioned in documentation of lot 209 of an auction held 29 Jan 1824 in London
description: Used locally for Unidentified Named People mentioned in some document (ULAN only). Example: 500051176 Abinetti (ULAN) is an unknown artist mentioned in documentation of lot 209 of an auction held 29 Jan 1824 in London
notation: LU
in scheme: Historic Flag concept scheme

Part of Speech concept scheme
type: NamedIndividual
type: ConceptScheme
description: Part of Speech concept scheme

Adjectival
type: NamedIndividual
type: Concept
description: This term may be combined with others in post-coordinated compound terms. Example: "Renaissance" (as in "Renaissance cathedral"), "painter's" (as in "painter's smock")
notation: A
example: "Renaissance" (as in "Renaissance cathedral"), "painter's" (as in "painter's smock")
scope note: This term may be combined with others in post-coordinated compound terms
in scheme: Part of Speech concept scheme

Both Singular and Plural
type: NamedIndividual
type: Concept
scope note: A term that is used for both the singular and plural in the same language
notation: B
description: A term that is used for both the singular and plural in the same language. Example: "chassis" is both singular and plural in French
example: "chassis" is both singular and plural in French
in scheme: Part of Speech concept scheme

Noun
type: NamedIndividual
type: Concept
notation: N
scope note: Term is a noun but we are uncertain if it is plural or singular
description: Term is a noun but we are uncertain if it is plural or singular. Example: Panthera leo
example: Panthera leo
in scheme: Part of Speech concept scheme

Past Participle
type: NamedIndividual
type: Concept
description: Rarely used but if at all, is most likely to apply in Attributes and Properties. Example: hand-painted
notation: PP
scope note: Rarely used but if at all, is most likely to apply in Attributes and Properties
example: hand-painted
in scheme: Part of Speech concept scheme

Plural Noun
type: NamedIndividual
type: Concept
description: A term that is plural (the same word may be singular in another language). Example: "filigrane" is the Italian plural for "watermarks"
example: "filigrane" is the Italian plural for "watermarks"
scope note: A term that is plural (the same word may be singular in another language)
notation: PN
in scheme: Part of Speech concept scheme

Singular Noun
type: NamedIndividual
type: Concept
scope note: A term that is singular (the same word may be plural in another language)
notation: SN
description: A term that is singular (the same word may be plural in another language). Example: "filigrane" is the French singular for "watermark"
example: "filigrane" is the French singular for "watermark"
in scheme: Part of Speech concept scheme

Verbal Noun/Gerund
type: NamedIndividual
type: Concept
description: Term is a verbal noun or gerund. Example: polishing
notation: VN
scope note: Term is a verbal noun or gerund
example: polishing
in scheme: Part of Speech concept scheme

Term Display concept scheme
type: NamedIndividual
type: ConceptScheme
description: Term Display concept scheme

Use for Display
type: NamedIndividual
type: Concept
scope note: Use in displays where natural order is appropriate
notation: D
description: Use in displays where natural order is appropriate
notation: Y
in scheme: Term Display concept scheme

Use in Indexes/lists
type: NamedIndividual
type: Concept
scope note: Use in indexes or permuted lists where inverted order is appropriate
description: Use in indexes or permuted lists where inverted order is appropriate
notation: I
in scheme: Term Display concept scheme

Term Flag concept scheme
type: NamedIndividual
type: ConceptScheme
description: Term Flag concept scheme

Literal Translation
type: NamedIndividual
type: Concept
description: Literal translation of a name. Defined for ULAN, but currently there are no examples of this
scope note: Literal translation of a name. Defined for ULAN, but currently there are no examples of this
notation: T
in scheme: Term Flag concept scheme

Loan Term
type: NamedIndividual
type: Concept
notation: L
description: Term borrowed from another language that has become naturalized in American English. Example: papier mache
example: papier mache
scope note: Term borrowed from another language that has become naturalized in American English
in scheme: Term Flag concept scheme

Vernacular
type: NamedIndividual
type: Concept
description: Term is the vernacular for a certain place. Example: "kachoga" is the Vernacular for 300266169 "bird-and-flower paintings" (AAT). "Firenze" is the vernacular in Italian (TGN)
scope note: Term is the vernacular for a certain place
notation: V
example: "kachoga" is the Vernacular for 300266169 "bird-and-flower paintings" (AAT). "Firenze" is the vernacular in Italian (TGN)
in scheme: Term Flag concept scheme

Term Kind concept scheme
type: NamedIndividual
type: ConceptScheme
description: Term Kind concept scheme

Abbreviation
type: NamedIndividual
type: Concept
notation: A
description: Term is an abbreviation, initialism, or acronym. Example: "FLIM" is abbrevaition for "fluorescence lifetime imaging microscopy"
scope note: Term is an abbreviation, initialism, or acronym
example: "FLIM" is abbrevaition for "fluorescence lifetime imaging microscopy"
in scheme: Term Kind concept scheme

Birth Name
type: NamedIndividual
type: Concept
description: Birth Name of an ULAN agent. Example: TODO
notation: BN
example: TODO
scope note: Birth Name of an ULAN agent
in scheme: Term Kind concept scheme

Chemical Name
type: NamedIndividual
type: Concept
description: Term is the chemical name for the descriptor. Used in AAT only. Example: "sodium tetraborate decahydrate" is chemical name for "borax"
scope note: Term is the chemical name for the descriptor. Used in AAT only
notation: CN
example: "sodium tetraborate decahydrate" is chemical name for "borax"
in scheme: Term Kind concept scheme

Common Name
type: NamedIndividual
type: Concept
scope note: Common Name of an ULAN agent
notation: CN
example: TODO
description: Common Name of an ULAN agent. Example: TODO
in scheme: Term Kind concept scheme

Common term
type: NamedIndividual
type: Concept
example: "frankincense" (species) is common term for "Boswellia sacra" (species)
notation: C
scope note: Preferred common language term. Used for subjects that also include a Scientific term. Used in AAT only
description: Preferred common language term. Used for subjects that also include a Scientific term. Used in AAT only. Example: "frankincense" (species) is common term for "Boswellia sacra" (species)
in scheme: Term Kind concept scheme

FIPS Code
type: NamedIndividual
type: Concept
example: "MX21" for Puebla, Mexico
notation: FIPS
description: FIPS region code. Used in TGN. Example: "MX21" for Puebla, Mexico
scope note: FIPS region code. Used in TGN
in scheme: Term Kind concept scheme

Full Name
type: NamedIndividual
type: Concept
notation: FN
description: Full Name of an ULAN agent. Example: TODO
scope note: Full Name of an ULAN agent
example: TODO
in scheme: Term Kind concept scheme

Full term
type: NamedIndividual
type: Concept
scope note: Full-form term. Used when the descriptor is a shorter form, or the subject also includes an Abbreviation. Used in AAT only
example: "Extensible Markup Language" is the full term for "XML" (which is preferred)
description: Full-form term. Used when the descriptor is a shorter form, or the subject also includes an Abbreviation. Used in AAT only. Example: "Extensible Markup Language" is the full term for "XML" (which is preferred)
notation: F
in scheme: Term Kind concept scheme

ISO alpha-2 code
type: NamedIndividual
type: Concept
scope note: ISO 3166-1 alpha-2 country code. Used in TGN
example: "AQ" for Antarctica
description: ISO 3166-1 alpha-2 country code. Used in TGN. Example: "AQ" for Antarctica
notation: ISO2L
in scheme: Term Kind concept scheme

ISO alpha-3 code
type: NamedIndividual
type: Concept
description: ISO 3166-1 alpha-3 country code. Used in TGN. Example: "ATA" for Antarctica
example: "ATA" for Antarctica
scope note: ISO 3166-1 alpha-3 country code. Used in TGN
notation: ISO3L
in scheme: Term Kind concept scheme

ISO numeric-2 code
type: NamedIndividual
type: Concept
notation: ISO2N
description: May be used in TGN, but no code of this kind is present
scope note: May be used in TGN, but no code of this kind is present
in scheme: Term Kind concept scheme

ISO numeric-3 code
type: NamedIndividual
type: Concept
description: ISO 3166-1 numeric country code as "ISOnnn" (though ISO specifies only "nnn"). Used in TGN only. Example: "ISO414" for Kuwait
scope note: ISO 3166-1 numeric country code as "ISOnnn" (though ISO specifies only "nnn"). Used in TGN only
example: "ISO414" for Kuwait
notation: ISO3N
in scheme: Term Kind concept scheme

Jargon or Slang
type: NamedIndividual
type: Concept
description: Slang or jargon term. Used in AAT only. Example: "fool's gold" is slang for "pyrite"
scope note: Slang or jargon term. Used in AAT only
example: "fool's gold" is slang for "pyrite"
notation: J
in scheme: Term Kind concept scheme

Neologism
type: NamedIndividual
type: Concept
description: Term that is new to the language, generally having been coined due to new technology. Used in AAT only.. Example: "folksonomy", "podcasting"
example: "folksonomy", "podcasting"
notation: N
scope note: Term that is new to the language, generally having been coined due to new technology. Used in AAT only.
in scheme: Term Kind concept scheme

Official Name
type: NamedIndividual
type: Concept
description: Used in TGN and ULAN. Example: "Noyen-sur-Seine" is official name of 7030197 "Noyen" (TGN)
notation: O
scope note: Used in TGN and ULAN
example: "Noyen-sur-Seine" is official name of 7030197 "Noyen" (TGN)
in scheme: Term Kind concept scheme

Provisional Name
type: NamedIndividual
type: Concept
notation: PN
example: "Rockton" was provisional name considered before adoption of "Kent" (Ohio)
scope note: Used in TGN only
description: Used in TGN only. Example: "Rockton" was provisional name considered before adoption of "Kent" (Ohio)
in scheme: Term Kind concept scheme

Pseudonym
type: NamedIndividual
type: Concept
example: "Frisco" is nickname for San Francisco (TGN)
description: Used in TGN and ULAN. Example: "Frisco" is nickname for San Francisco (TGN)
scope note: Used in TGN and ULAN
notation: P
in scheme: Term Kind concept scheme

Scientific or Technical term
type: NamedIndividual
type: Concept
description: Scientific taxon name (genus, species, etc). Used in AAT only. All such are emitted marked with English language, and most have the same string marked with Latin. Example: "Boswellia sacra"@la, also emitted as "Boswellia sacra"@en, is scientific name of "frankincense"
example: "Boswellia sacra"@la, also emitted as "Boswellia sacra"@en, is scientific name of "frankincense"
notation: S
scope note: Scientific taxon name (genus, species, etc). Used in AAT only. All such are emitted marked with English language, and most have the same string marked with Latin
in scheme: Term Kind concept scheme

Site Name
type: NamedIndividual
type: Concept
notation: S
scope note: Used in TGN only
description: Used in TGN only. Example: "Flavia Solva", a deserted settlement and archaeological site (TGN)
example: "Flavia Solva", a deserted settlement and archaeological site (TGN)
in scheme: Term Kind concept scheme

US Postal Service Code
type: NamedIndividual
type: Concept
example: "CA" for California
description: Used in TGN only. Example: "CA" for California
scope note: Used in TGN only
notation: USPS
in scheme: Term Kind concept scheme

Term Type concept scheme
type: NamedIndividual
type: ConceptScheme
description: Term Type concept scheme

Alternate Descriptor
type: NamedIndividual
type: Concept
example: "manuscript" (English) instead of "manuscripts"
scope note: A lexical variant, eg singular
description: A lexical variant, eg singular. Example: "manuscript" (English) instead of "manuscripts"
notation: AD
in scheme: Term Type concept scheme

Descriptor
type: NamedIndividual
type: Concept
example: "manuscripts" (English)
scope note: Main term. Getty usually uses the plural
description: Main term. Getty usually uses the plural. Example: "manuscripts" (English)
notation: D
in scheme: Term Type concept scheme

Used for Term
type: NamedIndividual
type: Concept
notation: UF
scope note: A synonym
example: "handschriften" (Dutch) instead of "manuscripten"
description: A synonym. Example: "handschriften" (Dutch) instead of "manuscripten"
in scheme: Term Type concept scheme

Thesaurus of Geographic Names
type: NamedIndividual
type: ConceptScheme
created: 2014-06-15
comment: The Thesaurus of Geographic Names concept scheme
preferred namespace prefix: tgn
creator: Ontotext Corp
creator: Getty Research Institute

Union List of Artist Names
type: NamedIndividual
type: ConceptScheme
created: 2015-03-25
preferred namespace prefix: ulan
comment: The Union List of Artist Names concept scheme
creator: Ontotext Corp
creator: Getty Research Institute

Getty Research Institute
type: NamedIndividual
type: Organization