has Citation
type: ObjectProperty
comment: indicates that the legal resource has the referenced citation
domain: LegalResourceSubdivision
range: Citation
sub property of: has part

Activity
type: Class
comment: An Activity signifies some process(es) or step(s) towards specific deed(s), action(s), function(s), or sphere(s) of action.
subclass of: Concept

Relevant for processing
type: Class
comment: Any retained personal data must be relevant for subsiquent processing
subclass of: Data Retention
involves: Processing
involves: Personal Data

has Point
type: FunctionalProperty
type: ObjectProperty
comment: indicates the legal resource has the Point
domain: LegalResourceSubdivision
range: Point
sub property of: has part

has Article
type: FunctionalProperty
type: ObjectProperty
comment: indicates the legal resource has the Article
domain: LegalResourceSubdivision
range: Article
sub property of: has part

Awarding Seals and Certifications
type: Class
comment: GDPR mentions some conditions or criterion for the creation and issuing of seals and certifications pertaining to GDPR compliance
subclass of: Seals and Certifications
involves: Voluntary accredition
involves: Maximum validty 3 years
involves: Adherence

Collection of Personal Data
type: Class
comment: Collection of Personal Data is an Activity that deals with acquiring data subject's personal data through some model of interaction.
subclass of: Data Activity
involves: Personal Data

Accuracy is contested
type: Class
comment: The data subject can exercise the right to restrict processing of their personal data when the accuracy of personal data is contested
subclass of: Right to restrict processing
involves: Personal Data

Data no longer needed for original purpose
type: Class
comment: The data subject can exercise the right to restrict processing of their personal data when the personal data is no longer required for the original purpose it was collected under
subclass of: Right to restrict processing
involves: Personal Data
involves: Collection of Personal Data

Contract with Data Subject
type: Class
comment: The lawful basis for processing personal data is provided through a contract with the data subject.
subclass of: Lawful Basis
involves: Data Subject

Pseudo-anonymous data
type: Class
comment: Personal data that can no longer be attributed to a specific data subject without the use of additional information.
subclass of: Data
involves: Data Subject

Information about storage period
type: Class
comment: The right to access personal data also includes information about the storage period of the data subject's personal data
subclass of: Right to Access Personal Data
involves: Store Data
involves: Personal Data

Regulation (EC) No 45/2001
type: Class
comment: Related to Regulation (EC) No. 45/2001
subclass of: Exlcusions and Exceptions

Cross-border Transfer
type: Class
comment: Cross-border data transfer refers to data transfer crossing the boundaries of EU (legislative) region.
subclass of: Factors for Impact Assessment
subclass of: Data Activity
involves: Personal Data

Sensitive Personal Data
type: Class
comment: Personal data revealing racial or ethnic origin, political opinions, religious or philosophical beliefs, or trade union membership, and the processing of genetic data, biometric data for the purpose of uniquely identifying a natural person, data concerning health or data concerning a natural person's sex life or sexual orientation.
subclass of: Personal Data
involves: Data Subject

Information about categories of data being processed
type: Class
comment: The right to access personal data also includes information about categories of data being processed
subclass of: Right to Access Personal Data
involves: Processing
involves: Personal Data

Automated Processing
type: Class
comment: This is automated processing of data subject's personal data.
subclass of: Processing
involves: Personal Data

Joint Controller
type: Class
comment: A joint controller is two or more controllers jointly determine the purposes and means of processing.
subclass of: Controller
involves: Controller

Requires disproportionate efforts
type: Class
comment: The stated obligation or activity could not be completed as it requires disproportionate efforts to complete.
subclass of: Exlcusions and Exceptions

Voluntary & Opt-in
type: Class
comment: Consent must be obtained through the data subject's voluntary action and should be opt-in and not opt-out or by default.
subclass of: Valid Consent
involves: Given Consent

Large scale processing
type: Class
comment: The processing of personal data at a large scale of quantity or significant proportions.
subclass of: Processing
subclass of: Factors for Impact Assessment
involves: Processing
involves: Personal Data

Genetic Data
type: Class
comment: Personal data relating to the inherited or acquired genetic characteristics of a natural person which result from the analysis of a biological sample from the natural person in question, in particular chromosomal, deoxyribonucleic acid (DNA) or ribonucleic acid (RNA) analysis, or from the analysis of another element enabling equivalent information to be obtained.
subclass of: Sensitive Personal Data
involves: Data Subject

Principle of Purpose Limitation
type: Class
comment: The principle of purpose limitation states that personal data must be collected for specified, explicit and legitimate purposes and not further processed in a manner that is incompatible with those purposes; further processing for archiving purposes in the public interest, scientific or historical research purposes or statistical purposes shall, in accordance with Article 89(1) of the GDPR, not be considered to be incompatible with the initial purposes.
subclass of: Principle
involves: Archive Data
involves: Collection of Personal Data
involves: Specified purpose
involves: Not further processed
involves: Historic, Statistical, or Scientific purposes
involves: Explicit Purpose
involves: Legitimate purpose
involves: Personal Data

has Chapter
type: FunctionalProperty
type: ObjectProperty
comment: indicates the legal resource has the Chapter
domain: LegalResource
range: Chapter
sub property of: has part

Information about rights
type: Class
comment: The right to access personal data also includes information about the existence of rights provided by the GDPR to the data subject
subclass of: Right to Access Personal Data
involves: Data Subject's Rights

Certification
type: Class
comment: A certification pertaining to GDPR compliance
subclass of: Seals and Certifications

Follow same terms
type: Class
comment: Sub-processors must follow the same rules and obligations (or terms) as the agreement between processor and controller.
subclass of: Appointing Sub-Processors
involves: Sub-Processor
involves: Agreement between Processor and Controller

DPO Obligation
type: Class
comment: These are the obligations specified for the Data Protection Office (DPO) within the GDPR
subclass of: Obligation
involves: DPO

Made Public
type: Class
comment: Lawful basis is provided through the data being publicly made available by the data subject
subclass of: Lawful Basis
involves: Data Subject

No charges levied
type: Class
comment: The right to access personal data should not incur any undue charge levied on the data subject for exercising their right
subclass of: Right to Access Personal Data
involves: Data Subject's Rights

Notify consequences of breach
type: Class
comment: Affected data subject's must be notified about the consequences of the data breach.
subclass of: Notify Data Subject of Breach
involves: Data Breach

Obligation
type: Class
comment: These are the obligations specified by the GDPR. Following the obligations is necessary for compliance.
subclass of: Concept

Record purpose of processing
type: Class
comment: This obligation requires Controllers to record the purpose of processing associated with personal data and the given consent.
subclass of: Maintain records for processing
involves: Processing

Impose confidentiality obligations on personnel
type: Class
comment: The processor must impose confidentiality agreements on its personnel in relation to handling of personal data
subclass of: Processor Obligations
involves: Processor

Processing
type: Class
comment: Processing here refers to an Activity that acts on the Data Subject's personal information.
subclass of: Activity
equivalent class: Use Data
involves: Personal Data

Consent Activity
type: Class
comment: An activity involving data subject's consent.
subclass of: Activity
involves: Consent

Legal Obligations
type: Class
comment: Lawful basis for processing is covered by legal obligation(s).
subclass of: Lawful Basis

Identification of Data Subject
type: Class
comment: Activity where the data subject is explicitly identified through direct or indirect means.
subclass of: Activity
involves: Data Subject

Processing sensitive data
type: Class
comment: This involves processing involving sensitive personal data.
subclass of: Processing
subclass of: Factors for Impact Assessment
involves: Sensitive Personal Data

Inform Controller of conflict with law
type: Class
comment: In case of conflict with the controller's intructions and the law, the processor must immediately inform the controller of this conflict
subclass of: Processor Obligations
involves: Controller

Freedoms protection
type: Class
comment: The stated obligation could not be completed as it concerns freedoms protection.
subclass of: Exlcusions and Exceptions

Concise
type: Class
comment: The information provided under the right to transparency should be concise
subclass of: Right to Transparency
involves: Right to Transparency

Monitor Compliance
type: Class
comment: The activity or process of overseeing an organisation's compliance.
subclass of: DPO Obligation
subclass of: Compliance
subclass of: Activity
involves: Data Subject's Rights
involves: Principle
involves: Obligation

Propogate rights to Third Parties
type: Class
comment: To propogate a data subject's right once they have been exercised to other third parties that are involved through the data subject's personal data.
subclass of: Processor Obligations
subclass of: Controller Obligation
subclass of: Activity
involves: Data Subject's Rights
involves: Processor
involves: Controller

is part of Chapter
type: FunctionalProperty
type: ObjectProperty
comment: represents a legal resource subdivision to be part of a chapter
domain: LegalResourceSubdivision
range: Chapter
sub property of: is part of

Obtaining Consent from Data Subject
type: Class
comment: The act of getting a data subject's consent.
subclass of: Consent Activity
involves: Given Consent
involves: Data Subject

Principle of Storage Limitation
type: Class
comment: The principle of storage limitation states that personal data must be kept in a form which permits identification of data subjects for no longer than is necessary for the purposes for which the personal data are processed; personal data may be stored for longer periods insofar as the personal data will be processed solely for archiving purposes in the public interest, scientific or historical research purposes or statistical purposes in accordance with Article 89(1) of the GDPR subject to implementation of the appropriate technical and organisational measures required by this Regulation in order to safeguard the rights and freedoms of the data subject.
subclass of: Principle
involves: Identifiable for required processing
involves: Archive Data
involves: Identification of Data Subject
involves: Store Data
involves: Personal Data
involves: Public Interest
involves: Historic, Statistical, or Scientific purposes

Regulation
type: Class
comment: Regulation in GDPR text
subclass of: LegalResourceSubdivision
example: gdpr:recital1 a eli:LegalResourceSubdivision, GDPRtEXT:Recital ; eli:description "The protection of natural persons in relation to the processing of personal data is a fundamental right. Article 8(1) of the Charter of Fundamental Rights of the European Union (the ‘Charter’) and Article 16(1) of the Treaty on the Functioning of the European Union (TFEU) provide that everyone has the right to the protection of personal data concerning him or her."^^xsd:string ; eli:is_part_of gdpr:GDPR ; eli:number "1"^^xsd:string .

Withdrawing Given Consent
type: Class
comment: This activity represents the data subject withdrawing given consent.
subclass of: Consent Activity
involves: Given Consent
involves: Data Subject

Copy should be in a machine readable format
type: Class
comment: The provided copy of personal data should be machine readable
subclass of: Provide copy of Personal Data

Legitimate purpose
type: Class
comment: This specifies that the collection (or collected) personal data should be used/specified to be used for legitimate purposes.
subclass of: Obligation for data collection
involves: Collection of Personal Data

Controller Representative
type: Class
comment: A natural or legal person established in the Union who, designated by the controllerin writing, represents the controller with regard to their respective obligations under the GDPR.
subclass of: Entity
involves: Controller

comment: An ontology for representing provenance traces pertainining to GDPR compliance. It uses concepts from GDPRtEXT along with extending PROV and P-Plan.

Information about automated processing with significant effects
type: Class
comment: The right to access personal data also includes information about automated processing that has significant effects on the data subject.
subclass of: Right to Access Personal Data
involves: Data Subject
involves: Automated Processing

Share Personal Data with Third Party
type: Class
comment: This activity represents the sharing of data subject's personal data with a third party.
subclass of: Data Activity
involves: Processor
involves: Personal Data
involves: Controller

Provide information for compliance
type: Class
comment: The processor must provide the controller with the information necessary to demonstrate compliance
subclass of: Processor Obligations
involves: Controller
involves: Compliance

Exempted by National Law
type: Class
comment: Lawful basis for processing is provided by National Law
subclass of: Lawful Basis

Restrictions on cross-border transfers
type: Class
comment: These provide restrictions on cross-border transfers for Processors
subclass of: Processor Obligations
involves: Processor
involves: Cross-border Transfer

Record cross-border transfers
type: Class
comment: This obligation requires Controllers to record the cross-border data transfers.
subclass of: Maintain records for processing
involves: Cross-border Transfer

SubPoint
type: Class
comment: SubPoint in GDPR text
subclass of: LegalResourceSubdivision
example: gdpr:article12-5-b a eli:LegalResourceSubdivision, GDPRtEXT:SubPoint ; eli:description "refuse to act on the request."^^xsd:string ; eli:is_part_of gdpr:GDPR, gdpr:article12, gdpr:article12-5, gdpr:chapterIII, gdpr:chapterIII-1 ; eli:number "b"^^xsd:string ; eli:title_alternative "Article12(5)(b)"^^xsd:string ; GDPRtEXT:isPartOfArticle gdpr:article12 ; GDPRtEXT:isPartOfChapter gdpr:chapterIII ; GDPRtEXT:isPartOfPoint gdpr:article12-5 ; GDPRtEXT:isPartOfSection gdpr:chapterIII-1 .

Freely given
type: Class
comment: GDPR obligation that specifies consent must be freely given by the data subject for it to be valid.
subclass of: Valid Consent
involves: Obtaining Consent from Data Subject
involves: Given Consent

Protection against destruction
type: Class
comment: Protection of data subject's personal data against destruction of data.
subclass of: Security of Personal Data
involves: Personal Data
involves: Data Security

Right to object direct marketting
type: Class
comment: The data subject has a right to object to direct marketting based on their personal data
subclass of: Data Subject's Rights
involves: Direct Marketing
involves: Data Subject

Assist in complying with rights
type: Class
comment: Processors must assist Controllers in complying with the various rights provided by the GDPR to data subjects which can be exercised at any time.
subclass of: Processor Obligations
involves: Data Subject's Rights
involves: Processor
involves: Controller
involves: Compliance

Consent
type: Class
comment: Consent in the context of the GDPR refers to the assent or agreement by the data subject in relation to their personal data for the proposed processing activities associated with one or more organisations.
subclass of: Concept

Outside Material Scope
type: Class
comment: The activity was deemed to be outside the material scope of the GDPR.
subclass of: Exlcusions and Exceptions

Co-operate with DPA
type: Class
comment: This obligation specifies the Controller/Processor must co-operate with the Data Protection Authority (DPA).
subclass of: Processor Obligations
subclass of: Controller Obligation
involves: DPA

Information about categories of recipients
type: Class
comment: The right to access personal data also includes information about the categories of recipients the data is shared with.
subclass of: Right to Access Personal Data
involves: Share Personal Data with Third Party
involves: Record categories of recipients
involves: Personal Data

Appointing Sub-Processors
type: Class
comment: These are the obligations for Processors over appointing sub-processors
subclass of: Processor Obligations
involves: Sub-Processor
involves: Processor

Compliance with Controller's instructions
type: Class
comment: The processor has an obligation to comply with the controller's instructions
subclass of: Processor Obligations
involves: Processor
involves: Controller

Not further processed
type: Class
comment: This obligation specifies that the collected personal data should not be processed beyond the purpose for which it was originally collected without an updated consent for the proposed purposes.
subclass of: Obligation for data collection
involves: Processing

Processing using untested technologies
type: Class
comment: This type of processing uses technologies that are new or have not yet been deemed to be fit or stable for usage.
subclass of: Processing
subclass of: Factors for Impact Assessment
involves: Personal Data

Specific
type: Class
comment: GDPR obligation that specifies consent must be specific for it to be valid.
subclass of: Valid Consent
involves: Given Consent

Controller
type: Class
comment: The natural or legal person, public authority, agency or other body which, alone or jointly with others, determines the purposes and means of the processing of personal data.
subclass of: Entity

Data Retention
type: Class
comment: These are the obligations specified by the GDPR on the retention of personal data
subclass of: Obligation
involves: Store Data
involves: Personal Data

Controller Accountability
type: Class
comment: These obligations specify the accountability of the Controller.
subclass of: Controller Obligation
involves: Controller

Information about processing
type: Class
comment: The right to access personal data also includes information about the processing of personal data of the data subject
subclass of: Right to Access Personal Data
involves: Processing
involves: Personal Data

Intelligible
type: Class
comment: The information provided under the right to transparency should be intelligible
subclass of: Right to Transparency
involves: Right to Transparency

Adherence
type: Class
comment: The seal or certification does not reduce or impact the responsiblity of the controller or processor for compliance with the GDPR
subclass of: Awarding Seals and Certifications

Adequate for processing
type: Class
comment: Only the personal data adequat for required processing should be maintained
subclass of: Data Retention
involves: Store Data
involves: Processing

Can be withdrawn easily
type: Class
comment: This obligation states that the data subject should be able to withdraw the consent as easily as it was to give it.
subclass of: Obligation for obtaining consent
involves: Withdrawing Given Consent
involves: Given Consent

Categories of data subjects and personal data
type: Class
comment: This obligation requires Controllers to record the categories of data subjects and the personal data involved in processing/activities.
subclass of: Maintain records for processing
involves: Personal Data
involves: Data Subject

Lnk between new and old processing
type: Class
comment: Whether there is a link between the new and old purposes of processing
subclass of: Purpose of new processing
involves: Purpose of new processing
involves: Processing

Data Breach
type: Class
comment: A data breach is the intentional or unintentional release of secure or private/confidential information to an untrusted environment.
subclass of: Concept
involves: Personal Data

comment: TEST2
comment: TEST

Collection Mechanism
type: Class
comment: Specifies collection mechanism used to collect personal data
subclass of: Collection of Personal Data

Agreement between Processor and Controller
type: Class
comment: Signifies the agreement between Controller and Processors for processing of personal data
subclass of: Concept
involves: Processor
involves: Controller
involves: Appointment of Processors

Principle of Accuracy
type: Class
comment: The principle of accuracy states that personal data must be accurate and, where necessary, kept up to date; every reasonable step must be taken to ensure that personal data that are inaccurate, having regard to the purposes for which they are processed, are erased or rectified without delay.
subclass of: Principle
involves: Personal Data
involves: Erase Data
involves: Rectify Inaccuracies
involves: Kept up to date
involves: Rectify Data

Protection against damage
type: Class
comment: Protection of data subject's personal data against damage to the data.
subclass of: Security of Personal Data
involves: Personal Data
involves: Data Security

GDPR text EXTensions
type: Ontology
comment: This is an ontology to represent GDPR text as a set of RDF resources
see also: Bartolini, C., Muthuri, R., & Santos, C. (2015, November). Using ontologies to model data protection requirements in workflows. In JSAI International Symposium on Artificial Intelligence (pp. 233-248). Springer, Cham.
creator: Harshvardhan J. Pandit
description: The General Data Protection Regulation (GDPR) is comprised of several articles, each with points that refer to specific concepts. The general convention of referring to these points and concepts is to quote the specific article or point using a human-readable reference. This ontology provides a way to refer to the points within the GDPR using the EurLex ontology published by the European Publication Office. It also defines the concepts defined, mentioned, and requried by the GDPR using the Simple Knowledge Organization System (SKOS) ontology.
title: GDPRtEXT
abstract: The General Data Protection Regulation (GDPR) defines legal obligations over the use of personal data by organisations. This ontology aims to identify and model such terms and obligations as an OWL vocabulary and to directly link the terms to their occurence, usage, and influence in the GDPR text.
created: 2017-08-15
creator: http://purl.org/adaptcentre/people/HJP
description: This ontology extends the canonical (official) GDPR text with additional annotations
license: http://creativecommons.org/licenses/by/4.0/
modified: 2018-07-31
publisher: ADAPT
source: http://eur_lex.europa.eu/legal_content/EN/ALL/
status: draft
preferred namespace prefix: gdprtext
backward compatible with: gdpr v0.1.owl
prior version: gdpr v0.1.owl
version IRI: gdpr v0.7.owl
version info: 0.6

Processor Obligations
type: Class
comment: These are the obligations specified by the GDPR in the context of Processors
subclass of: Obligation
involves: Processor

Appointment of Processors
type: Class
comment: These are the obligations specified by the GDPR for the appointment of Processors by Controllers.
subclass of: Controller Obligation
subclass of: Activity
involves: Controller
involves: Processor

Not-for-profit organisation
type: Class
comment: Lawful basis is provided by the GDPR for activities of/for not-for-profit organisations
subclass of: Lawful Basis

Medical or Diagnostics
type: Class
comment: Lawful basis for processing is provided by the GDPR for medical or diagnostics purposes pertaining to the data subject
subclass of: Lawful Basis
involves: Data Subject

Existence of safeguards
type: Class
comment: The purpose of new processing should take into context the existence of appropriate safeguards
subclass of: Purpose of new processing
involves: Security of Personal Data
involves: Personal Data

Information about third parties
type: Class
comment: The right to basic information also provides data subject's with information about third parties involved in the processing.
subclass of: Right to basic information about processing of personal data
involves: Share Personal Data with Third Party
involves: Processor
involves: Controller

Principle
type: Class
comment: A Principle is a rule or standard defined by the GDPR which is essential to be followed for compliance
subclass of: Concept

Systematic Monitoring
type: Class
comment: This activity provides a systematic monitoring or overview of processes/activities taking place within the context of the organisation.
subclass of: Factors for Impact Assessment
subclass of: Activity
involves: Processing

Maintain Record of Breach
type: Class
comment: GDPR mandates the recording of data breaches and its effects.
subclass of: Report Data Breach
involves: Data Breach

Right to Access Personal Data
type: Class
comment: The data subject shall have the right to obtain from the controller confirmation as to whether or not personal data concerning him or her are being processed, and, where that is the case, access to the personal data along with additional information about it.
subclass of: Data Subject's Rights
involves: Data Subject
involves: Provide copy of Personal Data
involves: Processing
involves: Personal Data

Compliance
type: Class
comment: Represents the act of complying with the obligations and actions specified by the GDPR.
subclass of: Concept

Processing is unlawful
type: Class
comment: The data subject can exercise the right to restrict processing of their personal data when the processing is unlawful
subclass of: Right to restrict processing
involves: Unlawful Processing
involves: Personal Data

Article
type: Class
comment: Article in GDPR text
subclass of: LegalResourceSubdivision
example: gdpr:article10 a eli:LegalResourceSubdivision, GDPRtEXT:Article ; eli:is_part_of gdpr:GDPR, gdpr:chapterII ; eli:number "10"^^xsd:string ; eli:title_alternative "Article 10"^^xsd:string ; GDPRtEXT:hasPoint gdpr:article10-1 ; GDPRtEXT:isPartOfChapter gdpr:chapterII .

Return or destroy data
type: Class
comment: The processor must return or destroy personal data at the end of term (of its agreement with the controller)
subclass of: Processor Obligations
involves: Agreement between Processor and Controller
involves: Processor
involves: Erase Data

comment: TEST2
comment: TEST

Notify Data Subject of Breach
type: Class
comment: Affected data subjects must be notified of the data breach and its effects.
subclass of: Report Data Breach
involves: Data Subject
involves: Data Breach

Crime data
type: Class
comment: Personal data related to criminal convictions and offences.
subclass of: Sensitive Personal Data
involves: Data Subject

Erase if conesnt was withdrawn
type: Class
comment: The right of erasure applies when the data subject withdraws given consent
subclass of: Right of Erasure
involves: Withdrawing Given Consent
involves: Given Consent
involves: Erase Data

Obligation for data collection
type: Class
comment: Collection of Personal Data is an Activity that deals with acquiring data subject's personal data through some model of interaction.
subclass of: Obligation
involves: Collection of Personal Data

Entity
type: Class
comment: A general term for any institution, company, corporation, partnership, government agency, university, or any other organization including individuals.
subclass of: Concept

Shoud support reuse
type: Class
comment: The provided copy of personal data should support reuse
subclass of: Provide copy of Personal Data

Personal or Household activity
type: Class
comment: Exempted as the GDPR does not apply to personal or household activity that does not have a professional or commercial activity associated with it.
subclass of: Exlcusions and Exceptions

Unlawful Processing
type: Class
comment: Processing of personal data that is termed to be unlawful in the context of the GDPR or other relevant laws and regulations
subclass of: Processing

Chapter
type: Class
comment: Chapter in GDPR text
subclass of: LegalResourceSubdivision
example: gdpr:chapterI a eli:LegalResourceSubdivision, GDPRtEXT:Chapter ; eli:is_part_of gdpr:GDPR ; eli:number "I"^^xsd:string ; eli:title "General provisions"^^xsd:string ; eli:title_alternative "Chapter I"^^xsd:string ; GDPRtEXT:hasArticle gdpr:article1, gdpr:article2, gdpr:article3, gdpr:article4 .

Context of data collection
type: Class
comment: The purpose of new processing should take the context of how the original data was collected into consideration
subclass of: Purpose of new processing
involves: Collection of Personal Data

Notification requires disproportionate efforts
type: Class
comment: The data subjects were not notified about the data breach because it required disproportionate efforts.
subclass of: Requires disproportionate efforts
subclass of: Exceptions on reporting data breach
involves: Report Data Breach

Factors for Impact Assessment
type: Class
comment: These are the factors stated by the GDPR for Impact Assessment.
subclass of: Concept
involves: Impact Assessment

Principle of Lawfulness, Fairness, and Transparency
type: Class
comment: The principle of lawfulness, fairness, and transparency states that personal data must be processed lawfully, fairly and in a transparent manner in relation to the data subject.
subclass of: Principle
involves: Processing
involves: Lawful Basis
involves: Data

Processor
type: Class
comment: A natural or legal person, public authority, agency or other body which processes personal data on behalf of the controller.
subclass of: Entity
involves: Controller

Transparent
type: Class
comment: The information provided under the right to transparency should be transparent and clear (i.e. not umambigious or vague)
subclass of: Right to Transparency
involves: Right to Transparency
involves: Principle of Lawfulness, Fairness, and Transparency

Data Subject's Rights
type: Class
comment: The GDPR provides several rights to the data subjects which may be exercised at any time by the data subject and which are mandatory for the organisation to provide, comply with, and inform the data subject about.
subclass of: Concept

Record security measures
type: Class
comment: This obligation requires Controllers to record the measures taken to ensure adequate safety measures of personal data and the involved activities.
subclass of: Maintain records for processing
involves: Security of Personal Data

Archive Data
type: Class
comment: An activity where personal data is archived
subclass of: Data Activity
involves: Personal Data

Identifiable for required processing
type: Class
comment: Retention of personal data should be identifiable for the requried processing
subclass of: Data Retention
involves: Store Data
involves: Identification of Data Subject

Report Data Breach
type: Class
comment: The act of reporting a data breach to entities mentioned within the GDPR. These are the Data Protection Authority (DPA), and in the case of Processors, the Controller they have an agreement with.
subclass of: Controller Obligation
subclass of: Compliance
subclass of: Activity
involves: Maintain Record of Breach
involves: Report breach to DPA within 72 hours
involves: Notify Data Subject of Breach
involves: Data Breach

Written consent of Controller
type: Class
comment: Appointing a sub-processor requires the written consent of the controller specifying permission or consent
subclass of: Appointing Sub-Processors
involves: Sub-Processor
involves: Controller
involves: Consent

Legal Claims
type: Class
comment: Lawful basis for processing is provided by legal claims.
subclass of: Lawful Basis

Seals and Certifications
type: Class
comment: GDPR provides for the creation and provision of seals and certificates pertaining to compliance or related activities
subclass of: Concept
involves: Awarding Seals and Certifications

Voluntary accredition
type: Class
comment: The seals and certifications should be a voluntary system of accredition
subclass of: Awarding Seals and Certifications

Controller Obligation
type: Class
comment: These are the obligations specified by the GDPR as being specifically the responsbility of the Controller.
subclass of: Obligation
involves: Controller

Racial origin data
type: Class
comment: Personal data revealing racial or ethnic origin.
subclass of: Sensitive Personal Data
involves: Data Subject

has SubPoint
type: FunctionalProperty
type: ObjectProperty
comment: indicates the legal resource has the SubPoint
domain: LegalResourceSubdivision
range: SubPoint
sub property of: has part

Erase Data
type: Class
comment: An activity that erases data
subclass of: Data Activity
involves: Personal Data

Exlcusions and Exceptions
type: Class
comment: Exclusions and Exemptions provided by the GDPR for not complying with the specified obligations.
subclass of: Concept

Use Data
type: Class
comment: An activity that uses personal data
subclass of: Data Activity
involves: Personal Data

Maximum validty 3 years
type: Class
comment: The maximum validity for all seals and certifications should be 3 years from the date of issue.
subclass of: Awarding Seals and Certifications

Liability of Joint-Controllers
type: Class
comment: These specify the liability of Joint Controllers, i.e. cases where more than one Controller share the responsiblity.
subclass of: Controller Obligation
involves: Joint Controller

Exempted without identity
type: Class
comment: The request or activity could not or was not completed because there was no sufficient proof of the data subject's identity.
subclass of: Exlcusions and Exceptions
involves: Identification of Data Subject

Not from silence or inactivity
type: Class
comment: Consent should not be obtained from silence or inactivity of the data subject
subclass of: Obligation for obtaining consent
involves: Given Consent

Sub-Processor
type: Class
comment: A sub-processor is a processor acting under another processor.
subclass of: Processor
involves: Processor
involves: Controller

Evaluation of data subjects
type: Class
comment: Whether the proposed activity involves the evaluation of the data subject.
subclass of: Factors for Impact Assessment
involves: Data Subject

Rights protection
type: Class
comment: The stated obligation could not be completed as it concerns rights protection.
subclass of: Exlcusions and Exceptions

Historic, Statistical, or Scientific purposes
type: Class
comment: Lawful basis if provided by the GDPR for processing related to historic, statistical, or scientific purposes.
subclass of: Lawful Basis

Right of Erasure
type: Class
comment: The data subject has the right to obtain erasure of their personal data
subclass of: Data Subject's Rights
involves: Personal Data
involves: Data Subject
involves: Erase Data

Distinguishable from other matters
type: Class
comment: Obtained consent should be distinguishable from other related matters (in the context of the process)
subclass of: Obligation for obtaining consent
involves: Given Consent

Right to not be evaluated through automated processing
type: Class
comment: The data subject has a right to not be evaluated through automated processing
subclass of: Data Subject's Rights
involves: Data Subject
involves: Automated Processing

Record data retention periods
type: Class
comment: This obligation requires Controllers to record the data retention period of personal data.
subclass of: Maintain records for processing
involves: Store Data

Principle of Integrity and Confidentiality
type: Class
comment: The principle of integrity and confidentiality states that personal data must be processed in a manner that ensures appropriate security of the personal data, including protection against unauthorised or unlawful processing and against accidental loss, destruction or damage, using appropriate technical or organisational measures.
subclass of: Principle
involves: Processing
involves: Protection against destruction
involves: Data Security
involves: Personal Data
involves: Protection against damage
involves: Protection against accidental loss

involves
type: AnnotationProperty
comment: It signifies that two concepts are related within the context of the GDPR.

has Section
type: FunctionalProperty
type: ObjectProperty
comment: indicates the legal resource has the Section
domain: LegalResourceSubdivision
range: Section
sub property of: has part

Provide copy of Personal Data
type: Class
comment: The right of data portability requries providing a copy of the data subject's personal data
subclass of: Right of Data Portability
subclass of: Data Activity
involves: Personal Data

Health data
type: Class
comment: Personal data related to the physical or mental health of a natural person, including the provision of health care services, which reveal information about his or her health status.
subclass of: Sensitive Personal Data
involves: Data Subject

Impact Assessment
type: Class
comment: The activity wherein the controller carries out an assessment of the impact of the envisaged processing operations on the protection of personal data.
subclass of: Activity
involves: Processing
involves: Personal Data
involves: Factors for Impact Assessment

DPA
type: Class
comment: The Data Protection Authority (DPA) is a public institution responsible for monitoring the application of data protection laws.
subclass of: Entity

Security of Personal Data
type: Class
comment: This activity refers to security of data subject's personal data.
subclass of: Obligation
subclass of: Activity
involves: Personal Data
involves: Data Security

Demonstrable
type: Class
comment: Obtained consent should be in a demonstrable form
subclass of: Obligation for obtaining consent
involves: Given Consent
involves: Demonstrating Consent

If and where Controller is processing
type: Class
comment: The right to access personal data also includes information about whether and where the controller is processing the data subject's personal data
subclass of: Right to Access Personal Data
involves: Processing
involves: Personal Data
involves: Controller

Rectify Inaccuracies
type: Class
comment: Any inaccuracies or discrepancies in the retained data must be rectified
subclass of: Data Retention
involves: Personal Data

Protection against unlawful processing
type: Class
comment: Protection of data subject's personal data against unlawful processing of data.
subclass of: Security of Personal Data
involves: Unlawful Processing
involves: Personal Data
involves: Data Security

Legitimate Interests
type: Class
comment: Lawful basis for processing is provided through the legitimate interests pursued by the Controller or by a third party
subclass of: Lawful Basis
involves: Data Subject

Right to basic information about processing of personal data
type: Class
comment: The right to basic information about processing provides data subjects with information about the processing activities involving their personal data
subclass of: Data Subject's Rights
involves: Processing
involves: Data Subject

Report breach to DPA within 72 hours
type: Class
comment: The occurence of a data breach must be reported to the Data Protection Authority (DPA) within 72 hours
subclass of: Report Data Breach
involves: Data Breach
involves: DPA

Obligation for obtaining consent
type: Class
comment: These are the obligations specified by the GDPR for obtaining consent
subclass of: Obligation
involves: Obtaining Consent from Data Subject

Clear explanation
type: Class
comment: Obtaining consent must provide clear explanations of the processing involved over the personal data
subclass of: Obligation for obtaining consent
involves: Processing

Employment Law
type: Class
comment: Lawful basis for processing is provided by Employment Law
subclass of: Lawful Basis

Valid Consent
type: Class
comment: Consent is termed to be valid if it passes all the criteria or obligations laid down by the GDPR.
subclass of: Given Consent
subclass of: Obligation for obtaining consent
involves: Informed
involves: Specific
involves: Given Consent
involves: Freely given

Data protection by design and default
type: Class
comment: This obligation requires Controllers to follow data protection by design and by default.
subclass of: Controller Obligation
involves: Controller

is part of Article
type: FunctionalProperty
type: ObjectProperty
comment: represents a legal resource subdivision to be part of a article
domain: LegalResourceSubdivision
range: Article
sub property of: is part of

Principle of Data Minimisation
type: Class
comment: The principle of data minimisation states that personal data must be adequate, relevant and limited to what is necessary in relation to the purposes for which they are processed.
subclass of: Principle
involves: Specified purpose
involves: Processing
involves: Accurate Collection
involves: Personal Data
involves: Explicit Purpose

Right to object processing
type: Class
comment: The data subject has the right to object to processing of their personal data
subclass of: Data Subject's Rights
involves: Processing
involves: Personal Data
involves: Data Subject

is part of Section
type: FunctionalProperty
type: ObjectProperty
comment: represents a legal resource subdivision to be part of a section
domain: LegalResourceSubdivision
range: Section
sub property of: is part of

National Security
type: Class
comment: The stated obligation could not be completed as it concerns national security.
subclass of: Exlcusions and Exceptions

Citation
type: Class
comment: Citation in GDPR text
subclass of: LegalResourceSubdivision
example: gdpr:citation1 a eli:LegalResourceSubdivision, GDPRtEXT:Citation ; eli:description "OJ C 229, 31.7.2012, p. 90."^^xsd:string ; eli:is_part_of gdpr:GDPR ; eli:number "1"^^xsd:string .

Erase if no longer needed for original purpose
type: Class
comment: The right to erasure applies where data is no longer needed for original purposes for which it was collected
subclass of: Right of Erasure
involves: Explicit Purpose
involves: Erase Data
involves: Collection of Personal Data

Rectify Data
type: Class
comment: An activity that rectifies data
subclass of: Data Activity
involves: Personal Data

Code of Conduct
type: Class
comment: A Code of Conduct for the purpose of specifying the application of GDPR which may be monitored, evaluated, or processed by a third party appointed by the organisation.
subclass of: Concept

Consequences for data subjects
type: Class
comment: The possible consequences of the change in processing for the data subject
subclass of: Purpose of new processing
involves: Data Subject

Data inferred or derived
type: Class
comment: The obligation or activity coult not be completed because the data was inferred or derived, and therefore did not come from the data subject or other sources.
subclass of: Exlcusions and Exceptions
involves: Data

Kept up to date
type: Class
comment: Retained personal data must be kept up-to-date
subclass of: Data Retention
involves: Personal Data

Direct Marketing
type: Class
comment: Type of Marketing that reaches data subjects directly by communications directly addressed to the data subject.
subclass of: Marketing
involves: Data Subject

Confirming or matching datasets
type: Class
comment: This type of processing involves matching data subject's identity or personal data in different datasets.
subclass of: Processing
subclass of: Factors for Impact Assessment
involves: Personal Data

Exercise Rights
type: Class
comment: The activity represents exercising of rights provided by GDPR by the data subject.
subclass of: Activity
involves: Data Subject's Rights
involves: Data Subject

Easily Accessible
type: Class
comment: The information provided under the right to transparency should be easily accessible
subclass of: Right to Transparency
involves: Right to Transparency

Vital Interests
type: Class
comment: These are obligations pertaining to the vital interests of the data subjects
subclass of: Lawful Basis
involves: Data Subject

Data Activity
type: Class
comment: An activity involving personal data of data subject(s).
subclass of: Activity
involves: Personal Data

Certification Body
type: Class
comment: A Certification Body is an entity that can award/issue/renew a certification pertaining to compliance towards the GDPR.
subclass of: Entity
involves: Seal
involves: Certification

Lawful Basis
type: Class
comment: This provides the basis for lawful processing of personal data.
subclass of: Obligation
involves: Processing

Should be structured
type: Class
comment: The provided copy of personal data should be structured
subclass of: Provide copy of Personal Data

Right to rectify
type: Class
comment: The data subject has a right to recitify their personal data
subclass of: Data Subject's Rights
involves: Rectify Data
involves: Data Subject

Exceptions on reporting data breach
type: Class
comment: Exceptions associated with compliance for reporting data breach to the affected data subjects.
subclass of: Exlcusions and Exceptions
involves: Report Data Breach

Limited for processing
type: Class
comment: Personal data retained should be limited in its use only for the requried processing
subclass of: Data Retention
involves: Processing
involves: Personal Data

Report data breach to Controller
type: Class
comment: The occurence of a data breach must be reported to the Controller.
subclass of: Processor Obligations
subclass of: Report Data Breach
involves: Controller
involves: Data Breach
involves: Processor
involves: Report Data Breach

Information about data source
type: Class
comment: The right to access personal data also includes information about the source of the personal data
subclass of: Right to Access Personal Data
involves: Personal Data
involves: Collection of Personal Data

Right of Data Portability
type: Class
comment: The data subject has the right to receive the personal data concerning him or her, which he or she has provided to a controller, in a structured, commonly used and machine-readable format and has the right to transmit those data to another controller without hindrance from the controller to which the personal data have been provided.
subclass of: Data Subject's Rights
involves: Should be structured
involves: Provide copy of Personal Data
involves: Copy should be in a commonly used format
involves: Collection of Personal Data
involves: Shoud support reuse
involves: Copy should be in a machine readable format
involves: Personal Data
involves: Data Subject

Data
type: Class
comment: A generic term to refer to Data.
subclass of: Concept

Controller Responsibility
type: Class
comment: These obligations specify the responsiblity of the Controller
subclass of: Controller Obligation
involves: Controller

Purpose of new processing
type: Class
comment: These are the obligations over determining the new or changed purposes of processing
subclass of: Lawful Basis
involves: Processing

Anonymous Data
type: Class
comment: Data is termed to be anonymous if it cannot be connected or associated with individual person or persons that have provided or are associated with it.
subclass of: Data
involves: Personal Data

Maintain records for processing
type: Class
comment: This obligation requires the Controller/Processor to maintain adequate records about their processing activities.
subclass of: Processor Obligations
subclass of: Controller Obligation
involves: Processing

Is impossible
type: Class
comment: The obligation or activity could not be completed as it was deemed to be impossible.
subclass of: Exlcusions and Exceptions

Only act on Controller instructions
type: Class
comment: The processor must only act on the intructions provided and documented by the controller
subclass of: Processor Obligations
involves: Controller

Covered by Directive (EU) 2016/680
type: Class
comment: Exempted as it involves areas covered by Directive (EU) 2016/680
subclass of: Exlcusions and Exceptions

Implement technical measures
type: Class
comment: This obligation requires Controllers to implement the required technical measures necessary for compliance of the GDPR
subclass of: Controller Responsibility
involves: Controller
involves: Compliance

Regulatory Authority
type: Class
comment: The authority responsible for regulating data protection laws.
subclass of: Entity

Notify measures taken
type: Class
comment: Affect data subjets must be notified of the measures taken against the data breach.
subclass of: Notify Data Subject of Breach
involves: Data Subject
involves: Data Breach

has Recital
type: FunctionalProperty
type: ObjectProperty
comment: indicates the legal resource has the Recital
domain: LegalResourceSubdivision
range: Regulation
sub property of: has part

Marketing
type: Class
comment: The process or technique of promoting, selling, and distributing a product or service.
subclass of: Activity

Notify about DPO
type: Class
comment: Affected data subjects must be notified with the name and contact of the DPO responsible/handling for the data breach.
subclass of: Notify Data Subject of Breach
involves: Data Subject
involves: Data Breach

Nature of data involved
type: Class
comment: The nature of the personal data involved, whether it is sensitive or confidential.
subclass of: Purpose of new processing
involves: Personal Data

Harm was remote
type: Class
comment: The data subjects were not notified about the data breach because the harm was deemed to be remote.
subclass of: Exceptions on reporting data breach
involves: Data Breach

Data Security
type: Class
comment: These are obligations regarding security of data managed by the Controllers.
subclass of: Processor Obligations
subclass of: Controller Obligation
involves: Controller
involves: Personal Data
involves: Security of Personal Data

Record categories of recipients
type: Class
comment: This obligation requires Controllers to record the categories of recipients the personal data was shared with.
subclass of: Maintain records for processing
involves: Share Personal Data with Third Party

Explicit Purpose
type: Class
comment: This obligation specifies that the collected (or collection) of personal data should be for/with explicit purposes.
subclass of: Obligation for data collection
involves: Collection of Personal Data

Protection against accidental loss
type: Class
comment: Protection of data subject's personal data against accidental loss.
subclass of: Security of Personal Data
involves: Personal Data
involves: Data Security

Processing affected or vulnerable individuals
type: Class
comment: This type of processing involves data subjects that are vulnerable, such as children, or people with disabilities.
subclass of: Processing
subclass of: Factors for Impact Assessment
involves: Personal Data
involves: Data Subject

Accurate Collection
type: Class
comment: This obligation specifies that the collection of (or collected) personal data should in an accurate form - i.e. the personal data should be accurate.
subclass of: Obligation for data collection
involves: Personal Data
involves: Collection of Personal Data

Privacy by Design
type: Class
comment: Privacy by Design is the approach of taking privacy into consideration throughout the whole planning and execution processes.
subclass of: Controller Obligation

DPO
type: Class
comment: The Data Protection Officer (DPO) is an individual(s) appointed by the organisation to monitor compliance and assist in complying with the GDPR.
subclass of: Entity
involves: Notify about DPO
involves: Monitor Compliance
involves: Controller
involves: Processor

Copy should be in a commonly used format
type: Class
comment: The provided copy of personal data should be in a commonly used format
subclass of: Provide copy of Personal Data

Public Interest
type: Class
comment: Lawful basis is provided by the GDPR as being in the interest of the public
subclass of: Lawful Basis

Personal Data
type: Class
comment: Personal data means any information relating to an identified or identifiable natural person (‘data subject’); an identifiable natural person is one who can be identified, directly or indirectly, in particular by reference to an identifier such as a name, an identification number, location data, an online identifier or to one or more factors specific to the physical, physiological, genetic, mental, economic, cultural or social identity of that natural person.
subclass of: Data
involves: Data Subject

Data Subject
type: Class
comment: An individual or entity to whom their personal data relates.
subclass of: Entity

Point
type: Class
comment: Point in GDPR text
subclass of: LegalResourceSubdivision
example: gdpr:article27-2 a eli:LegalResourceSubdivision, GDPRtEXT:Point ; eli:description "The obligation laid down in paragraph 1 of this Article shall not apply to:"^^xsd:string ; eli:is_part_of gdpr:GDPR, gdpr:article27, gdpr:chapterIV, gdpr:chapterIV-1 ; eli:number "2"^^xsd:string ; eli:title_alternative "Article27(2)"^^xsd:string ; GDPRtEXT:hasSubPoint gdpr:article27-2-a, gdpr:article27-2-b ; GDPRtEXT:isPartOfArticle gdpr:article27 ; GDPRtEXT:isPartOfChapter gdpr:chapterIV ; GDPRtEXT:isPartOfSection gdpr:chapterIV-1 .

Section
type: Class
comment: Section in GDPR text
subclass of: LegalResourceSubdivision
example: gdpr:chapterIV-5 a eli:LegalResourceSubdivision, GDPRtEXT:Section ; eli:is_part_of gdpr:GDPR, gdpr:chapterIV ; eli:number "5"^^xsd:string ; eli:title "Codes of conduct and certification"^^xsd:string ; eli:title_alternative "Section 5"^^xsd:string ; GDPRtEXT:hasArticle gdpr:article40, gdpr:article41, gdpr:article42, gdpr:article43 ; GDPRtEXT:isPartOfChapter gdpr:chapterIV .

Given Consent
type: Class
comment: Given Consent refers specifically to the form of consent given by the data subject in relation to their personal data and the proposed usage by activities.
subclass of: Lawful Basis
subclass of: Consent
involves: Data Subject
involves: Processing
involves: Personal Data

Principle of Accountability
type: Class
comment: The principle of accountability states that the controller shall be responsible for, and be able to demonstrate compliance with the processing of personal data as defined by the justifications permissible under the GDPR
subclass of: Principle
involves: Compliance
involves: Lawful Basis
involves: Processing
involves: Controller Responsibility

is part of Point
type: FunctionalProperty
type: ObjectProperty
comment: represents a legal resource subdivision to be part of a point
domain: LegalResourceSubdivision
range: Point
sub property of: is part of

Controller has taken action
type: Class
comment: The data subjects were not notified about the data breach because the controller had already taken action regarding the data breach.
subclass of: Exceptions on reporting data breach
involves: Data Breach
involves: Controller

Processor Representative
type: Class
comment: A natural or legal person established in the Union who, designated by the processor in writing, represents the processor with regard to their respective obligations under the GDPR.
subclass of: Entity
involves: Processor

Seal
type: Class
comment: A seal pertaining to GDPR compliance
subclass of: Seals and Certifications

Informed
type: Class
comment: GDPR obligation that specifies consent must be informed for it be valid.
subclass of: Valid Consent
involves: Obtaining Consent from Data Subject
involves: Personal Data
involves: Given Consent
involves: Data Activity

Automatic decision making with significant effect
type: Class
comment: Automated decision making with significant effect
comment: This type of processing involves automated processing that does decision making having significant effects on the data subject.
subclass of: Factors for Impact Assessment
subclass of: Automated Processing
involves: Personal Data
involves: Data Subject

Demonstrating Consent
type: Class
comment: The act of demonstrating consent is an activity whereby previously acquired consent is provided as sufficient justification for processing activities involving data subject's personal information.
subclass of: Compliance
subclass of: Activity
involves: Valid Consent
involves: Given Consent

Right to Transparency
type: Class
comment: The right to transparency requires controllers to provide information about the processing activities as well as personal data and its usage in a transparent manner
subclass of: Data Subject's Rights
involves: Personal Data
involves: Concise
involves: Processing
involves: Intelligible
involves: Data Subject
involves: Transparent
involves: Easily Accessible
involves: Principle of Lawfulness, Fairness, and Transparency
involves: Controller

Right to restrict processing
type: Class
comment: The data subject has the rights to restrict the processing of their personal data
subclass of: Data Subject's Rights
involves: Processing is unlawful
involves: Data no longer needed for original purpose
involves: Data Subject
involves: Accuracy is contested
involves: Processing

Specified purpose
type: Class
comment: This obligation states that the collection of personal data should happen only for the specified purposes (for which the data subject has consented).
subclass of: Obligation for data collection
involves: Processing
involves: Collection of Personal Data

Store Data
type: Class
comment: An activity where personal data is being stored
subclass of: Data Activity
involves: Personal Data