FRBRer model
note: This is the element set of native RDF classes and properties described in the current text (Feb 2009) of the Functional Requirements for Bibliographic Records (FRBR) entity-relationship model.

Concept
status: Published
name: Concept
label: Concepto @es
definition: An abstract notion or idea.
type: Class
scope note: The entity defined as concept encompasses a comprehensive range of abstractions that may be the subject of a work: fields of knowledge, disciplines, schools of thought (philosophies, religions, political ideologies, etc.), theories, processes, techniques, practices, etc. A concept may be broad in nature or narrowly defined and precise. For the purposes of this model concepts are treated as entities only to the extent that they are the subject of a work (e.g., as the subject of a philosophical treatise, of a critique of a school of thought, etc.).

Corporate Body
status: Published
name: CorporateBody
label: Entidad corporativa @es
definition: An organization or group of individuals and/or organizations acting as a unit.
type: Class
scope note: The entity defined as corporate body encompasses organizations and groups of individuals and-or organizations that are identified by a particular name, including occasional groups and groups that are constituted as meetings, conferences, congresses, expeditions, exhibitions, festivals, fairs, etc. The entity also encompasses organizations that act as territorial authorities, exercising or claiming to exercise government functions over a certain territory, such as a federation, a state, a region, a local municipality, etc. The entity encompasses organizations and groups that are defunct as well as those that continue to operate. For the purposes of this model corporate bodies are treated as entities only to the extent that they are involved in the creation or realization of a work (e.g., as the sponsors or endorsers of a work, etc.), or are the subject of a work (e.g., as the subject of a history, etc.).
disjoint with: Person

Event
status: Published
name: Event
label: Acontecimiento @es
type: Class
definition: An action or occurrence.
scope note: The entity defined as event encompasses a comprehensive range of actions and occurrences that may be the subject of a work: historical events, epochs, periods of time, etc. For the purposes of this model events are treated as entities only to the extent that they are the subject of a work (e.g., the subject of an historical treatise, of a painting, etc.).

Expression
status: Published
name: Expression
label: Expresión @es
definition: The intellectual or artistic realization of a work in the form of alpha-numeric, musical, or choreographic notation, sound, image, object, movement, etc., or any combination of such forms.
type: Class
scope note: An expression is the specific intellectual or artistic form that a work takes each time it is "realized". Expression encompasses, for example, the specific words, sentences, paragraphs, etc. that result from the realization of a work in the form of a text, or the particular sounds, phrasing, etc. resulting from the realization of a musical work. The boundaries of the entity expression are defined, however, so as to exclude aspects of physical form, such as typeface and page layout, that are not integral to the intellectual or artistic realization of the work as such. Inasmuch as the form of expression is an inherent characteristic of the expression, any change in form (e.g., from alpha-numeric notation to spoken word) results in a new expression. Similarly, changes in the intellectual conventions or instruments that are employed to express a work (e.g., translation from one language to another) result in the production of a new expression. If a text is revised or modified, the resulting expression is considered to be a new expression. The degree to which bibliographic distinctions are made between variant expressions of a work will depend to some extent on the nature of the work itself, on the anticipated needs of users and on what the cataloguer can reasonably be expected to recognize from the manifestation being described. Differences in form of expression (e.g., the differences between the expression of a work in the form of musical notation and the expression of the same work in the form of recorded sound) will normally be reflected in the bibliographic record, no matter what the nature of the work itself may be. Variant expressions in the same form (e.g., revised versions of a text) will often be indirectly identified as different expressions because the variation is apparent from the data associated with an attribute used to identify the manifestation in which the expression is embodied (e.g., an edition statement). Variations that would be evident only from a…

Item
status: Published
name: Item
label: Ejemplar @es
definition: A single exemplar of a manifestation.
type: Class
scope note: The entity defined as item is a concrete entity. It is in many instances a single physical object (e.g., a copy of a one-volume monograph, a single audio cassette, etc.). There are instances, however, where the entity defined as item comprises more than one physical object (e.g., a monograph issued as two separately bound volumes, a recording issued on three separate compact discs, etc.). In terms of intellectual content and physical form, an item exemplifying a manifestation is normally the same as the manifestation itself. However, variations may occur from one item to another, even when the items exemplify the same manifestation, where those variations are the result of actions external to the intent of the producer of the manifestation (e.g., damage occurring after the item was produced, binding performed by a library, etc.).

Manifestation
status: Published
name: Manifestation
label: Manifestación @es
definition: The physical embodiment of an expression of a work.
type: Class
scope note: The entity defined as manifestation encompasses a wide range of materials, including manuscripts, books, periodicals, maps, posters, sound recordings, films, video recordings, CD-ROMs, multimedia kits, etc. As an entity, manifestation represents all the physical objects that bear the same characteristics, in respect to both intellectual content and physical form. When a work is realized, the resulting expression of the work may be physically embodied on or in a medium such as paper, audio tape, video tape, canvas, plaster, etc. That physical embodiment constitutes a manifestation of the work. In some cases there may be only a single physical exemplar produced of that manifestation of the work (e.g., an author's manuscript, a tape recorded for an oral history archive, an original oil painting, etc.). In other cases there are multiple copies produced in order to facilitate public dissemination or distribution. In those cases there is normally a more formal production process involved, and a publisher, producer, or distributor takes responsibility for the process. In other cases there may be only a limited number of copies made of an original exemplar for purposes such as private study (e.g., a dubbing of an original recording of a piece of music), or preservation (e.g., a photocopy produced on permanent paper of an author's original typescript). Whether the scope of production is broad (e.g., in the case of publication, etc.) or limited (e.g., in the case of copies made for private study, etc.), the set of copies produced in each case constitutes a manifestation. All copies produced that form part of the same set are considered to be copies of the same manifestation. The boundaries between one manifestation and another are drawn on the basis of both intellectual content and physical form. When the production process involves changes in physical form the resulting product is considered a new manifestation. Changes in physical form include changes affecting display char…

Object
status: Published
name: Object
label: Objeto @es
definition: A material thing.
type: Class
scope note: The entity defined as object encompasses a comprehensive range of material things that may be the subject of a work: animate and inanimate objects occurring in nature; fixed, movable, and moving objects that are the product of human creation; objects that no longer exist. For the purposes of this model objects are treated as entities only to the extent that they are the subject of a work (e.g., as the subject of a scientific study, etc.).

Person
status: Published
name: Person
label: Persona @es
definition: An individual.
type: Class
scope note: The entity defined as person encompasses individuals that are deceased as well as those that are living. For the purposes of this model persons are treated as entities only to the extent that they are involved in the creation or realization of a work (e.g., as authors, composers, artists, editors, translators, directors, performers, etc.), or are the subject of a work (e.g., as the subject of a biographical or autobiographical work, of a history, etc.).
disjoint with: Corporate Body

Place
status: Published
name: Place
label: Lugar @es
definition: A location.
type: Class
scope note: The entity defined as place encompasses a comprehensive range of locations: terrestrial and extra-terrestrial; historical and contemporary; geographic features and geo-political jurisdictions. For the purposes of this model places are treated as entities only to the extent that they are the subject of a work (e.g., the subject of a map or atlas, or of a travel guide, etc.).

Work
status: Published
name: Work
label: Obra @es
definition: A distinct intellectual or artistic creation.
type: Class
scope note: A work is an abstract entity; there is no single material object one can point to as the work. We recognize the work through individual realizations or expressions of the work, but the work itself exists only in the commonality of content between and among the various expressions of the work. Because the notion of a work is abstract, it is difficult to define precise boundaries for the entity. The concept of what constitutes a work and where the line of demarcation lies between one work and another may in fact be viewed differently from one culture to another. Consequently the bibliographic conventions established by various cultures or national groups may differ in terms of the criteria they use for determining the boundaries between one work and another. For the purposes of this model variant texts incorporating revisions or updates to an earlier text are viewed simply as expressions of the same work (i.e., the variant texts are not viewed as separate works). Similarly, abridgements or enlargements of an existing text, or the addition of parts or an accompaniment to a musical composition are considered to be different expressions of the same work. Translations from one language to another, musical transcriptions and arrangements, and dubbed or subtitled versions of a film are also considered simply as different expressions of the same original work. By contrast, when the modification of a work involves a significant degree of independent intellectual or artistic effort, the result is viewed, for the purpose of this model, as a new work. Thus paraphrases, rewritings, adaptations for children, parodies, musical variations on a theme and free transcriptions of a musical composition are considered to represent new works. Similarly, adaptations of a work from one literary or art form to another (e.g., dramatizations, adaptations from one medium of the graphic arts to another, etc.) are considered to represent new works. Abstracts, digests and summaries are also conside…

complements (expression) (from expression)
status: Published
name: complementsExpressionFromExpression
label: es complemento (expresión) de (expresión) @es
type: Property
domain: Expression
definition: Relates an expression of a work to an expression of a prior work that it is intended to be combined with or inserted into, but was not part of the original conception of the prior work. The content may be closely or loosely connected, so the complementary work may be referential or autonomous with respect to the prior work.
range: Expression
inverse of: has a complement (expression) (from expression)

complements (work) (from expression)
status: Published
name: complementsWorkFromExpression
label: es complemento (obra) de (expresión) @es
type: Property
domain: Work
definition: Relates a work to an expression of a prior work that it is intended to be combined with or inserted into, but was not part of the original conception of the prior work. The content may be closely or loosely connected, so the complementary work may be referential or autonomous with respect to the prior work.
range: Expression
inverse of: has a complement (work) (from expression)
property disjoint with: has title of the work
property disjoint with: has form of work
property disjoint with: has date of the work
property disjoint with: has other distinguishing characteristic of work
property disjoint with: has intended termination
property disjoint with: has intended audience
property disjoint with: has context for the work

complements (work) (from work)
status: Published
name: complementsWorkFromWork
label: es complemento (obra) (de obra) @es
definition: Relates a work to a prior work that it is intended to be combined with or inserted into, but was not part of the original conception of the prior work. The content may be closely or loosely connected, so the complementary work may be referential or autonomous with respect to the prior work.
type: Property
domain: Work
range: Work
inverse of: has a complement (work) (from work)
property disjoint with: has title of the work
property disjoint with: has form of work
property disjoint with: has date of the work
property disjoint with: has other distinguishing characteristic of work
property disjoint with: has intended termination
property disjoint with: has intended audience
property disjoint with: has context for the work

has access address (remote electronic resource)
status: Published
name: hasAccessAddressRemoteElectronicResource
label: tiene dirección de acceso (recurso electrónico de acceso remoto) @es
definition: Relates a manifestation that is a remote electronic resource to an alpha-numeric code used to facilitate remote access to it.
type: Property
domain: Manifestation
scope note: E.g., universal resource locator – URL.

has access restrictions on the item
status: Published
name: hasAccessRestrictionsOnTheItem
label: tiene restricciones de acceso al ejemplar @es
definition: Relates an item to any limitations placed on physical access to the item.
type: Property
domain: Item
scope note: E.g., restricted to supervised on-site use, etc.

has access restrictions on the manifestation
status: Published
name: hasAccessRestrictionsOnTheManifestation
label: tiene restricciones de acceso a la manifestación @es
definition: Relates a manifestation to restrictions on access to and use of a manifestation.
type: Property
domain: Manifestation
scope note: Access restrictions may be based in copyright, or they may extend beyond the protections guaranteed in law to the owner of the copyright.

has a complement (expression) (from expression)
status: Published
name: hasAComplementExpressionFromExpression
label: tiene complemento (expresión) (de expresión) @es
type: Property
domain: Expression
definition: Relates an expression of a prior work to an expression of another work that is intended to be combined with or inserted into the prior work, but was not part of the original conception of the prior work. The content may be closely or loosely connected, so the complementary work may be referential or autonomous with respect to the prior work.
range: Expression
inverse of: complements (expression) (from expression)

has a complement (work) (from expression)
status: Published
name: hasAComplementWorkFromExpression
label: tiene complemento (obra) (de expresión) @es
type: Property
domain: Expression
definition: Relates an expression of a prior work to another work that is intended to be combined with or inserted into the prior work, but was not part of the original conception of the prior work. The content may be closely or loosely connected, so the complementary work may be referential or autonomous with respect to the prior work.
range: Work
inverse of: complements (work) (from expression)

has a complement (work) (from work)
status: Published
name: hasAComplementWorkFromWork
label: tiene complemento (obra) (de obra) @es
definition: Relates a prior work to another work that is intended to be combined with or inserted into the prior work, but was not part of the original conception of the prior work. The content may be closely or loosely connected, so the complementary work may be referential or autonomous with respect to the prior work.
type: Property
domain: Work
range: Work
inverse of: complements (work) (from work)
property disjoint with: has title of the work
property disjoint with: has form of work
property disjoint with: has date of the work
property disjoint with: has other distinguishing characteristic of work
property disjoint with: has intended termination
property disjoint with: has intended audience
property disjoint with: has context for the work
property disjoint with: has as subject (work)
property disjoint with: is subject (work) of
property disjoint with: has a successor (work) (from work)
property disjoint with: is a successor (work) to (work)
property disjoint with: has a supplement (work) (from work)
property disjoint with: supplements (work) (from work)
property disjoint with: has a summary (work) (from work)
property disjoint with: is a summary (work) of (work)
property disjoint with: is an adaptation (work) of (work)
property disjoint with: has a transformation (work) (from work)
property disjoint with: is a transformation (work) of (work)
property disjoint with: has part (work)
property disjoint with: is part (work) of
property disjoint with: supplements (expression) (from work)

has an abridgement (expression)
status: Published
name: hasAnAbridgementExpression
label: tiene compendio (expresión) @es
type: Property
domain: Expression
definition: Relates an expression to another expression of the same work that represents an abridgement, in which some content of the prior expression is removed, but the result does not alter the content to the extent that it becomes a new work.
range: Expression
inverse of: is an abridgement (expression) of

has an adaptation (expression) (from expression)
status: Published
name: hasAnAdaptationExpressionFromExpression
label: tiene adaptación (expresión) (de expresión) @es
type: Property
domain: Expression
definition: Relates an expression of a prior work to an expression of another work that represents a modification of the content of the prior work for a purpose, use, or medium other than that for which it was originally intended. The modification of the content of the prior work must be sufficient in degree to warrant the adaptation work being considered as a new work autonomous with respect to the prior work.
range: Expression
inverse of: is an adaptation (expression) of (expression)

has an adaptation (work) (from expression)
status: Published
name: hasAnAdaptationWorkFromExpression
label: tiene adaptación (obra) (de expresión) @es
type: Property
domain: Expression
definition: Relates an expression of a prior work to another work that represents a modification of the content of the prior work for a purpose, use, or medium other than that for which it was originally intended. The modification of the content of the prior work must be sufficient in degree to warrant the adaption work being considered as a new work autonomous with respect to the prior work.
range: Work
inverse of: is an adaptation (work) of (expression)

has an adaptation (work) (from work)
status: Published
name: hasAnAdaptationWorkFromWork
label: tiene adaptación (obra) (de obra) @es
type: Property
domain: Work
comment: Source documentation has label "has adaptation"; amended to improve consistency.
definition: Relates a prior work to another work that represents a modification of the content of the prior work for a purpose, use, or medium other than that for which it was originally intended. The modification of the content of the prior work must be sufficient in degree to warrant the adaptation work being considered as a new work autonomous with respect to the prior work.
range: Work
inverse of: is an adaptation (work) of (work)
property disjoint with: has title of the work
property disjoint with: has form of work
property disjoint with: has date of the work
property disjoint with: has other distinguishing characteristic of work
property disjoint with: has intended termination
property disjoint with: has intended audience
property disjoint with: has context for the work

has an alternate
status: Published
name: hasAnAlternate
label: tiene (manifestación) alterna @es
definition: Relates a manifestation to another manifestation, usually of the same expression, that effectively serves as an alternate manifestation.
type: Property
domain: Manifestation
scope note: The alternate relationship obtains, for example, when a publication, sound recording, video, etc. is issued in more than one format or when it is released simultaneously by different publishers in different countries.
range: Manifestation

has an arrangement (expression)
status: Published
name: hasAnArrangementExpression
label: tiene arreglo (expresión) @es
definition: Relates an expression to another expression that represents an arrangement of the same musical composition work.
type: Property
domain: Expression
range: Expression
inverse of: is an arrangement (expression) of

has an imitation (expression) (from expression)
status: Published
name: hasAnImitationExpressionFromExpression
label: tiene imitación (expresión) (de expresión) @es
type: Property
domain: Expression
definition: Relates an expression of a prior work to an expression of another work that copies the style of the content of the prior work. The modification of the content of the prior work must be sufficient in degree to warrant the imitation work being considered as a new work autonomous with respect to the prior work.
range: Expression
inverse of: is an imitation (expression) of (expression)

has an imitation (work) (from expression)
status: Published
name: hasAnImitationWorkFromExpression
label: tiene imitación (obra) (de expresión) @es
type: Property
domain: Expression
definition: Relates an expression of a prior work to another work that copies the style of the content of the prior work. The modification of the content of the prior work must be sufficient in degree to warrant the imitation work being considered as a new work autonomous with respect to the prior work.
range: Work
inverse of: is an imitation (work) of (expression)

has an imitation (work) (from work)
status: Published
name: hasAnImitationWorkFromWork
label: tiene imitación (obra) (de obra) @es
type: Property
domain: Work
definition: Relates a prior work to another work that that copies the style of the content of the prior work. The modification of the content of the prior work must be sufficient in degree to warrant the imitation work being considered as a new work autonomous with respect to the prior work.
range: Work
inverse of: is an imitation (work) of (work)
property disjoint with: has title of the work
property disjoint with: has form of work
property disjoint with: has date of the work
property disjoint with: has other distinguishing characteristic of work
property disjoint with: has intended termination
property disjoint with: has intended audience
property disjoint with: has context for the work

has a reconfiguration
status: Published
name: hasAReconfiguration
label: tiene reconfiguración @es
definition: Relates an item to another item that is the result of a change to the prior item. The reconfiguration item may be the result of changes to more than one prior item.
type: Property
domain: Item
scope note: Most commonly, an item of one manifestation is bound with an item of a different manifestation to make a new item.
comment: Source documentation has label "has reconfiguration", amended to improve consistency.
range: Item
inverse of: is a reconfiguration of

has a reproduction (item) (from item)
status: Published
name: hasAReproductionItemFromItem
label: tiene reproducción (ejemplar) (de ejemplar) @es
definition: Relates an item to another item that has been derived in some way from the prior item. There can be varying levels of fidelity of the reproduction item to the prior item. The reproduction item must replicate the type of carrier and other physical characteristics of the prior item.
type: Property
domain: Item
comment: Source documentation has label "has reproduction"; amended to improve consistency.
range: Item
inverse of: is a reproduction (item) of (item)

has a reproduction (manifestation) (from item)
status: Published
name: hasAReproductionManifestationFromItem
label: tiene reproducción (manifestación) (de ejemplar) @es
definition: Relates an item to a manifestation that has been derived in some way from the prior item. There can be varying levels of fidelity of the reproduction manifestation to the prior item.
type: Property
domain: Item
scope note: The reproduction relationship will be stated at this level when it is useful to indicate the specific item used, as opposed to stating the relationship at the more general level of manifestation-to-manifestation.
range: Manifestation
inverse of: is a reproduction (manifestation) of (item)

has a reproduction (manifestation) (from manifestation)
status: Published
name: hasAReproductionManifestationFromManifestation
label: tiene reproducción (manifestación) (de manifestación) @es
definition: Relates a manifestation to another manifestation, usually of the same expression, that represents the same intellectual or artistic content as the prior manifestation. The reproduction manifestation may or may not replicate the look and feel or other physical characteristics of the prior manifestation.
type: Property
domain: Manifestation
range: Manifestation
inverse of: is a reproduction (manifestation) of (manifestation)

has a revision (expression)
status: Published
name: hasARevisionExpression
label: tiene revisión (expresión) @es
definition: Relates an expression to another expression of the same work that represents a revision, in which the intent is to alter or update the content of the prior expression, but without changing the content so much that it becomes a new work.
type: Property
domain: Expression
range: Expression
inverse of: is a revision (expression) of

has as subject (concept)
status: Published
name: hasAsSubjectConcept
label: tiene como materia (concepto) @es
definition: Relates a work to a concept that is the subject of the work.
type: Property
domain: Work
range: Concept
inverse of: is subject (concept) of
property disjoint with: has title of the work
property disjoint with: has form of work
property disjoint with: has date of the work
property disjoint with: has other distinguishing characteristic of work
property disjoint with: has intended termination
property disjoint with: has intended audience
property disjoint with: has context for the work

has as subject (corporate body)
status: Published
name: hasAsSubjectCorporateBody
label: tiene como materia (entidad corporativa) @es
definition: Relates a work to a corporate body that is the subject of the work.
type: Property
domain: Work
range: Corporate Body
inverse of: is subject (corporate body) of
property disjoint with: has title of the work
property disjoint with: has form of work
property disjoint with: has date of the work
property disjoint with: has other distinguishing characteristic of work
property disjoint with: has intended termination
property disjoint with: has intended audience
property disjoint with: has context for the work

has as subject (event)
status: Published
name: hasAsSubjectEvent
label: tiene como materia (acontecimiento) @es
definition: Relates a work to an event that is the subject of the work.
type: Property
domain: Work
range: Event
inverse of: is subject (event) of
property disjoint with: has title of the work
property disjoint with: has form of work
property disjoint with: has date of the work
property disjoint with: has other distinguishing characteristic of work
property disjoint with: has intended termination
property disjoint with: has intended audience
property disjoint with: has context for the work

has as subject (expression)
status: Published
name: hasAsSubjectExpression
label: tiene como materia (expresión) @es
definition: Relates a work to an expression that is the subject of the work.
type: Property
domain: Work
range: Expression
inverse of: is subject (expression) of
property disjoint with: has title of the work
property disjoint with: has form of work
property disjoint with: has date of the work
property disjoint with: has other distinguishing characteristic of work
property disjoint with: has intended termination
property disjoint with: has intended audience
property disjoint with: has context for the work

has as subject (item)
status: Published
name: hasAsSubjectItem
label: tiene como materia (ejemplar) @es
definition: Relates a work to an item that is the subject of the work.
type: Property
domain: Work
range: Item
inverse of: is subject (item) of
property disjoint with: has title of the work
property disjoint with: has form of work
property disjoint with: has date of the work
property disjoint with: has other distinguishing characteristic of work
property disjoint with: has intended termination
property disjoint with: has intended audience
property disjoint with: has context for the work

has as subject (manifestation)
status: Published
name: hasAsSubjectManifestation
label: tiene como materia (manifestación) @es
definition: Relates a work to a manifestation that is the subject of the work.
type: Property
domain: Work
range: Manifestation
inverse of: is subject (manifestation) of
property disjoint with: has title of the work
property disjoint with: has form of work
property disjoint with: has date of the work
property disjoint with: has other distinguishing characteristic of work
property disjoint with: has intended termination
property disjoint with: has intended audience
property disjoint with: has context for the work

has as subject (object)
status: Published
name: hasAsSubjectObject
label: tiene como materia (objeto) @es
definition: Relates a work to an object that is the subject of the work.
type: Property
domain: Work
range: Object
inverse of: is subject (object) of
property disjoint with: has title of the work
property disjoint with: has form of work
property disjoint with: has date of the work
property disjoint with: has other distinguishing characteristic of work
property disjoint with: has intended termination
property disjoint with: has intended audience
property disjoint with: has context for the work

has as subject (person)
status: Published
name: hasAsSubjectPerson
label: tiene como materia (persona) @es
definition: Relates a work to a person that is the subject of the work.
type: Property
domain: Work
range: Person
inverse of: is subject (person) of
property disjoint with: has title of the work
property disjoint with: has form of work
property disjoint with: has date of the work
property disjoint with: has other distinguishing characteristic of work
property disjoint with: has intended termination
property disjoint with: has intended audience
property disjoint with: has context for the work

has as subject (place)
status: Published
name: hasAsSubjectPlace
label: tiene como materia (lugar) @es
definition: Relates a work to a place that is the subject of the work.
type: Property
domain: Work
range: Place
inverse of: is subject (place) of
property disjoint with: has title of the work
property disjoint with: has form of work
property disjoint with: has date of the work
property disjoint with: has other distinguishing characteristic of work
property disjoint with: has intended termination
property disjoint with: has intended audience
property disjoint with: has context for the work

has as subject (work)
status: Published
name: hasAsSubjectWork
label: tiene como materia (obra) @es
definition: Relates a work to a prior work that is the subject of the work.
type: Property
domain: Work
range: Work
inverse of: is subject (work) of
property disjoint with: has title of the work
property disjoint with: has form of work
property disjoint with: has date of the work
property disjoint with: has intended termination
property disjoint with: has other distinguishing characteristic of work
property disjoint with: has intended audience
property disjoint with: has context for the work
property disjoint with: is subject (work) of
property disjoint with: has a successor (work) (from work)
property disjoint with: is a successor (work) to (work)
property disjoint with: supplements (work) (from work)
property disjoint with: has a supplement (work) (from work)
property disjoint with: has a complement (work) (from work)
property disjoint with: has a summary (work) (from work)
property disjoint with: is a summary (work) of (work)
property disjoint with: is an adaptation (work) of (work)
property disjoint with: has a transformation (work) (from work)
property disjoint with: is a transformation (work) of (work)
property disjoint with: has part (work)
property disjoint with: is part (work) of
property disjoint with: supplements (expression) (from work)

has a successor (expression) (from expression)
status: Published
name: hasASuccessorExpressionFromExpression
label: continuado por (expresión) (de expresión) @es
type: Property
domain: Expression
definition: Relates an expression of a prior work to an expression of another work, the content of which represents a linear progression from that of the prior work. The content may be closely or loosely connected, so the successor work may be referential or autonomous with respect to the prior work.
range: Expression
inverse of: is a successor (expression) to (expression)

has a successor (work) (from expression)
status: Published
name: hasASuccessorWorkFromExpression
label: continuado por (obra) (de expresión) @es
type: Property
domain: Expression
definition: Relates an expression of a prior work to another work, the content of which represents a linear progression from that of the prior work. The content may be closely or loosely connected, so the successor work may be referential or autonomous with respect to the prior work.
range: Work
inverse of: is a successor (work) to (expression)

has a successor (work) (from work)
status: Published
name: hasASuccessorWorkFromWork
label: continuado por (obra) (de obra) @es
definition: Relates a prior work to another work, the content of which represents a linear progression from that of the prior work. The content may be closely or loosely connected, so the successor work may be referential or autonomous with respect to the prior work.
type: Property
domain: Work
range: Work
inverse of: is a successor (work) to (work)
property disjoint with: has title of the work
property disjoint with: has form of work
property disjoint with: has date of the work
property disjoint with: has other distinguishing characteristic of work
property disjoint with: has intended termination
property disjoint with: has intended audience
property disjoint with: has context for the work
property disjoint with: has as subject (work)
property disjoint with: is subject (work) of
property disjoint with: is a successor (work) to (work)
property disjoint with: has a supplement (work) (from work)
property disjoint with: supplements (work) (from work)
property disjoint with: has a complement (work) (from work)
property disjoint with: has a summary (work) (from work)
property disjoint with: is a summary (work) of (work)
property disjoint with: is an adaptation (work) of (work)
property disjoint with: has a transformation (work) (from work)
property disjoint with: is a transformation (work) of (work)
property disjoint with: has part (work)
property disjoint with: is part (work) of
property disjoint with: supplements (expression) (from work)

has a summary (expression) (from expression)
status: Published
name: hasASummaryExpressionFromExpression
label: tiene resumen (expresión) (de expresión) @es
type: Property
domain: Expression
definition: Relates an expression of a prior work to an expression of another work that represents a brief recapitulation of the content of the prior work. The modification of the content of the prior work must be sufficient in degree to warrant the summary work being considered as a new work autonomous with respect to the prior work.
range: Expression
inverse of: is a summary (expression) of (expression)

has a summary (work) (from expression)
status: Published
name: hasASummaryWorkFromExpression
label: tiene resumen (obra) (de expresión) @es
type: Property
domain: Expression
definition: Relates an expression of a prior work to another work that represents a brief recapitulation of the content of the prior work. The modification of the content of the prior work must be sufficient in degree to warrant the summary work being considered as a new work autonomous with respect to the prior work.
range: Work
inverse of: is a summary (work) of (expression)

has a summary (work) (from work)
status: Published
name: hasASummaryWorkFromWork
label: tiene resumen (obra) (de obra) @es
type: Property
domain: Work
definition: Relates a prior work to another work that represents a brief recapitulation of the content of the prior work. The modification of the content of the prior work must be sufficient in degree to warrant the summary work being considered as a new work autonomous with respect to the prior work.
range: Work
inverse of: is a summary (work) of (work)
property disjoint with: has title of the work
property disjoint with: has form of work
property disjoint with: has date of the work
property disjoint with: has other distinguishing characteristic of work
property disjoint with: has intended termination
property disjoint with: has intended audience
property disjoint with: has context for the work
property disjoint with: has as subject (work)
property disjoint with: is subject (work) of
property disjoint with: has a successor (work) (from work)
property disjoint with: is a successor (work) to (work)
property disjoint with: has a supplement (work) (from work)
property disjoint with: supplements (work) (from work)
property disjoint with: has a complement (work) (from work)
property disjoint with: is a summary (work) of (work)
property disjoint with: is an adaptation (work) of (work)
property disjoint with: has a transformation (work) (from work)
property disjoint with: is a transformation (work) of (work)
property disjoint with: has part (work)
property disjoint with: is part (work) of
property disjoint with: supplements (expression) (from work)

has a supplement (expression) (from expression)
status: Published
name: hasASupplementExpressionFromExpression
label: tiene suplemento (expresión) (de expresión) @es
definition: Relates an expression of a prior work to an expression of another work that is intended to be used in conjunction with the prior work. The content may be closely or loosely associated, so the supplementary work may be referential or autonomous with respect to the prior work.
type: Property
domain: Expression
range: Expression
inverse of: supplements (expression) (from expression)

has a supplement (work) (from expression)
status: Published
name: hasASupplementWorkFromExpression
label: tiene suplemento (obra) (de expresión) @es
type: Property
domain: Expression
definition: Relates an expression of a prior work to another work that is intended to be used in conjunction with the prior work. The content may be closely or loosely associated, so the supplementary work may be referential or autonomous with respect to the prior work.
range: Work
inverse of: supplements (expression) (from work)

has a supplement (work) (from work)
status: Published
name: hasASupplementWorkFromWork
label: tiene suplemento (obra) (de obra) @es
definition: Relates a prior work to another work that is intended to be used in conjunction with the prior work. The content may be closely or loosely associatedd, so the supplementary work may be referential or autonomous with respect to the prior work.
type: Property
domain: Work
range: Work
inverse of: supplements (work) (from work)
property disjoint with: has title of the work
property disjoint with: has form of work
property disjoint with: has date of the work
property disjoint with: has other distinguishing characteristic of work
property disjoint with: has intended termination
property disjoint with: has intended audience
property disjoint with: has context for the work
property disjoint with: has as subject (work)
property disjoint with: is subject (work) of
property disjoint with: has a successor (work) (from work)
property disjoint with: is a successor (work) to (work)
property disjoint with: supplements (work) (from work)
property disjoint with: has a complement (work) (from work)
property disjoint with: has a summary (work) (from work)
property disjoint with: is a summary (work) of (work)
property disjoint with: is an adaptation (work) of (work)
property disjoint with: has a transformation (work) (from work)
property disjoint with: is a transformation (work) of (work)
property disjoint with: has part (work)
property disjoint with: is part (work) of
property disjoint with: supplements (expression) (from work)

has a transformation (expression) (from expression)
status: Published
name: hasATransformationExpressionFromExpression
label: tiene transformación (expresión) (de expresión) @es
type: Property
domain: Expression
definition: Relates an expression of a prior work to an expression of another work that represents a transformation of the content of the prior work in a different genre. The modification of the content of the prior work must be sufficient in degree to warrant the transformation work being considered as a new work autonomous with respect to the prior work.
comment: Source documentation has "literary genre", but other genres allowed.
range: Expression
inverse of: is a transformation (expression) of (expression)

has a transformation (work) (from expression)
status: Published
name: hasATransformationWorkFromExpression
label: tiene transformación (obra) (de expresión) @es
type: Property
domain: Expression
definition: Relates an expression of a prior work to another work that represents a transformation of the content of the prior work in a different genre. The modification of the content of the prior work must be sufficient in degree to warrant the transformation work being considered as a new work autonomous with respect to the prior work.
comment: Source documentation has "literary genre", but other genres allowed.
range: Work
inverse of: is a transformation (work) of (expression)

has a transformation (work) (from work)
status: Published
name: hasATransformationWorkFromWork
label: tiene transformación (obra) (de obra) @es
type: Property
domain: Work
definition: Relates a prior work to another work that represents a transformation of the content of the prior work in a different genre. The modification of the content of the prior work must be sufficient in degree to warrant the transformation work being considered as a new work autonomous with respect to the prior work.
comment: Source documentation has "literary genre", but other genres allowed.
range: Work
inverse of: is a transformation (work) of (work)
property disjoint with: has title of the work
property disjoint with: has form of work
property disjoint with: has date of the work
property disjoint with: has other distinguishing characteristic of work
property disjoint with: has intended termination
property disjoint with: has intended audience
property disjoint with: has context for the work
property disjoint with: has as subject (work)
property disjoint with: is subject (work) of
property disjoint with: has a successor (work) (from work)
property disjoint with: is a successor (work) to (work)
property disjoint with: has a supplement (work) (from work)
property disjoint with: supplements (work) (from work)
property disjoint with: has a complement (work) (from work)
property disjoint with: has a summary (work) (from work)
property disjoint with: is a summary (work) of (work)
property disjoint with: is an adaptation (work) of (work)
property disjoint with: is a transformation (work) of (work)
property disjoint with: has part (work)
property disjoint with: is part (work) of
property disjoint with: supplements (expression) (from work)

has a translation (expression)
status: Published
name: hasATranslationExpression
label: tiene traducción (expresión) @es
definition: Relates an expression to another expression of the same work that represents a literal translation, in which the intent is to render the intellectual content of the previous expression as accurately as possible.
type: Property
domain: Expression
scope note: Free translations are treated in the model as new works.
range: Expression
inverse of: is a translation (expression) of

has capture mode
status: Published
name: hasCaptureMode
label: tiene modo de captura @es
definition: Relates a manifestation to the means used to record notation, sound, or images in the production of a manifestation.
type: Property
domain: Manifestation
scope note: E.g., analogue, acoustic, electric, digital, optical etc.

has collation (hand-printed book)
status: Published
name: hasCollationHandPrintedBook
label: tiene colación (imprenta manual) @es
definition: Relates a manifestation that is a hand-printed book to a reflection of the sequence of gatherings in the book as indicated by signatures on each gathering.
type: Property
domain: Manifestation
scope note: E.g., four gatherings bearing signatures A through D.

has colour (image)
status: Published
name: hasColourImage
label: tiene color (imagen) @es
definition: Relates a manifestation that is an image to the colour(s), tone(s), etc. (including black and white) used in the production of the image.
type: Property
domain: Manifestation

has condition of the item
status: Published
name: hasConditionOfTheItem
label: tiene estado del ejemplar @es
definition: Relates an item to the physical condition of the item, particularly any variances between the physical makeup of the item and that of the manifestation it exemplifies.
type: Property
domain: Item
scope note: E.g., missing pages, plates, etc. Condition may reflect other aspects of the physical condition of the item as well (e.g., brittleness, faded images, etc.).

has context for the expression
status: Published
name: hasContextForTheExpression
label: tiene contexto de la expresión @es
definition: Relates an expression to the historical, social, intellectual, artistic, or other context within which the expression was realized.
type: Property
domain: Expression

has context for the work
status: Published
name: hasContextForTheWork
label: tiene contexto de la obra @es
definition: Relates a work to the historical, social, intellectual, artistic, or other context within which the work was originally conceived.
type: Property
domain: Work
property disjoint with: has title of the work
property disjoint with: has form of work
property disjoint with: has date of the work
property disjoint with: has other distinguishing characteristic of work
property disjoint with: has intended termination
property disjoint with: has intended audience
property disjoint with: is realized through
property disjoint with: is created by (corporate body)
property disjoint with: is created by (person)
property disjoint with: has as subject (concept)
property disjoint with: has as subject (object)
property disjoint with: has as subject (event)
property disjoint with: has as subject (place)
property disjoint with: has as subject (corporate body)
property disjoint with: has as subject (person)
property disjoint with: has as subject (work)
property disjoint with: is subject (work) of
property disjoint with: has as subject (expression)
property disjoint with: has as subject (manifestation)
property disjoint with: has as subject (item)
property disjoint with: has a successor (work) (from work)
property disjoint with: is a successor (work) to (work)
property disjoint with: has a supplement (work) (from work)
property disjoint with: supplements (work) (from work)
property disjoint with: has a complement (work) (from work)
property disjoint with: complements (work) (from work)
property disjoint with: has a summary (work) (from work)
property disjoint with: is a summary (work) of (work)
property disjoint with: has an adaptation (work) (from work)
property disjoint with: is an adaptation (work) of (work)
property disjoint with: has a transformation (work) (from work)
property disjoint with: is a transformation (work) of (work)
property disjoint with: has an imitation (work) (from work)
property disjoint with: is an imitation (work) of (work)
property disjoint with: has part (work)
property disjoint with: is part (work) of
property disjoint with: is a successor (work) to (expression)
property disjoint with: supplements (expression) (from work)
property disjoint with: complements (work) (from expression)
property disjoint with: is a summary (work) of (expression)
property disjoint with: is an adaptation (work) of (expression)
property disjoint with: is a transformation (work) of (expression)
property disjoint with: is an imitation (work) of (expression)

has coordinates (cartographic work)
status: Published
name: hasCoordinatesCartographicWork
label: tiene coordenadas (obra cartográfica) @es
definition: Relates a work that is cartographic to the degrees, minutes, and seconds of longitude and latitude, or the angles of declination and ascension that form the outer boundaries for the area represented in the cartographic image or object.
type: Property
domain: Work

has critical response to the expression
status: Published
name: hasCriticalResponseToTheExpression
label: tiene respuesta crítica a la expresión @es
definition: Relates an expression to the reception given to the expression by reviewers, critics, etc., as encapsulated in an annotation.
type: Property
domain: Expression

has date associated with the corporate body
status: Published
name: hasDateAssociatedWithTheCorporateBody
label: tiene fecha asociada a la entidad corporativa @es
definition: Relates a corporate body to the date or range of dates on which a meeting, conference, exhibition, fair, etc. was held, or a date with which the corporate body is otherwise associated.
type: Property
domain: Corporate Body
scope note: E.g., the date of incorporation.

has date of expression
status: Published
name: hasDateOfExpression
label: tiene fecha de la expresión @es
definition: Relates an expression to the date the expression was created.
type: Property
domain: Expression
scope note: E.g., the date the particular text of a work was written or revised, the date a song was performed, etc. The date may be a single date or a range of dates. In the absence of an ascertainable date of expression, the date of the expression may be associated with the date of its publication or release.

has date of publication or distribution
status: Published
name: hasDateOfPublicationOrDistribution
label: tiene fecha de publicación o distribución @es
definition: Relates a manifestation to the date of public release of the manifestation.
type: Property
comment: Source documentation has "publication/distribution"; slash character replaced with "or" to improve clarity.
domain: Manifestation
scope note: The date (normally a year) may be a single date of publication or release, or a range of dates (e.g., in the case of a serial publication). In the absence of a date designated as the date of publication or release, a copyright date or a date of printing or manufacture may serve as a substitute.

has date of the work
status: Published
name: hasDateOfTheWork
label: tiene fecha de la obra @es
definition: Relates a work to the date the work was originally created.
type: Property
scope note: The date (normally the year) may be a single date or a range of dates. In the absence of an ascertainable date of creation, the date of the work may be associated with the date of its first publication or release.
domain: Work
property disjoint with: has title of the work
property disjoint with: has form of work
property disjoint with: has other distinguishing characteristic of work
property disjoint with: has intended termination
property disjoint with: has intended audience
property disjoint with: has context for the work
property disjoint with: is realized through
property disjoint with: is created by (corporate body)
property disjoint with: is created by (person)
property disjoint with: has as subject (concept)
property disjoint with: has as subject (object)
property disjoint with: has as subject (event)
property disjoint with: has as subject (place)
property disjoint with: has as subject (corporate body)
property disjoint with: has as subject (person)
property disjoint with: has as subject (work)
property disjoint with: is subject (work) of
property disjoint with: has as subject (expression)
property disjoint with: has as subject (manifestation)
property disjoint with: has as subject (item)
property disjoint with: has a successor (work) (from work)
property disjoint with: is a successor (work) to (work)
property disjoint with: has a supplement (work) (from work)
property disjoint with: supplements (work) (from work)
property disjoint with: has a complement (work) (from work)
property disjoint with: complements (work) (from work)
property disjoint with: has a summary (work) (from work)
property disjoint with: is a summary (work) of (work)
property disjoint with: has an adaptation (work) (from work)
property disjoint with: is an adaptation (work) of (work)
property disjoint with: has a transformation (work) (from work)
property disjoint with: is a transformation (work) of (work)
property disjoint with: has an imitation (work) (from work)
property disjoint with: is an imitation (work) of (work)
property disjoint with: has part (work)
property disjoint with: is part (work) of
property disjoint with: is a successor (work) to (expression)
property disjoint with: supplements (expression) (from work)
property disjoint with: complements (work) (from expression)
property disjoint with: is a summary (work) of (expression)
property disjoint with: is an adaptation (work) of (expression)
property disjoint with: is a transformation (work) of (expression)
property disjoint with: is an imitation (work) of (expression)

has dates of person
status: Published
name: hasDatesOfPerson
label: tiene fechas de persona @es
definition: Relates a person to the precise or approximate date of the person's birth and, or, death, or dates indicating the period in which the person was known to be active in a given field of endeavour, and other dates.
type: Property
comment: Source documentation has "includes" prefixing the definition, interpreted as "and other dates" in the property description.
domain: Person

has dimensions of the carrier
status: Published
name: hasDimensionsOfTheCarrier
label: tiene dimensiones del soporte @es
definition: Relates a manifestation to the measurements of the physical components and, or, the container of the manifestation.
type: Property
domain: Manifestation
scope note: The dimensions may comprise measurements of height (e.g., 18 cm bound volume), width (e.g., 8mm film), height x width (e.g., 5 x 5 cm slide), height x width x depth (e.g., 9 x 30 x 20 cm model), or diameter (e.g., 30 cm disc).

has edition or issue designation
status: Published
name: hasEditionOrIssueDesignation
label: tiene designación de edición o emisión @es
definition: Relates a manifestation to a word or phrase appearing in the manifestation that normally indicates a difference in either content or form between the manifestation and a related manifestation previously issued by the same publisher/distributor, or simultaneously issued by either the same publisher/distributor or another publisher/distributor.
type: Property
comment: Source documentation has "edition/issue"; slash character replaced with "or" to improve clarity.
domain: Manifestation
scope note: The edition/issue designation pertains to all copies of a manifestation produced from substantially the same master and issued by the same publisher/distributor or group of publishers/distributors.

has equinox (cartographic work)
status: Published
name: hasEquinoxCartographicWork
label: tiene equinoccio (obra cartográfica) @es
definition: Relates a work that is cartographic to the year that serves as the point of reference for a celestial chart or model.
type: Property
domain: Work

has exhibition history
status: Published
name: hasExhibitionHistory
label: tiene historial de exposiciones @es
definition: Relates an item to a record of public exhibitions of an item, including dates, venues, etc.
type: Property
domain: Item

has expected frequency of issue (serial)
status: Published
name: hasExpectedFrequencyOfIssueSerial
label: tiene frecuencia de publicación prevista (publicación seriada) @es
definition: Relates an expression issued as a serial to the interval at which individual issues of the serial are anticipated to be released.
type: Property
domain: Expression
scope note: E.g., weekly, monthly, quarterly, annually, etc.

has expected regularity of issue (serial)
status: Published
name: hasExpectedRegularityOfIssueSerial
label: tiene regularidad prevista de la publicación (publicación seriada) @es
definition: Relates an expression issued as a serial to the anticipated regularity of release of individual issues (i.e., whether the release is expected to be regular or irregular).
type: Property
domain: Expression

has extensibility of expression
status: Published
name: hasExtensibilityOfExpression
label: tiene extensibilidad de la expresión @es
definition: Relates an expression to a reflection of the expectation that the expression will have additional intellectual or artistic content added to it.
type: Property
domain: Expression
scope note: E.g., an expression that is completed one part at a time, segment by segment, issue by issue, etc.

has extent of the carrier
status: Published
name: hasExtentOfTheCarrier
label: tiene extensión del soporte @es
definition: Relates a manifestation to a quantification of the number of physical units making up the carrier.
type: Property
domain: Manifestation
scope note: E.g., number of sheets, discs, reels, etc.

has extent of the expression
status: Published
name: hasExtentOfTheExpression
label: tiene extensión de la expresión @es
definition: Relates an expression to a quantification of the intellectual content of the expression.
type: Property
domain: Expression
scope note: E.g., number of words in a text, statements in a computer program, images in a comic strip, etc. For works expressed as sound and, or, motion the extent may be a measure of duration; e.g., playing time.

has fabricator or manufacturer
status: Published
name: hasFabricatorOrManufacturer
label: tiene fabricante o productor @es
definition: Relates a manifestation to the individual, group, or organization named in the manifestation as being responsible for the fabrication or manufacture of the manifestation.
type: Property
comment: Source documentation has "fabricator/manufacturer"; slash character replaced with "or" to improve clarity.
domain: Manifestation
scope note: A manifestation may be associated with one or more fabricators or manufacturers.

has file characteristics (electronic resource)
status: Published
name: hasFileCharacteristicsElectronicResource
label: tiene características del archivo (recurso electrónico) @es
definition: Relates a manifestation that is an electronic resource to standards or schemes used to encode the file, physical characteristics of the file, and other characteristics that have a bearing on how the file can be processed.
type: Property
comment: Source documentation has "include" prefixing the definition, removed for being redundant with respect to "and other characteristics" in the property description.
domain: Manifestation
scope note: E.g., ASCII, SGML, etc. E.g., recording density, parity, blocking, etc.

has fingerprint
status: Published
name: hasFingerprint
label: tiene huella tipográfica @es
definition: Relates an item to an identifier constructed by combining groups of characters transcribed from specified pages of a printed item.
type: Property
domain: Item
scope note: The technique is used primarily to signal differences between individual copies of early printed books. There are various formulae for constructing the fingerprint (e.g., the one specified in Fingerprints = Empreintes = Impronte, published by the Institut de Recherche et d’Histoire des Textes in Paris).

has foliation (hand-printed book)
status: Published
name: hasFoliationHandPrintedBook
label: tiene foliación (imprenta manual) @es
definition: Relates a manifestation that is a hand-printed book to a reflection of the number of folds made in a printed sheet to form a gathering of leaves.
type: Property
domain: Manifestation
scope note: E.g., a sheet folded twice to form a quarto, three times to form an octavo, etc.

has form of carrier
status: Published
name: hasFormOfCarrier
label: tiene forma del soporte @es
definition: Relates a manifestation to the specific class of material to which the physical carrier of the manifestation belongs.
type: Property
domain: Manifestation
scope note: E.g., sound cassette, videodisc, microfilm cartridge, transparency, etc. The carrier for a manifestation comprising multiple physical components may include more than one form (e.g., a filmstrip with an accompanying booklet, a separate sound disc carrying the sound track for a film, etc.).

has form of expression
status: Published
name: hasFormOfExpression
label: tiene forma de la expresión @es
type: Property
definition: Relates an expression to the means by which the work is realized.
domain: Expression
scope note: E.g., through alpha-numeric notation, musical notation, spoken word, musical sound, cartographic image, photographic image, sculpture, dance, mime, etc.

has form of work
status: Published
name: hasFormOfWork
label: tiene forma de la obra @es
definition: Relates a work to the class to which the work belongs.
type: Property
domain: Work
scope note: E.g., novel, play, poem, essay, biography, symphony, concerto, sonata, map, drawing, painting, photograph, etc.
property disjoint with: has title of the work
property disjoint with: has date of the work
property disjoint with: has other distinguishing characteristic of work
property disjoint with: has intended termination
property disjoint with: has intended audience
property disjoint with: has context for the work
property disjoint with: is realized through
property disjoint with: is created by (corporate body)
property disjoint with: is created by (person)
property disjoint with: has as subject (concept)
property disjoint with: has as subject (object)
property disjoint with: has as subject (event)
property disjoint with: has as subject (place)
property disjoint with: has as subject (corporate body)
property disjoint with: has as subject (person)
property disjoint with: has as subject (work)
property disjoint with: is subject (work) of
property disjoint with: has as subject (expression)
property disjoint with: has as subject (manifestation)
property disjoint with: has as subject (item)
property disjoint with: has a successor (work) (from work)
property disjoint with: is a successor (work) to (work)
property disjoint with: has a supplement (work) (from work)
property disjoint with: supplements (work) (from work)
property disjoint with: has a complement (work) (from work)
property disjoint with: complements (work) (from work)
property disjoint with: has a summary (work) (from work)
property disjoint with: is a summary (work) of (work)
property disjoint with: has an adaptation (work) (from work)
property disjoint with: is an adaptation (work) of (work)
property disjoint with: has a transformation (work) (from work)
property disjoint with: is a transformation (work) of (work)
property disjoint with: has an imitation (work) (from work)
property disjoint with: is an imitation (work) of (work)
property disjoint with: has part (work)
property disjoint with: is part (work) of
property disjoint with: is a successor (work) to (expression)
property disjoint with: supplements (expression) (from work)
property disjoint with: complements (work) (from expression)
property disjoint with: is a summary (work) of (expression)
property disjoint with: is an adaptation (work) of (expression)
property disjoint with: is a transformation (work) of (expression)
property disjoint with: is an imitation (work) of (expression)

has generation (microform or visual projection)
status: Published
name: hasGenerationMicroformOrVisualProjection
label: tiene generación (microforma o proyección visual) @es
definition: Relates a manifestation that is a microform or visual projection to a reflection of the number of times the image on film has been transferred from one carrier to another.
type: Property
domain: Manifestation
scope note: E.g., a first generation camera master, a second generation printing master, a third generation service copy, etc.

has geodetic, grid and vertical measurement (cartographic image or object)
status: Published
name: hasGeodeticGridAndVerticalMeasurementCartographicImageOrObject
label: tiene geodésic, cuadrícula y medida vertical (imagen cartográfica u objeto) @es
definition: Relates an expression that is cartographic to information on the spheroid used to construct the cartographic image, the grid or referencing systems used in the image, horizontal datum, vertical datum, mathematical data on contour intervals, bathymetric intervals, etc., and other geodetic, grid and vertical measurements.
type: Property
domain: Expression
comment: Source documentation has "includes" prefixing the definition, interpreted as "and other geodetic, grid and vertical measurements" in the property description.

has groove width
status: Published
name: hasGrooveWidth
label: tiene anchura del surco @es
definition: Relates a manifestation that is a sound recording to an indication of the number of grooves per inch cut on a disc or cylinder.
type: Property
domain: Manifestation
scope note: E.g., microgroove--i.e., 200 grooves per inch.

has intended audience
status: Published
name: hasIntendedAudience
label: tiene tipo de audencia @es
definition: Relates a work to the class of user for which the work is intended, as defined by age group, educational level, or other categorization.
type: Property
domain: Work
property disjoint with: has title of the work
property disjoint with: has form of work
property disjoint with: has date of the work
property disjoint with: has other distinguishing characteristic of work
property disjoint with: has intended termination
property disjoint with: has context for the work
property disjoint with: is realized through
property disjoint with: is created by (corporate body)
property disjoint with: is created by (person)
property disjoint with: has as subject (concept)
property disjoint with: has as subject (object)
property disjoint with: has as subject (event)
property disjoint with: has as subject (place)
property disjoint with: has as subject (corporate body)
property disjoint with: has as subject (person)
property disjoint with: has as subject (work)
property disjoint with: is subject (work) of
property disjoint with: has as subject (expression)
property disjoint with: has as subject (manifestation)
property disjoint with: has as subject (item)
property disjoint with: has a successor (work) (from work)
property disjoint with: is a successor (work) to (work)
property disjoint with: has a supplement (work) (from work)
property disjoint with: supplements (work) (from work)
property disjoint with: has a complement (work) (from work)
property disjoint with: complements (work) (from work)
property disjoint with: has a summary (work) (from work)
property disjoint with: is a summary (work) of (work)
property disjoint with: has an adaptation (work) (from work)
property disjoint with: is an adaptation (work) of (work)
property disjoint with: has a transformation (work) (from work)
property disjoint with: is a transformation (work) of (work)
property disjoint with: has an imitation (work) (from work)
property disjoint with: is an imitation (work) of (work)
property disjoint with: has part (work)
property disjoint with: is a successor (work) to (expression)
property disjoint with: is part (work) of
property disjoint with: supplements (expression) (from work)
property disjoint with: complements (work) (from expression)
property disjoint with: is a summary (work) of (expression)
property disjoint with: is an adaptation (work) of (expression)
property disjoint with: is a transformation (work) of (expression)
property disjoint with: is an imitation (work) of (expression)

has intended termination
status: Published
name: hasIntendedTermination
label: tiene finalización prevista @es
definition: Relates a work to a reflection of whether the work has been conceived as having a finite end or whether it is intended to continue indefinitely.
type: Property
domain: Work
property disjoint with: has title of the work
property disjoint with: has form of work
property disjoint with: has date of the work
property disjoint with: has other distinguishing characteristic of work
property disjoint with: has intended audience
property disjoint with: has context for the work
property disjoint with: is realized through
property disjoint with: is created by (corporate body)
property disjoint with: is created by (person)
property disjoint with: has as subject (concept)
property disjoint with: has as subject (object)
property disjoint with: has as subject (event)
property disjoint with: has as subject (place)
property disjoint with: has as subject (corporate body)
property disjoint with: has as subject (person)
property disjoint with: has as subject (work)
property disjoint with: is subject (work) of
property disjoint with: has as subject (expression)
property disjoint with: has as subject (manifestation)
property disjoint with: has as subject (item)
property disjoint with: has a successor (work) (from work)
property disjoint with: is a successor (work) to (work)
property disjoint with: has a supplement (work) (from work)
property disjoint with: supplements (work) (from work)
property disjoint with: has a complement (work) (from work)
property disjoint with: complements (work) (from work)
property disjoint with: has a summary (work) (from work)
property disjoint with: is a summary (work) of (work)
property disjoint with: has an adaptation (work) (from work)
property disjoint with: is an adaptation (work) of (work)
property disjoint with: has a transformation (work) (from work)
property disjoint with: is a transformation (work) of (work)
property disjoint with: has an imitation (work) (from work)
property disjoint with: is an imitation (work) of (work)
property disjoint with: has part (work)
property disjoint with: is part (work) of
property disjoint with: is a successor (work) to (expression)
property disjoint with: supplements (expression) (from work)
property disjoint with: complements (work) (from expression)
property disjoint with: is a summary (work) of (expression)
property disjoint with: is an adaptation (work) of (expression)
property disjoint with: is a transformation (work) of (expression)
property disjoint with: is an imitation (work) of (expression)

has item identifier
status: Published
name: hasItemIdentifier
label: tiene identificador del ejemplar @es
definition: Relates an item to a number or code that is uniquely associated with the item, and serves to differentiate that item from any other item in the same collection and, or, institution.
type: Property
domain: Item
scope note: E.g., call number, accession number, bar code, etc. The number is normally assigned by the institution that holds the item. The item identifier may also include a name or code identifying the institution or repository in which the item is housed, and a name or code identifying a particular collection or sub-unit within the institution (e.g., a rare book collection, a branch library, etc.).

has key (musical work)
status: Published
name: hasKeyMusicalWork
label: tiene clave (obra musical) @es
definition: Relates a work that is musical to the set of pitch relationships that establishes a single pitch class as a tonal centre.
type: Property
domain: Work
scope note: The key for a musical work is the key in which the work is originally composed.

has kind of cutting (sound recording)
status: Published
name: hasKindOfCuttingSoundRecording
definition: Relates a manifestation that is a sound recording to the direction in which the grooves are cut on a disc or cylinder.
type: Property
domain: Manifestation
scope note: E.g., lateral, vertical, etc.

has kind of sound (sound recording)
status: Published
name: hasKindOfSoundSoundRecording
label: tiene tipo de sonido (grabación sonora) @es
definition: Relates a manifestation that is a sound recording to a reflection of the number of sound channels used to make the recording.
type: Property
domain: Manifestation
scope note: E.g., Monaural, stereophonic, quadraphonic, etc.

has language of expression
status: Published
name: hasLanguageOfExpression
label: tiene lengua de la expresión @es
definition: Relates an expression to the language in which the work is expressed.
type: Property
domain: Expression
scope note: The language of the expression may comprise a number of languages, each pertaining to an individual component of the expression.

has manifestation identifier
status: Published
name: hasManifestationIdentifier
label: tiene identificador del manifestación @es
definition: Relates a manifestation to a number or code uniquely associated with the manifestation that serves to differentiate that manifestation from any other manifestation.
type: Property
domain: Manifestation
scope note: A manifestation may have one or more identifiers associated with it. The identifier may be assigned as part of an international numbering or coding system (e.g., ISBN, etc.), as part of a national system (e.g., legal deposit number), or it may be assigned independently by the publisher or distributor of the manifestation (e.g., government publication number, music publisher's number, clearinghouse inventory number, etc.). A manifestation identifier may also be assigned by a bibliographer, musicologist, etc. The manifestation identifier may comprise both a numeric component and a textual or coded component identifying the system under which it was assigned and, or, the agency or individual that assigned the number, so as to render the identifier unique to the manifestation.

has marks or inscriptions
status: Published
name: hasMarksOrInscriptions
label: tiene marcas o inscripciones @es
definition: Relates an item to any signatures, numbering, annotations, etc. that have been applied uniquely to the item by the artist, fabricator, owner, etc., and other marks and inscriptions.
type: Property
comment: Source documentation has "marks/inscriptions"; slash character replaced with "or" to improve clarity.
domain: Item

has medium of performance (musical notation or recorded sound)
status: Published
name: hasMediumOfPerformanceMusicalNotationExpressionOrRecordedSound
label: tiene medio de interpretación (notación musical o registro sonoro) @es
definition: Relates an expression that is a musical notation or recorded sound to the instrumental and, or, vocal medium of performance of a musical work represented in the expression. The instruments and, or, voices represented in a particular expression of a work may differ from the medium of performance for which the work was originally intended.
type: Property
domain: Expression
scope note: E.g., two pianos, soprano and alto, etc.

has medium of performance (musical work)
status: Published
name: hasMediumOfPerformanceMusicalWork
label: tiene medio de interpretación (obra musical) @es
definition: Relates a work that is musical to the instrumental, vocal, and, or, other medium of performance for which the work was originally intended.
type: Property
domain: Work
scope note: E.g., piano, violin, orchestra, men's voices, etc.

has mode of access (remote electronic resource)
status: Published
name: hasModeOfAccessRemoteElectronicResource
label: tiene modo de acceso (recurso electrónico de acceso remoto) @es
definition: Relates a manifestation that is a remote electronic resource to the means of accessing it.
type: Property
domain: Manifestation
scope note: E.g., Internet, World Wide Web, etc.

has name of person
status: Published
name: hasNameOfPerson
label: tiene nombre de persona @es
definition: Relates a person to the word, character, or group of words and, or, characters by which the person is known.
type: Property
domain: Person
scope note: E.g., Donald Horne, A. A. Milne, Ellery Queen, etc. A name may include one or more forenames (or given names), matronymics, patronymics, family names (or surnames), sobriquets, dynastic names, etc. A person may be known by more than one name, or by more than one form of the same name. A bibliographic agency normally selects one of those names as the uniform heading for purposes of consistency in naming and referencing the person. The other names or forms of name may be treated as variant names for the person. In some cases (e.g., in the case of a person who writes under more than one pseudonym, or a person who writes both in an official capacity and as an individual) the bibliographic agency may establish more than one uniform heading for the person.

has name of the corporate body
status: Published
name: hasNameOfTheCorporateBody
label: tiene nombre de entidad corporativa @es
definition: Relates a corporate body to the word, phrase, character, or group of words and, or, characters by which the body is known.
type: Property
domain: Corporate Body
scope note: E.g., Royal Aeronautical Society, IBM, Séminaire européen sur la recherche en éducation, Friedrich Witte, etc. A corporate body may be known by more than one name, or more than one form of the same name. A bibliographic agency normally selects one of those names as the uniform heading for purposes of consistency in naming and referencing the corporate body. The other names or forms of name may be treated as variant names for the corporate body. In some cases (e.g., in the case where a corporate body is known by different names at different periods in its history) the bibliographic agency may establish more than one uniform heading for the corporate body.

has number associated with the corporate body
status: Published
name: hasNumberAssociatedWithTheCorporateBody
label: tiene número asociado a la entidad corporativa @es
definition: Relates a corporate body to the numerical designation sequencing a meeting, conference, exhibition, fair, etc. that constitutes one of a series of related meetings, conferences, exhibitions, fairs, etc., or any other numerical designation associated with a corporate body.
type: Property
domain: Corporate Body

has numbering (serial)
status: Published
name: hasNumberingSerial
label: tiene numeración (publicación seriada) @es
definition: Relates a manifestation that is a serial to the designation of volume, issue, etc. and, or, date appearing in it.
type: Property
domain: Manifestation
scope note: The numbering may comprise a numeric, alphabetic and, or, a date component (e.g., Volume 1, number 1 (January 1971)).

has numeric designation (musical work)
status: Published
name: hasNumericDesignationMusicalWork
label: tiene designación numérica (obra musical) @es
definition: Relates a work that is musical to a serial number, opus number, or thematic index number assigned to thel work by the composer, publisher, or a musicologist.
type: Property
domain: Work

has other designation associated with the corporate body
status: Published
name: hasOtherDesignationAssociatedWithTheCorporateBody
label: tiene otra designación asociada a la entidad corporativa @es
definition: Relates a corporate body to a word, phrase, or abbreviation indicating incorporation or legal status of the body, or any term serving to differentiate the body from other corporate bodies, persons, etc.
type: Property
domain: Corporate Body
scope note: E.g., Inc., Ltd., etc.; firm, musical group, etc.

has other designation associated with the person
status: Published
name: hasOtherDesignationAssociatedWithThePerson
label: tiene otras designaciones asociadas con la persona @es
definition: Relates a person to a numeral, word, or abbreviation indicating succession within a family or dynasty, or an epithet or other word or phrase associated with the person.
type: Property
domain: Person
scope note: E.g., III, Jr., etc.; the Brave, Professional Engineer, etc.

has other distinguishing characteristic of expression
status: Published
name: hasOtherDistinguishingCharacteristicOfExpression
label: tiene otras características distintivas de expresión @es
definition: Relates an expression to any characteristic of the expression that serves to differentiate the expression from another expression of the same work.
type: Property
comment: Source document has label "Other Distinguishing Characteristic" used also for a Work attribute.
domain: Expression
scope note: E.g., the names used to differentiate the various versions of the English text of the Bible, or an "edition" or version designation relating to the intellectual content of the expression such as "2nd revision".

has other distinguishing characteristic of work
status: Published
name: hasOtherDistinguishingCharacteristicOfWork
label: tiene otras caracterísiticas distintivas de obra @es
definition: Relates a work to any characteristic that serves to differentiate the work from another work with the same title.
type: Property
domain: Work
comment: Source documentation has label "Other Distinguishing Characteristic", used also for an Expression attribute.
property disjoint with: has title of the work
property disjoint with: has form of work
property disjoint with: has date of the work
property disjoint with: has intended termination
property disjoint with: has intended audience
property disjoint with: has context for the work
property disjoint with: is realized through
property disjoint with: is created by (corporate body)
property disjoint with: is created by (person)
property disjoint with: has as subject (concept)
property disjoint with: has as subject (object)
property disjoint with: has as subject (event)
property disjoint with: has as subject (place)
property disjoint with: has as subject (corporate body)
property disjoint with: has as subject (person)
property disjoint with: is subject (work) of
property disjoint with: has as subject (work)
property disjoint with: has as subject (expression)
property disjoint with: has as subject (manifestation)
property disjoint with: has as subject (item)
property disjoint with: has a successor (work) (from work)
property disjoint with: is a successor (work) to (work)
property disjoint with: has a supplement (work) (from work)
property disjoint with: supplements (work) (from work)
property disjoint with: has a complement (work) (from work)
property disjoint with: complements (work) (from work)
property disjoint with: has a summary (work) (from work)
property disjoint with: is a summary (work) of (work)
property disjoint with: has an adaptation (work) (from work)
property disjoint with: is an adaptation (work) of (work)
property disjoint with: has a transformation (work) (from work)
property disjoint with: is a transformation (work) of (work)
property disjoint with: has an imitation (work) (from work)
property disjoint with: is an imitation (work) of (work)
property disjoint with: has part (work)
property disjoint with: is part (work) of
property disjoint with: is a successor (work) to (expression)
property disjoint with: supplements (expression) (from work)
property disjoint with: complements (work) (from expression)
property disjoint with: is a summary (work) of (expression)
property disjoint with: is an adaptation (work) of (expression)
property disjoint with: is a transformation (work) of (expression)
property disjoint with: is an imitation (work) of (expression)

has part (expression)
status: Published
name: hasPartExpression
label: tiene como parte (expresión) @es
type: Property
domain: Expression
definition: Relates an expression to another expression that is a component of the expression.
scope note: The component expression may be intended to be used in the context of the prior expression or may not depend to any significant extent on the context provided by the prior expression.
range: Expression
inverse of: is part (expression) of

has part (item)
status: Published
name: hasPartItem
label: tiene como parte (ejemplar) @es
definition: Relates an item to another item that is a component of the item.
type: Property
domain: Item
scope note: The component item may be a discrete physical unit of the prior item or may be an integral part that is physically inseparable from the whole of the prior item.
range: Item
inverse of: is part (item) of

has part (manifestation)
status: Published
name: hasPartManifestation
label: tiene como parte (manifestación) @es
type: Property
domain: Manifestation
definition: Relates a manifestation to another manifestation that is a component of the manifestation.
scope note: The component manifestation may be a discrete physical unit of the prior manifestation or may be an integral part that is physically inseparable from the whole of the prior expression.
range: Manifestation
inverse of: is part (manifestation) of

has part (work)
status: Published
name: hasPartWork
label: tiene como parte (obra) @es
type: Property
domain: Work
definition: Relates a work to another work that is a component of the work.
scope note: The component work may be intended to be used in the context of the prior work or may not depend to any significant extent on the context provided by the prior work.
range: Work
inverse of: is part (work) of
property disjoint with: has title of the work
property disjoint with: has form of work
property disjoint with: has date of the work
property disjoint with: has other distinguishing characteristic of work
property disjoint with: has intended termination
property disjoint with: has intended audience
property disjoint with: has context for the work
property disjoint with: has as subject (work)
property disjoint with: is subject (work) of
property disjoint with: has a successor (work) (from work)
property disjoint with: is a successor (work) to (work)
property disjoint with: has a supplement (work) (from work)
property disjoint with: supplements (work) (from work)
property disjoint with: has a complement (work) (from work)
property disjoint with: has a summary (work) (from work)
property disjoint with: is a summary (work) of (work)
property disjoint with: is an adaptation (work) of (work)
property disjoint with: has a transformation (work) (from work)
property disjoint with: is a transformation (work) of (work)
property disjoint with: is part (work) of
property disjoint with: supplements (expression) (from work)

has physical medium
status: Published
name: hasPhysicalMedium
label: tiene soporte físico @es
definition: Relates a manifestation to the type of material from which the carrier is produced.
type: Property
domain: Manifestation
scope note: E.g., paper, wood, plastic, metal, etc. The physical medium may include in addition to the base material any material that is applied to the base (e.g., oil paint applied to canvas, a chemical emulsion applied to a film base, etc.). Each component of a manifestation comprising multiple physical components may be produced from a different type of material.

has place associated with the corporate body
status: Published
name: hasPlaceAssociatedWithTheCorporateBody
label: tiene lugar asociado a la entidad corporativa @es
definition: Relates a corporate body to the city, town, or other designation of location in which a meeting, conference, exhibition, fair, etc. was held, or the location with which the corporate body is otherwise associated.
type: Property
domain: Corporate Body
scope note: E.g., Los Angeles, Bretton Woods, Oxford University, etc. The place may comprise the name of the state, province, territory, and, or, country as well as the local place name.

has place of publication or distribution
status: Published
name: hasPlaceOfPublicationOrDistribution
label: tiene lugar de publicación o distribución @es
definition: Relates a manifestation to the city, town, or other locality associated in the manifestation with the name of the publisher or distributor.
type: Property
comment: Source documentation has "publication/distribution"; slash character replaced with "or" to improve clarity.
domain: Manifestation
scope note: The place of publication may comprise the name of the state, province, territory, and/or country as well as the local place name. A manifestation may be associated with one or more places of publication or distribution.

has playing speed (sound recording)
status: Published
name: hasPlayingSpeedSoundRecording
label: tiene velocidad de reproducción (grabación sonora) @es
definition: Relates a manifestation that is a sound recording to the speed at which the carrier must be operated to produce the sound intended.
type: Property
domain: Manifestation
scope note: E.g., 33 1/3 rpm, 19 cm/s, etc.

has polarity (microform or visual projection)
status: Published
name: hasPolarityMicroformOrVisualProjection
label: tiene polaridad (microforma o proyección visual) @es
definition: Relates a manifestation that is a microform or visual projection to the relationship of the colours and tones in the image on film to the colours and tones of the object filmed.
type: Property
domain: Manifestation
scope note: When the colours and tones in the film image reflect directly the colour and tones of the object filmed, the polarity is positive. When they are the reverse of the object the polarity is negative. The polarity of images in a manifestation comprising more than one image may be mixed.

has presentation format (visual projection)
status: Published
name: hasPresentationFormatVisualProjection
label: tiene formato de presentación (proyección visual) @es
definition: Relates a manifestation that is a visual projection to the format used in the production of the projected image.
type: Property
domain: Manifestation
scope note: E.g., wide screen, Beta, VHS, etc.

has presentation technique (cartographic image or object)
status: Published
name: hasPresentationTechniqueCartographicImageOrObject
label: tiene técnica de presentación (imagen cartográfica u objeto) @es
definition: Relates an expression that is cartographic to the method used to represent geographic or other features in a cartographic image.
type: Property
domain: Expression
scope note: E.g., anaglyphic, diagrammatic, pictorial, etc.

has projection (cartographic image or object)
status: Published
name: hasProjectionCartographicImageOrObject
label: tiene proyección (imagen cartográfica u objeto) @es
definition: Relates an expression that is cartographic to the method or system used to represent the surface of the Earth or of a celestial sphere on a plane.
type: Property
domain: Expression
scope note: E.g., transverse Mercator, azimuthal equidistant, etc.

has provenance of the item
status: Published
name: hasProvenanceOfTheItem
label: tiene procedencia del ejemplar @es
definition: Relates an item to a record of previous ownership or custodianship of the item.
type: Property
domain: Item

has publication status (serial)
status: Published
name: hasPublicationStatusSerial
label: tiene estado de la publicación (publicación seriada) @es
definition: Relates a manifestation that is a serial to its status with respect to its continuing publication (i.e., whether it is currently published or has ceased publication).
type: Property
domain: Manifestation

has publisher or distributor
status: Published
name: hasPublisherOrDistributor
label: tiene editor o distribuidor @es
definition: Relates a manifestation to the individual, group, or organization named in the manifestation as being responsible for the publication, distribution, issuing, or release of the manifestation.
type: Property
comment: Source documentation has "publisher/distributor"; slash character replaced with "or" to improve clarity.
domain: Manifestation
scope note: A manifestation may be associated with one or more publishers or distributors.

has recording technique (remote sensing image)
status: Published
name: hasRecordingTechniqueRemoteSensingImage
label: tiene técnica de grabación (imagen sensible remota) @es
definition: Relates an expression that is a remote sensing image to the technique used to capture the image through remote sensing.
type: Property
domain: Expression
scope note: E.g., multispectral photography, infrared line scanning, SLAR, passive microwave mapping, etc.

has reduction ratio (microform)
status: Published
name: hasReductionRatioMicroform
label: tiene escala de reducción (microforma) @es
definition: Relates a manifestation that is a microform to the degree to which a text or image has been reduced in the process of microfilming.
type: Property
domain: Manifestation
scope note: E.g., 42x, etc. Reduction ratio may also be indicated as a range (e.g., very high reduction indicates a reduction in the range of 61x to 90x).

has representation of relief (cartographic image or object)
status: Published
name: hasRepresentationOfReliefCartographicImageOrObject
label: tiene representación de relieve (imagen cartográfica u objeto) @es
definition: Relates an expression that is cartographic to the technique used to depict the elevations or the inequalities of a land surface or of the bed of a body of water in a cartographic image.
type: Property
domain: Expression
scope note: E.g., contours, shading, hachures, spot heights, bathymetric tints, etc.

has revisability of expression
status: Published
name: hasRevisabilityOfExpression
label: tiene revisabilidad de la expresión @es
definition: Relates an expression to a reflection of the expectation that the intellectual or artistic content of the expression will be revised.
type: Property
domain: Expression
scope note: E.g., a draft or interim report, a directory that is expected to be updated periodically.

has scale (cartographic image or object)
status: Published
name: hasScaleCartographicImageOrObject
label: tiene escala (imagen cartográfica u objeto) @es
definition: Relates an expression that is cartographic to the ratio of distances in the expression to the actual distances they represent.
type: Property
domain: Expression
scope note: Scale may apply to horizontal, vertical, angular, and, or, other distances represented in the expression.

has scheduled treatment
status: Published
name: hasScheduledTreatment
label: tiene tratamiento programado @es
definition: Relates an item to a plan for future treatment of the item.
type: Property
domain: Item
scope note: E.g., chemical wash. Scheduled treatment may also comprise details of the planned treatment process and the scheduled date of application.

has sequencing pattern (serial)
status: Published
name: hasSequencingPatternSerial
label: tiene modelo de secuencia (publicación seriada) @es
definition: Relates an expression issued as a serial to the form anticipated to be used in designating volumes, issues, etc. and, or, dates for the individual units of the serial.
type: Property
domain: Expression

has series statement
status: Published
name: hasSeriesStatement
label: tiene mención de serie @es
definition: Relates a manifestation to the word, phrase, or group of characters appearing in the manifestation naming the series to which the manifestation belongs.
type: Property
domain: Manifestation
scope note: A series statement may also include a number designating the sequential position of the manifestation within the series. There may be one or more series and, or, subseries named in the manifestation.

has source for acquisition or access authorization
status: Published
name: hasSourceForAcquisitionOrAccessAuthorization
label: tiene fuente de adquisición o autorización para el acceso @es
definition: Relates a manifestation to the name of a publisher, distributor, etc. indicated in the manifestation as the source from which the manifestation may be acquired or through whom access may be authorized.
type: Property
comment: Source documentation has "acquisition/access"; slash character replaced with "or" to improve clarity.
domain: Manifestation
scope note: The source for acquisition/access authorization will normally also include an address for the publisher, distributor, etc. A manifestation may be associated with one or more sources.

has special characteristic (remote sensing image)
status: Published
name: hasSpecialCharacteristicRemoteSensingImage
label: tiene características especiales (imagen sensibel remota) @es
definition: Relates an expression that is a remote sensing image to the altitude and attitude of the sensor, the position of the platform, the category and name of the satellite, the number of spectral bands involved, the quality of the image, the extent of cloud cover, or the mean value of the ground resolution.
type: Property
domain: Expression

has special reproduction characteristic (sound recording)
status: Published
name: hasSpecialReproductionCharacteristicSoundRecording
label: tiene características especiales de la reproducción (grabación sonora) @es
definition: Relates a manifestation that is a sound recording to the equalization system, noise reduction system, etc. used in making the recording.
type: Property
domain: Manifestation
scope note: E.g., NAB, DBX, Dolby, etc.

has statement of responsibility
status: Published
name: hasStatementOfResponsibility
label: tiene mención de responsabilidad @es
definition: Relates a manifestation to a statement appearing in the manifestation (normally in conjunction with the title) that names one or more individuals or groups responsible for the creation or realization of the intellectual or artistic content embodied in the manifestation.
type: Property
domain: Manifestation
scope note: An individual or group named may be directly responsible for the work embodied in the manifestation (e.g., the author, composer, etc.), or indirectly responsible (e.g., the author of a novel on which a film script is based). Other individuals or groups named in the statement may include those responsible for the expression of the work contained in the manifestation (e.g., translators, performers, etc.), or those responsible for the compilation of works contained in the manifestation (e.g., the editor, compiler, etc.). A statement of responsibility may name an organization responsible for sponsoring or issuing the work contained in the manifestation. The statement may also indicate the role or function performed by each of the individuals, groups, or organizations responsible. The names appearing in the statement of responsibility in the manifestation may or may not be those of the persons and corporate bodies actually responsible for the creation or realization of the intellectual or artistic content embodied in the manifestation. Similarly, the stated functions may or may not reflect the actual relationship that exists between the individuals and groups named and the intellectual or artistic content.

has summarization of content
status: Published
name: hasSummarizationOfContent
label: tiene resumen del contenido @es
type: Property
definition: Relates an expression to an abstract, summary, synopsis, etc., or a list of chapter headings, songs, parts, etc. included in the expression.
domain: Expression

has system requirements (electronic resource)
status: Published
name: hasSystemRequirementsElectronicResource
label: tiene requisitos del sistema (recurso electrónico) @es
definition: Relates a manifestation that is an electronic resource to requirements related to hardware, software, and peripherals, and other system components.
type: Property
comment: Source documentation has "includes" prefixing the definition, interpreted as "and other system components" in the property description.
domain: Manifestation
scope note: E.g., machine make and model, RAM capacity, etc. E.g., operating systems, programming language, supporting software, etc. Peripherals include monitor, printer, mouse, etc.

has tape configuration (sound recording)
status: Published
name: hasTapeConfigurationSoundRecording
label: tiene configuración de la cinta (grabación sonora) @es
definition: Relates a manifestation that is a sound recording to the number of tracks on a sound tape.
type: Property
domain: Manifestation
scope note: E.g., eight track, twelve track.

has technique (graphic or projected image)
status: Published
name: hasTechniqueGraphicOrProjectedImage
label: tiene técnica (imagen gráfica o proyectada) @es
definition: Relates an expression that is a graphic or projected image to the method used to create it.
type: Property
domain: Expression
scope note: E.g., engraving, etc.

has term for the concept
status: Published
name: hasTermForTheConcept
label: tiene término del concepto @es
definition: Relates a concept to the word, phrase, or group of characters used to name or designate the concept.
type: Property
domain: Concept
scope note: E.g., economics, existentialism, radioactivity, etc. A concept may be designated by more than one term, or by more than one form of the term. A bibliographic agency normally selects one of those terms as the uniform heading for purposes of consistency in naming and referencing the concept. The other terms or forms of term may be treated as variant terms for the concept.

has term for the event
status: Published
name: hasTermForTheEvent
label: tiene término del acontecimiento @es
definition: Relates an event to the word, phrase, or group of characters used to name or designate the event.
type: Property
domain: Event
scope note: E.g., Battle of Hastings, Tour de France, etc. An event may be designated by more than one term, or by more than one form of the term. A bibliographic agency normally selects one of those terms as the uniform heading for purposes of consistency in naming and referencing the event. The other terms or forms of term may be treated as variant terms for the event.

has term for the object
status: Published
name: hasTermForTheObject
label: tiene término del objeto @es
definition: Relates an object to the word, phrase, or group of characters used to name or designate the object.
type: Property
domain: Object
scope note: E.g., a building, a ship, etc. An object may be designated by more than one term, or by more than one form of the term. A bibliographic agency normally selects one of those terms as the uniform heading for purposes of consistency in naming and referencing the object. The other terms or forms of term may be treated as variant terms for the object.

has term for the place
status: Published
name: hasTermForThePlace
label: tiene término del lugar @es
definition: Relates a place to the word, phrase, or group of characters used to name or designate the place.
type: Property
domain: Place
scope note: E.g., London, St. Lawrence River, etc. A place may be designated by more than one term, or by more than one form of the term. A bibliographic agency normally selects one of those terms as the uniform heading for purposes of consistency in naming and referencing the place. The other terms or forms of term may be treated as variant terms for the place.

has terms of availability
status: Published
name: hasTermsOfAvailability
label: tiene condiciones de disponibilidad @es
definition: Relates a manifestation to the terms indicated in the manifestation under which the supplier (i.e., the source for acquisition or access authorization) will normally make the manifestation available, or the price for which the manifestation sells.
type: Property
domain: Manifestation
scope note: E.g., free to members of a particular association.

has title of person
status: Published
name: hasTitleOfPerson
label: tiene calificativo de persona @es
definition: Relates a person to a word or phrase indicative of rank, office, nobility, honour, etc., or a term of address associated with the person.
type: Property
domain: Person
scope note: E.g., Major, Premier, Duke, etc.; Sir, Mrs., etc.

has title of the expression
status: Published
name: hasTitleOfTheExpression
label: tiene título de la expresión @es
definition: Relates an expression to a word, phrase, or group of characters naming the expression.
type: Property
domain: Expression
scope note: There may be one or more titles associated with an expression. The title of an expression that forms part of a larger expression may consist solely of a number or other generic designation that is dependent on the title of the larger expression.

has title of the manifestation
status: Published
name: hasTitleOfTheManifestation
label: tiene título de la manifestación @es
definition: Relates a manifestation to the word, phrase, or group of characters naming the manifestation.
type: Property
domain: Manifestation
scope note: There may be one or more titles associated with a manifestation. Titles associated with a manifestation include all those that appear in the manifestation itself (e.g., the title on the title page, title frame, etc., a cover title, added title-page title, caption title, running title, spine title, etc., the title in a colophon, explicit, etc., the title on a container, on a microfiche header, etc.), as well as those that have been assigned to the manifestation for purposes of bibliographic control (e.g., key title, expanded title, translated title, supplied title, etc.).

has title of the work
status: Published
name: hasTitleOfTheWork
label: tiene título de la obra @es
definition: Relates a work to the word, phrase, or group of characters naming the work.
type: Property
domain: Work
scope note: There may be one or more titles associated with a work. If the work has appeared under varying titles (differing in form, language, etc.), a bibliographic agency normally selects one of those titles as the basis of a "uniform title" for purposes of consistency in naming and referencing the work. Other titles under which the work has appeared may be treated as variant titles for the work, or in some cases as a parallel uniform title. The title of a work that forms part of a larger work may consist solely of a number or other generic designation that is dependent on the title of the larger work.
property disjoint with: has form of work
property disjoint with: has date of the work
property disjoint with: has intended termination
property disjoint with: has intended audience
property disjoint with: has context for the work
property disjoint with: has other distinguishing characteristic of work
property disjoint with: is realized through
property disjoint with: is created by (corporate body)
property disjoint with: is created by (person)
property disjoint with: has as subject (concept)
property disjoint with: has as subject (object)
property disjoint with: has as subject (event)
property disjoint with: has as subject (place)
property disjoint with: has as subject (corporate body)
property disjoint with: has as subject (person)
property disjoint with: has as subject (work)
property disjoint with: is subject (work) of
property disjoint with: has as subject (expression)
property disjoint with: has as subject (manifestation)
property disjoint with: has as subject (item)
property disjoint with: has a successor (work) (from work)
property disjoint with: is a successor (work) to (work)
property disjoint with: has a supplement (work) (from work)
property disjoint with: supplements (work) (from work)
property disjoint with: has a complement (work) (from work)
property disjoint with: complements (work) (from work)
property disjoint with: has a summary (work) (from work)
property disjoint with: is a summary (work) of (work)
property disjoint with: has an adaptation (work) (from work)
property disjoint with: is an adaptation (work) of (work)
property disjoint with: has a transformation (work) (from work)
property disjoint with: is a transformation (work) of (work)
property disjoint with: has an imitation (work) (from work)
property disjoint with: is an imitation (work) of (work)
property disjoint with: has part (work)
property disjoint with: is part (work) of
property disjoint with: is a successor (work) to (expression)
property disjoint with: supplements (expression) (from work)
property disjoint with: complements (work) (from expression)
property disjoint with: is a summary (work) of (expression)
property disjoint with: is an adaptation (work) of (expression)
property disjoint with: is a transformation (work) of (expression)
property disjoint with: is an imitation (work) of (expression)

has treatment history
status: Published
name: hasTreatmentHistory
label: tiene historial de tratamientos @es
definition: Relates an item to a record of the treatment the item has undergone.
type: Property
domain: Item
scope note: E.g., deacidification, restoration, etc. Treatment history may also comprise details of the treatment process (e.g., chemical solutions used, techniques applied, etc.), the date the treatment was applied, etc.

has typeface (printed book)
status: Published
name: hasTypefacePrintedBook
label: tiene tipografía (libros impresos) @es
definition: Relates a manifestation that is a printed book to the style of type used to print it.
type: Property
domain: Manifestation
scope note: E.g., Baskerville, Times New Roman, etc.

has type of score (musical notation)
status: Published
name: hasTypeOfScoreMusicalNotation
label: tiene tipo de partitura (notación musical) @es
definition: Relates an expression that is a musical notation to the format used to represent a musical composition.
type: Property
domain: Expression
scope note: E.g., short score, full score, condensed score, close score, etc.

has type size (printed book)
status: Published
name: hasTypeSizePrintedBook
label: tiene tamaño del tipo (libro impreso) @es
definition: Relates a manifestation that is a printed book to the size of the characters in it.
type: Property
domain: Manifestation

has use restrictions on the expression
status: Published
name: hasUseRestrictionsOnTheExpression
label: tiene restricciones de uso de la expresión @es
definition: Relates an expression to restrictions on access to and use of an expression.
type: Property
domain: Expression
scope note: Use restrictions may be based in copyright, or they may extend beyond the protections guaranteed in law to the owner of the copyright.

is an abridgement (expression) of
status: Published
name: isAnAbridgementExpressionOf
label: es compendio (expresión) de @es
type: Property
domain: Expression
definition: Relates an expression to a prior expression of the same work of which it represents an abridgement, in which some content of the prior expression is removed, but the result does not alter the content to the extent that it becomes a new work.
range: Expression
inverse of: has an abridgement (expression)

is an adaptation (expression) of (expression)
status: Published
name: isAnAdaptationExpressionOfExpression
label: es adaptación (expresión) de (expresión) @es
type: Property
domain: Expression
definition: Relates an expression of a work to an expression of a prior work of which it represents a modification of the content for a purpose, use, or medium other than that for which it was originally intended. The modification of the content of the prior work must be sufficient in degree to warrant the adaptation work being considered as a new work autonomous with respect to the prior work.
range: Expression
inverse of: has an adaptation (expression) (from expression)

is an adaptation (work) of (expression)
status: Published
name: isAnAdaptationWorkOfExpression
label: es adaptación (obra) de (expresión) @es
type: Property
domain: Work
definition: Relates a work to an expression of a prior work of which it represents a modification of the content for a purpose, use, or medium other than that for which it was originally intended. The modification of the content of the prior work must be sufficient in degree to warrant the adaptation work being considered as a new work autonomous with respect to the prior work.
range: Expression
inverse of: has an adaptation (work) (from expression)
property disjoint with: has title of the work
property disjoint with: has form of work
property disjoint with: has date of the work
property disjoint with: has other distinguishing characteristic of work
property disjoint with: has intended termination
property disjoint with: has intended audience
property disjoint with: has context for the work

is an adaptation (work) of (work)
status: Published
name: isAnAdaptationWorkOfWork
label: es adaptación (obra) de (obra) @es
type: Property
domain: Work
definition: Relates a work to a prior work of which it represents a modification of the content for a purpose, use, or medium other than that for which it was originally intended.The modification of the content of the prior work must be sufficient in degree to warrant the adaptation work being considered as a new work autonomous with respect to the prior work.
range: Work
inverse of: has an adaptation (work) (from work)
property disjoint with: has title of the work
property disjoint with: has form of work
property disjoint with: has date of the work
property disjoint with: has other distinguishing characteristic of work
property disjoint with: has intended termination
property disjoint with: has intended audience
property disjoint with: has context for the work
property disjoint with: has as subject (work)
property disjoint with: is subject (work) of
property disjoint with: has a successor (work) (from work)
property disjoint with: is a successor (work) to (work)
property disjoint with: has a supplement (work) (from work)
property disjoint with: supplements (work) (from work)
property disjoint with: has a complement (work) (from work)
property disjoint with: has a summary (work) (from work)
property disjoint with: is a summary (work) of (work)
property disjoint with: has a transformation (work) (from work)
property disjoint with: is a transformation (work) of (work)
property disjoint with: has part (work)
property disjoint with: is part (work) of
property disjoint with: supplements (expression) (from work)

is an arrangement (expression) of
status: Published
name: isAnArrangementExpressionOf
label: es arreglo (expresión) de @es
definition: Relates an expression to a prior expression of which it represents an arrangement of the same musical composition work.
type: Property
domain: Expression
range: Expression
inverse of: has an arrangement (expression)

is an imitation (expression) of (expression)
status: Published
name: isAnImitationExpressionOfExpression
label: es imitación (expresión) de (expresión) @es
type: Property
domain: Expression
definition: Relates an expression of a work to an expression of a prior work of which it copies the style of the content. The modification of the content of the prior work must be sufficient in degree to warrant the imitation work being considered as a new work autonomous with respect to the prior work.
range: Expression
inverse of: has an imitation (expression) (from expression)

is an imitation (work) of (expression)
status: Published
name: isAnImitationWorkOfExpression
label: es imitación (obra) de (expresión) @es
type: Property
domain: Work
definition: Relates a work to an expression of a prior work of which it copies the style of the content. The modification of the content of the prior work must be sufficient in degree to warrant the imitation work being considered as a new work autonomous with respect to the prior work.
range: Expression
inverse of: has an imitation (work) (from expression)
property disjoint with: has title of the work
property disjoint with: has form of work
property disjoint with: has date of the work
property disjoint with: has other distinguishing characteristic of work
property disjoint with: has intended termination
property disjoint with: has intended audience
property disjoint with: has context for the work

is an imitation (work) of (work)
status: Published
name: isAnImitationWorkOfWork
label: es imitación (obra) de (obra) @es
type: Property
domain: Work
definition: Relates a work to a prior work of which it copies the style of the content. The modification of the content of the prior work must be sufficient in degree to warrant the imitation work being considered as a new work autonomous with respect to the prior work.
range: Work
inverse of: has an imitation (work) (from work)
property disjoint with: has title of the work
property disjoint with: has form of work
property disjoint with: has date of the work
property disjoint with: has other distinguishing characteristic of work
property disjoint with: has intended termination
property disjoint with: has intended audience
property disjoint with: has context for the work

is a reconfiguration of
status: Published
name: isAReconfigurationOf
label: es reconfiguración de @es
definition: Relates an item to another item to which it is the result of a change. The reconfiguration item may be the result of changes to more than one prior item.
type: Property
domain: Item
scope note: Most commonly, an item of one manifestation is bound with an item of a different manifestation to make a new item.
range: Item
inverse of: has a reconfiguration

is a reproduction (item) of (item)
status: Published
name: isAReproductionItemOfItem
label: es reproducción (ejemplar) de (ejemplar) @es
definition: Relates an item to a prior item from which it has been derived in some way. There can be varying levels of fidelity of the reproduction item to the prior item. The reproduction item must replicate the type of carrier and other physical characteristics of the prior item.
type: Property
domain: Item
range: Item
inverse of: has a reproduction (item) (from item)

is a reproduction (manifestation) of (item)
status: Published
name: isAReproductionManifestationOfItem
label: es reproducción (manifestación) de (ejemplar) @es
definition: Relates a manifestation to an item from which it has been derived in some way. There can be varying levels of fidelity of the reproduction manifestation to the prior item.
type: Property
domain: Manifestation
scope note: The reproduction relationship will be stated at this level when it is useful to indicate the specific item used, as opposed to stating the relationship at the more general level of manifestation-to-manifestation.
range: Item
inverse of: has a reproduction (manifestation) (from item)

is a reproduction (manifestation) of (manifestation)
status: Published
name: isAReproductionManifestationOfManifestation
label: es reproducción (manifestación) de (manifestación) @es
definition: Relates a manifestation to a prior manifestation, usually of the same expression, of which it represents the same intellectual or artistic content as the prior manifestation. The reproduction manifestation may or may not replicate the look and feel or other physical characteristics of the prior manifestation.
type: Property
domain: Manifestation
range: Manifestation
inverse of: has a reproduction (manifestation) (from manifestation)

is a revision (expression) of
status: Published
name: isARevisionExpressionOf
label: es revisión (expresión) de @es
definition: Relates an expression to a prior expression of the same work of which it represents a revision, in which the intent is to alter or update the content of the prior expression, but without changing the content so much that it becomes a new work.
type: Property
domain: Expression
range: Expression
inverse of: has a revision (expression)

is a successor (expression) to (expression)
status: Published
name: isASuccessorExpressionToExpression
label: es continuación (expresión) de (expresión) @es
type: Property
domain: Expression
definition: Relates an expression of a work to an expression of a prior work, the content of which represents the basis of a linear progression to that of the successor work. The content may be closely or loosely connected, so the successor work may be referential or autonomous with respect to the prior work.
range: Expression
inverse of: has a successor (expression) (from expression)

is a successor (work) to (expression)
status: Published
name: isASuccessorWorkToExpression
label: es continuación (obra) de (expresión) @es
type: Property
domain: Work
definition: Relates a work to an expression of a prior work, the content of which represents the basis of a linear progression to that of the successor work. The content may be closely or loosely connected, so the successor work may be referential or autonomous with respect to the prior work.
range: Expression
inverse of: has a successor (work) (from expression)
property disjoint with: has title of the work
property disjoint with: has form of work
property disjoint with: has date of the work
property disjoint with: has other distinguishing characteristic of work
property disjoint with: has intended termination
property disjoint with: has intended audience
property disjoint with: has context for the work

is a successor (work) to (work)
status: Published
name: isASuccessorWorkToWork
label: es continuación (obra) de (obra) @es
definition: Relates a work to a prior work, the content of which represents the basis of a linear progression to that of the successor work. The content may be closely or loosely connected, so the successor work may be referential or autonomous with respect to the prior work.
type: Property
domain: Work
range: Work
inverse of: has a successor (work) (from work)
property disjoint with: has title of the work
property disjoint with: has form of work
property disjoint with: has date of the work
property disjoint with: has other distinguishing characteristic of work
property disjoint with: has intended termination
property disjoint with: has intended audience
property disjoint with: has context for the work
property disjoint with: has as subject (work)
property disjoint with: is subject (work) of
property disjoint with: has a successor (work) (from work)
property disjoint with: has a supplement (work) (from work)
property disjoint with: supplements (work) (from work)
property disjoint with: has a complement (work) (from work)
property disjoint with: has a summary (work) (from work)
property disjoint with: is a summary (work) of (work)
property disjoint with: is an adaptation (work) of (work)
property disjoint with: has a transformation (work) (from work)
property disjoint with: is a transformation (work) of (work)
property disjoint with: has part (work)
property disjoint with: is part (work) of
property disjoint with: supplements (expression) (from work)

is a summary (expression) of (expression)
status: Published
name: isASummaryExpressionOfExpression
label: es resumen (expresión) de (expresión) @es
type: Property
domain: Expression
definition: Relates an expression of a work to an expression of a prior work of which it represents a brief recapitulation. The modification of the content of the prior work must be sufficient in degree to warrant the summary work being considered as a new work autonomous with respect to the prior work.
range: Expression
inverse of: has a summary (expression) (from expression)

is a summary (work) of (expression)
status: Published
name: isASummaryWorkOfExpression
label: es resumen (obra) de (expresión) @es
type: Property
domain: Work
definition: Relates a work to an expression of a prior work of which it represents a brief recapitulation. The modification of the content of the prior work must be sufficient in degree to warrant the summary work being considered as a new work autonomous with respect to the prior work.
range: Expression
inverse of: has a summary (work) (from expression)
property disjoint with: has title of the work
property disjoint with: has form of work
property disjoint with: has date of the work
property disjoint with: has other distinguishing characteristic of work
property disjoint with: has intended termination
property disjoint with: has intended audience
property disjoint with: has context for the work

is a summary (work) of (work)
status: Published
name: isASummaryWorkOfWork
label: es resumen (obra) de (obra) @es
type: Property
domain: Work
definition: Relates a work to a prior work of which it represents a brief recapitulation. The modification of the content of the prior work must be sufficient in degree to warrant the summary work being considered as a new work autonomous with respect to the prior work.
range: Work
inverse of: has a summary (work) (from work)
property disjoint with: has title of the work
property disjoint with: has form of work
property disjoint with: has date of the work
property disjoint with: has other distinguishing characteristic of work
property disjoint with: has intended termination
property disjoint with: has intended audience
property disjoint with: has context for the work
property disjoint with: has as subject (work)
property disjoint with: is subject (work) of
property disjoint with: has a successor (work) (from work)
property disjoint with: is a successor (work) to (work)
property disjoint with: has a supplement (work) (from work)
property disjoint with: supplements (work) (from work)
property disjoint with: has a complement (work) (from work)
property disjoint with: has a summary (work) (from work)
property disjoint with: is an adaptation (work) of (work)
property disjoint with: has a transformation (work) (from work)
property disjoint with: is a transformation (work) of (work)
property disjoint with: has part (work)
property disjoint with: is part (work) of
property disjoint with: supplements (expression) (from work)

is a transformation (expression) of (expression)
status: Published
name: isATransformationExpressionOfExpression
label: es transformación (expresión) de (expresión) @es
type: Property
domain: Expression
definition: Relates an expression of a work to an expression of a prior work of which it represents a transformation of the content in a different genre. The modification of the content of the prior work must be sufficient in degree to warrant the adaptation work being considered as a new work autonomous with respect to the prior work.
comment: Source documentation has "literary genre", but other genres allowed.
range: Expression
inverse of: has a transformation (expression) (from expression)

is a transformation (work) of (expression)
status: Published
name: isATransformationWorkOfExpression
label: es transformación (obra) de (expresión) @es
type: Property
domain: Work
definition: Relates a work to an expression of a prior work of which it represents a transformation of the content in a different genre. The modification of the content of the prior work must be sufficient in degree to warrant the adaptation work being considered as a new work autonomous with respect to the prior work.
comment: Source documentation has "literary genre", but other genres allowed.
range: Expression
inverse of: has a transformation (work) (from expression)
property disjoint with: has title of the work
property disjoint with: has form of work
property disjoint with: has date of the work
property disjoint with: has other distinguishing characteristic of work
property disjoint with: has intended termination
property disjoint with: has intended audience
property disjoint with: has context for the work

is a transformation (work) of (work)
status: Published
name: isATransformationWorkOfWork
label: es transformación (obra) de (obra) @es
type: Property
domain: Work
definition: Relates a work to a prior work of which it represents a transformation of the content in a different genre. The modification of the content of the prior work must be sufficient in degree to warrant the adaptation work being considered as a new work autonomous with respect to the prior work.
comment: Source documentation has "literary genre", but other genres allowed.
range: Work
inverse of: has a transformation (work) (from work)
property disjoint with: has title of the work
property disjoint with: has form of work
property disjoint with: has date of the work
property disjoint with: has other distinguishing characteristic of work
property disjoint with: has intended termination
property disjoint with: has intended audience
property disjoint with: has context for the work
property disjoint with: has as subject (work)
property disjoint with: is subject (work) of
property disjoint with: has a successor (work) (from work)
property disjoint with: is a successor (work) to (work)
property disjoint with: has a supplement (work) (from work)
property disjoint with: supplements (work) (from work)
property disjoint with: has a complement (work) (from work)
property disjoint with: has a summary (work) (from work)
property disjoint with: is a summary (work) of (work)
property disjoint with: is an adaptation (work) of (work)
property disjoint with: has a transformation (work) (from work)
property disjoint with: has part (work)
property disjoint with: is part (work) of
property disjoint with: supplements (expression) (from work)

is a translation (expression) of
status: Published
name: isATranslationExpressionOf
label: es traducción (expresión) de @es
definition: Relates an expression to a prior expression of the same work of which it represents a literal translation, in which the intent is to render the intellectual content of the previous expression as accurately as possible.
type: Property
domain: Expression
scope note: Free translations are treated in the model as new works.
range: Expression
inverse of: has a translation (expression)

is created by (corporate body)
status: Published
name: isCreatedByCorporateBody
label: es creado por (entidad corporativa) @es
definition: Relates a work to a corporate body that is responsible for the creation of the intellectual or artistic content of the work.
type: Property
domain: Work
range: Corporate Body
inverse of: is creator (corporate body) of
property disjoint with: has context for the work
property disjoint with: has intended audience
property disjoint with: has intended termination
property disjoint with: has other distinguishing characteristic of work
property disjoint with: has date of the work
property disjoint with: has form of work
property disjoint with: has title of the work

is created by (person)
status: Published
name: isCreatedByPerson
label: es creado por (persona) @es
definition: Relates a work to a person who is responsible for the creation of the intellectual or artistic content of the work.
type: Property
domain: Work
range: Person
inverse of: is creator (person) of
property disjoint with: has title of the work
property disjoint with: has form of work
property disjoint with: has date of the work
property disjoint with: has other distinguishing characteristic of work
property disjoint with: has intended termination
property disjoint with: has intended audience
property disjoint with: has context for the work

is creator (corporate body) of
status: Published
name: isCreatorCorporateBodyOf
label: es creador (entidad corporativa) de @es
definition: Relates a corporate body to a work of which it is responsible for the creation of the intellectual or artistic content.
type: Property
domain: Corporate Body
range: Work
inverse of: is created by (corporate body)

is creator (person) of
status: Published
name: isCreatorPersonOf
label: es creador (persona) de @es
definition: Relates a person to a work of which they are responsible for the creation of the intellectual or artistic content.
type: Property
domain: Person
range: Work
inverse of: is created by (person)

is embodied in
status: Published
name: isEmbodiedIn
label: está materializado en @es
definition: Relates an expression to a manifestation that is the embodiment of the expression.
type: Property
domain: Expression
range: Manifestation
inverse of: is embodiment of

is embodiment of
status: Published
name: isEmbodimentOf
label: es materialización de @es
definition: Relates a manifestation to an expression that is embodied in the manifestation.
type: Property
domain: Manifestation
range: Expression
inverse of: is embodied in

is exemplar of
status: Published
name: isExemplarOf
label: es ejemplar de @es
definition: Relates an item to the manifestation that is exemplified by the item.
type: Property
domain: Item
range: Manifestation
inverse of: is exemplified by

is exemplified by
status: Published
name: isExemplifiedBy
label: está ejemplificado por @es
definition: Relates a manifestation to an item that is a single exemplar of the manifestation.
type: Property
domain: Manifestation
range: Item
inverse of: is exemplar of

is owned by (corporate body)
status: Published
name: isOwnedByCorporateBody
label: es propiedad de (entidad corporativa) @es
definition: Relates an item to a corporate body that is the owner or custodian of the item.
type: Property
domain: Item
range: Corporate Body
inverse of: is owner (corporate body) of

is owned by (person)
status: Published
name: isOwnedByPerson
label: es propiedad de (persona) @es
definition: Relates an item to a person who is the owner or custodian of the item.
type: Property
domain: Item
range: Person
inverse of: is owner (person) of

is owner (corporate body) of
status: Published
name: isOwnerCorporateBodyOf
label: es propietario (entidad corporativa) de @es
definition: Relates a corporate body to an item of which it is the owner or custodian.
type: Property
domain: Corporate Body
range: Item
inverse of: is owned by (corporate body)

is owner (person) of
status: Published
name: isOwnerPersonOf
label: es propietario (persona) de @es
definition: Relates a person to an item of which they are the owner or custodian.
type: Property
domain: Person
range: Item
inverse of: is owned by (person)

is part (expression) of
status: Published
name: isPartExpressionOf
label: forma parte (expresión) de @es
type: Property
domain: Expression
definition: Relates an expression to another expression of which it is a component.
scope note: The component expression may be intended to be used in the context of the prior expression or may not depend to any significant extent on the context provided by the prior expression.
range: Expression
inverse of: has part (expression)

is part (item) of
status: Published
name: isPartItemOf
label: forma parte (ejemplar) de @es
definition: Relates an item to another item of which it is a component.
type: Property
domain: Item
range: Item
inverse of: has part (item)

is part (manifestation) of
status: Published
name: isPartManifestationOf
label: forma parte (manifestación) de @es
type: Property
domain: Manifestation
definition: Relates a manifestation to another manifestation of which it is a component.
scope note: The component manifestation may be a discrete physical unit of the prior manifestation or may be an integral part that is physically inseparable from the whole of the prior manifestation.
range: Manifestation
inverse of: has part (manifestation)

is part (work) of
status: Published
name: isPartWorkOf
label: forma parte (obra) de @es
type: Property
domain: Work
definition: Relates a work to another work of which it is a component.
scope note: The component work may be intended to be used in the context of the prior work or may not depend to any significant extent on the context provided by the prior work.
range: Work
inverse of: has part (work)
property disjoint with: has title of the work
property disjoint with: has form of work
property disjoint with: has date of the work
property disjoint with: has other distinguishing characteristic of work
property disjoint with: has intended termination
property disjoint with: has intended audience
property disjoint with: has context for the work
property disjoint with: has as subject (work)
property disjoint with: is subject (work) of
property disjoint with: has a successor (work) (from work)
property disjoint with: is a successor (work) to (work)
property disjoint with: has a supplement (work) (from work)
property disjoint with: supplements (work) (from work)
property disjoint with: has a complement (work) (from work)
property disjoint with: has a summary (work) (from work)
property disjoint with: is a summary (work) of (work)
property disjoint with: is an adaptation (work) of (work)
property disjoint with: has a transformation (work) (from work)
property disjoint with: is a transformation (work) of (work)
property disjoint with: has part (work)
property disjoint with: supplements (expression) (from work)

is produced by (corporate body)
status: Published
name: isProducedByCorporateBody
label: es producido por (entidad corporativa) @es
definition: Relates a manifestation to a corporate body that is responsible for publishing, distributing, fabricating or manufacturing the manifestation.
type: Property
domain: Manifestation
range: Corporate Body
inverse of: is producer (corporate body) of

is produced by (person)
status: Published
name: isProducedByPerson
label: es producido por (persona) @es
type: Property
domain: Manifestation
definition: Relates a manifestation to a person who is responsible for publishing, distributing, fabricating or manufacturing the manifestation.
range: Person
inverse of: is producer (person) of

is producer (corporate body) of
status: Published
name: isProducerCorporateBodyOf
label: es productor (entidad corporativa) de @es
definition: Relates a corporate body to a manifestation of which it is responsible for publishing, distributing, fabricating or manufacturing.
type: Property
domain: Corporate Body
range: Manifestation
inverse of: is produced by (corporate body)

is producer (person) of
status: Published
name: isProducerPersonOf
label: es productor (persona) de @es
definition: Relates a person to a manifestation of which they are responsible for publishing, distributing, fabricating or manufacturing.
type: Property
domain: Person
range: Manifestation
inverse of: is produced by (person)

is realization of
status: Published
name: isRealizationOf
label: es realización de @es
definition: Relates an expression to the work that is realized through the expression.
type: Property
domain: Expression
range: Work
inverse of: is realized through

is realized by (corporate body)
status: Published
name: isRealizedByCorporateBody
label: está realizado por (entidad corporativa) @es
definition: Relates an expression to a corporate body that is responsible for the specifics of the intellectual or artistic realization or execution of the expression.
type: Property
domain: Expression
range: Corporate Body
inverse of: is realizer (corporate body) of

is realized by (person)
status: Published
name: isRealizedByPerson
label: está realizado por (persona) @es
definition: Relates an expression to a person who is responsible for the specifics of the intellectual or artistic realization or execution of the expression.
type: Property
domain: Expression
range: Person
inverse of: is realizer (person) of

is realized through
status: Published
name: isRealizedThrough
label: está realizado mediante @es
definition: Relates a work to an expression that is the realization of the work.
type: Property
domain: Work
range: Expression
inverse of: is realization of
property disjoint with: has title of the work
property disjoint with: has form of work
property disjoint with: has date of the work
property disjoint with: has other distinguishing characteristic of work
property disjoint with: has intended termination
property disjoint with: has intended audience
property disjoint with: has context for the work

is realizer (corporate body) of
status: Published
name: isRealizerCorporateBodyOf
label: es realizador (entidad corporativa) de @es
definition: Relates a corporate body to an expression of which it is responsible for the specifics of the intellectual or artistic realization or execution.
type: Property
domain: Corporate Body
range: Expression
inverse of: is realized by (corporate body)

is realizer (person) of
status: Published
name: isRealizerPersonOf
label: es realizador (persona) de @es
definition: Relates a person to an expression of which they are responsible for the specifics of the intellectual or artistic realization or execution.
type: Property
domain: Person
range: Expression
inverse of: is realized by (person)

is subject (concept) of
status: Published
name: isSubjectConceptOf
label: es materia (concepto) de @es
definition: Relates a concept to a work of which it is the subject.
type: Property
domain: Concept
range: Work
inverse of: has as subject (concept)

is subject (corporate body) of
status: Published
name: isSubjectCorporateBodyOf
label: es materia (entidad corporativa) de @es
definition: Relates a corporate body to a work of which it is the subject.
type: Property
domain: Corporate Body
range: Work
inverse of: has as subject (corporate body)

is subject (event) of
status: Published
name: isSubjectEventOf
label: es materia (acontecimiento) de @es
definition: Relates an event to a work of which it is the subject.
type: Property
domain: Event
range: Work
inverse of: has as subject (event)

is subject (expression) of
status: Published
name: isSubjectExpressionOf
label: es materia (expresión) de @es
definition: Relates an expression to a work of which it is the subject.
type: Property
domain: Expression
range: Work
inverse of: has as subject (expression)

is subject (item) of
status: Published
name: isSubjectItemOf
label: es materia (ejemplar) de @es
definition: Relates an item to a work of which it is the subject.
type: Property
domain: Item
range: Work
inverse of: has as subject (item)

is subject (manifestation) of
status: Published
name: isSubjectManifestationOf
label: es materia (manifestación) de @es
definition: Relates a manifestation to a work of which it is the subject.
type: Property
domain: Manifestation
range: Work
inverse of: has as subject (manifestation)

is subject (object) of
status: Published
name: isSubjectObjectOf
label: es materia (objeto) de @es
definition: Relates an object to a work of which it is the subject.
type: Property
domain: Object
range: Work
inverse of: has as subject (object)

is subject (person) of
status: Published
name: isSubjectPersonOf
label: es materia (persona) de @es
definition: Relates a person to a work of which it is the subject.
type: Property
domain: Person
range: Work
inverse of: has as subject (person)

is subject (place) of
status: Published
name: isSubjectPlaceOf
label: es materia (lugar) de @es
definition: Relates a place to a work of which it is the subject.
type: Property
domain: Place
range: Work
inverse of: has as subject (place)

is subject (work) of
status: Published
name: isSubjectWorkOf
label: es materia (obra) de @es
definition: Relates a prior work to another work of which it is the subject.
type: Property
domain: Work
range: Work
inverse of: has as subject (work)
property disjoint with: has title of the work
property disjoint with: has form of work
property disjoint with: has date of the work
property disjoint with: has other distinguishing characteristic of work
property disjoint with: has intended termination
property disjoint with: has intended audience
property disjoint with: has context for the work
property disjoint with: supplements (expression) (from work)
property disjoint with: has as subject (work)
property disjoint with: has a successor (work) (from work)
property disjoint with: is a successor (work) to (work)
property disjoint with: has a supplement (work) (from work)
property disjoint with: supplements (work) (from work)
property disjoint with: has a complement (work) (from work)
property disjoint with: has a summary (work) (from work)
property disjoint with: is a summary (work) of (work)
property disjoint with: is an adaptation (work) of (work)
property disjoint with: has a transformation (work) (from work)
property disjoint with: is a transformation (work) of (work)
property disjoint with: has part (work)
property disjoint with: is part (work) of

supplements (expression) (from expression)
status: Published
name: supplementsExpressionFromExpression
label: es suplemento (expresión) de (expresión) @es
definition: Relates an expression of a work to an expression of a prior work with which it is intended to be used in conjunction. The content may be closely or loosely associated, so the supplementary work may be referential or autonomous with respect to the prior work.
type: Property
domain: Expression
range: Expression
inverse of: has a supplement (expression) (from expression)

supplements (expression) (from work)
status: Published
name: supplementsExpressionFromWork
label: es suplemento (expresión) de (obra) @es
type: Property
domain: Work
definition: Relates a work to an expression of a prior work with which it is intended to be used in conjunction. The content may be closely or loosely associated, so the supplementary work may be referential or autonomous with respect to the prior work.
range: Expression
inverse of: has a supplement (work) (from expression)
property disjoint with: has title of the work
property disjoint with: has form of work
property disjoint with: has date of the work
property disjoint with: has other distinguishing characteristic of work
property disjoint with: has intended termination
property disjoint with: has intended audience
property disjoint with: has context for the work
property disjoint with: has as subject (work)
property disjoint with: is subject (work) of
property disjoint with: has a successor (work) (from work)
property disjoint with: is a successor (work) to (work)
property disjoint with: has a supplement (work) (from work)
property disjoint with: supplements (work) (from work)
property disjoint with: has a complement (work) (from work)
property disjoint with: is a summary (work) of (work)
property disjoint with: is an adaptation (work) of (work)
property disjoint with: has a transformation (work) (from work)
property disjoint with: is a transformation (work) of (work)
property disjoint with: has part (work)
property disjoint with: is part (work) of
property disjoint with: has a summary (work) (from work)

supplements (work) (from work)
status: Published
name: supplementsWorkFromWork
label: es suplemento (obra) de (obra) @es
definition: Relates a work to a prior work with which it is intended to be used in conjunction. The content may be closely or loosely associated, so the supplementary work may be referential or autonomous with respect to the prior work.
type: Property
domain: Work
range: Work
inverse of: has a supplement (work) (from work)
property disjoint with: has title of the work
property disjoint with: has form of work
property disjoint with: has date of the work
property disjoint with: has other distinguishing characteristic of work
property disjoint with: has intended termination
property disjoint with: has intended audience
property disjoint with: has context for the work
property disjoint with: has as subject (work)
property disjoint with: is subject (work) of
property disjoint with: has a successor (work) (from work)
property disjoint with: is a successor (work) to (work)
property disjoint with: has a supplement (work) (from work)
property disjoint with: has a complement (work) (from work)
property disjoint with: has a summary (work) (from work)
property disjoint with: is a summary (work) of (work)
property disjoint with: is an adaptation (work) of (work)
property disjoint with: has a transformation (work) (from work)
property disjoint with: is a transformation (work) of (work)
property disjoint with: has part (work)
property disjoint with: is part (work) of
property disjoint with: supplements (expression) (from work)

Published
type: Concept