revision of
type: ObjectProperty
domain: expression
range: expression
sub property of: related endeavour
issued: 2005-07-15
inverse of: revision
change note: Added isDefinedBy property referring to FRBR core namespace
  creator: Ian Davis
  date: 2005-08-08
change note: Added definition
  creator: Ian Davis
  date: 2005-08-09
definition: An expression that is revised.
history note: Added domain and range of Expression
  creator: Ian Davis
  date: 2005-08-10

adaption of
type: ObjectProperty
domain: Class
  union of: work
  union of: expression
range: Class
  union of: work
  union of: expression
sub property of: related endeavour
issued: 2005-07-15
inverse of: adaption
change note: Added definition
  creator: Ian Davis
  date: 2005-08-09
change note: Added isDefinedBy property referring to FRBR core namespace
  creator: Ian Davis
  date: 2005-08-08
definition: A work or expression that is adapted.
history note: Added domain and range of Work or Expression
  creator: Ian Davis
  date: 2005-08-10

scholarly work
type: Class
subclass of: work
issued: 2005-10-14

Bruce D'Arcus
type: Person

classical work
type: Class
subclass of: work
issued: 2005-10-14

Expression of Core FRBR Concepts in RDF
type: Ontology
comment: This vocabulary is an expression in RDF of the concepts and relations described in the IFLA report on the Functional Requirements for Bibliographic Records (FRBR).
comment: This vocabulary is a work in progress, it includes RDF classes for the group 1, 2 and 3 entities described by the FRBR report and properties corresponding to the core relationships between those entities. It does not yet describe attributes of the entities. Where possible, appropriate relationships with other vocabularies are included in order to place this vocabulary in the context of existing RDF work.
contributor: Bruce D'Arcus
creator: Ian Davis
creator: Richard Newman
date: 2009-05-16
rights: Copyright © 2005 Richard Newman and Ian Davis
is version of: core#
issued: 2005-07-15
replaces: frbr-core-20050809
preferred namespace prefix: frbr
preferred namespace uri: http://purl.org/vocab/frbr/core#
change note: Various minor tidying tasks
  creator: Ian Davis
  date: 2009-05-16
example: frbr-example-film-20050809.html
history note: Added type hierarchy
  creator: Ian Davis
  date: 2005-10-14

item
type: Class
comment: This class corresponds to the FRBR group one entity 'Item'.
subclass of: endeavour
issued: 2005-07-15
disjoint with: manifestation
disjoint with: work
disjoint with: expression
change note: Extracted definition from existing comment
  creator: Ian Davis
  date: 2005-08-09
change note: Added isDefinedBy property referring to FRBR core namespace
  creator: Ian Davis
  date: 2005-08-08
change note: Added comment
  creator: Ian Davis
  date: 2005-08-08
definition: An exemplar of a single manifestation.
history note: Removed subclass of geo:SpatialThing
  creator: Ian Davis
  date: 2005-08-10
history note: Made subclass of geo:SpatialThing
  creator: Ian Davis
  date: 2005-08-08

owner
type: ObjectProperty
domain: item
range: responsible entity
sub property of: responsible entity
issued: 2005-07-15
inverse of: owner of
change note: Added isDefinedBy property referring to FRBR core namespace
  creator: Ian Davis
  date: 2005-08-08
change note: Added definition
  creator: Ian Davis
  date: 2005-08-09
definition: An entity that owns an item.

legal work
type: Class
subclass of: work
issued: 2005-10-14

summarization of
type: ObjectProperty
domain: Class
  union of: work
  union of: expression
range: Class
  union of: work
  union of: expression
sub property of: related endeavour
issued: 2005-07-15
inverse of: summarization
change note: Added isDefinedBy property referring to FRBR core namespace
  creator: Ian Davis
  date: 2005-08-08
change note: Added definition
  creator: Ian Davis
  date: 2005-08-09
definition: A work or expression that is summarized.
history note: Added domain and range of Work or Expression
  creator: Ian Davis
  date: 2005-08-10

reproduction
type: ObjectProperty
domain: a manifestation or an item
  type: Class
  union of: manifestation
  union of: item
range: a manifestation or an item
  type: Class
  union of: manifestation
  union of: item
sub property of: related endeavour
issued: 2005-07-15
inverse of: reproduction of
change note: Added definition
  creator: Ian Davis
  date: 2005-08-09
change note: Added isDefinedBy property referring to FRBR core namespace
  creator: Ian Davis
  date: 2005-08-08
definition: A reproduction of a manifestation or item.
history note: Added domain and range of Manifestation or Item
  creator: Ian Davis
  date: 2005-08-10

responsible entity of
type: ObjectProperty
domain: responsible entity
range: endeavour
issued: 2005-07-15
inverse of: responsible entity
change note: Added isDefinedBy property referring to FRBR core namespace
  creator: Ian Davis
  date: 2005-08-08
change note: Added definition
  creator: Ian Davis
  date: 2005-08-09
definition: An endeavour that is the responsibility of an entity.

related endeavour
type: ObjectProperty
domain: endeavour
range: endeavour
issued: 2005-07-15
change note: Added definition
  creator: Ian Davis
  date: 2005-08-09
change note: Added isDefinedBy property referring to FRBR core namespace
  creator: Ian Davis
  date: 2005-08-08
definition: Another endeavour that is related in some way to an endeavour.

responsible entity
type: Class
comment: This class represents any of the FRBR group two entities.
issued: 2005-07-15
disjoint with: endeavour
disjoint with: subject
equivalent class: the union of all people and corporate bodies
  type: Class
  union of: corporate body
  union of: Person
change note: Added comment
  creator: Ian Davis
  date: 2005-08-08
change note: Added isDefinedBy property referring to FRBR core namespace
  creator: Ian Davis
  date: 2005-08-08
change note: Extracted definition from existing comment
  creator: Ian Davis
  date: 2005-08-09
definition: One responsible for the creation, production, distribution or maintenance of artistic or creative content.

HTML
type: Document
type: Text
format: text/html

arrangement of
type: ObjectProperty
domain: expression
range: expression
sub property of: related endeavour
issued: 2005-07-15
inverse of: arrangement
change note: Added definition
  creator: Ian Davis
  date: 2005-08-09
change note: Added isDefinedBy property referring to FRBR core namespace
  creator: Ian Davis
  date: 2005-08-08
definition: An expression that is arranged.
history note: Added domain and range of Expression
  creator: Ian Davis
  date: 2005-08-10

owner of
type: ObjectProperty
domain: responsible entity
range: item
sub property of: responsible entity of
issued: 2005-07-15
inverse of: owner
change note: Added isDefinedBy property referring to FRBR core namespace
  creator: Ian Davis
  date: 2005-08-08
change note: Added definition
  creator: Ian Davis
  date: 2005-08-09
definition: An item that is in some way owned an entity.

summarization
type: ObjectProperty
domain: Class
  union of: work
  union of: expression
range: Class
  union of: work
  union of: expression
sub property of: related endeavour
issued: 2005-07-15
inverse of: summarization of
change note: Added definition
  creator: Ian Davis
  date: 2005-08-09
change note: Added isDefinedBy property referring to FRBR core namespace
  creator: Ian Davis
  date: 2005-08-08
definition: A summarization of a work or expression.
history note: Added domain and range of Work or Expression
  creator: Ian Davis
  date: 2005-08-10

abridgement
type: ObjectProperty
domain: expression
range: expression
sub property of: related endeavour
issued: 2005-07-15
inverse of: abridgement of
change note: Added isDefinedBy property referring to FRBR core namespace
  creator: Ian Davis
  date: 2005-08-08
change note: Added definition
  creator: Ian Davis
  date: 2005-08-09
definition: An abridgment of an expression.
history note: Added domain and range of Expression
  creator: Ian Davis
  date: 2005-08-10

responsible entity
type: ObjectProperty
domain: endeavour
range: responsible entity
issued: 2005-07-15
inverse of: responsible entity of
change note: Added definition
  creator: Ian Davis
  date: 2005-08-09
change note: Added isDefinedBy property referring to FRBR core namespace
  creator: Ian Davis
  date: 2005-08-08
definition: An entity in some way responsible for an endeavour.

exemplar of
type: ObjectProperty
domain: item
range: manifestation
sub property of: related endeavour
issued: 2005-07-15
inverse of: exemplar
change note: Added isDefinedBy property referring to FRBR core namespace
  creator: Ian Davis
  date: 2005-08-08
change note: Added definition
  creator: Ian Davis
  date: 2005-08-09
definition: The manifestation that is exemplified by a item.

text
type: Class
subclass of: expression
issued: 2005-10-14

part of
type: ObjectProperty
sub property of: related endeavour
issued: 2005-07-15
inverse of: part
change note: Added definition
  creator: Ian Davis
  date: 2005-08-09
change note: Added isDefinedBy property referring to FRBR core namespace
  creator: Ian Davis
  date: 2005-08-08
definition: An endeavour incorporating an endeavour.

adaption
type: ObjectProperty
domain: Class
  union of: work
  union of: expression
range: Class
  union of: work
  union of: expression
sub property of: related endeavour
issued: 2005-07-15
inverse of: adaption of
change note: Added definition
  creator: Ian Davis
  date: 2005-08-09
change note: Added isDefinedBy property referring to FRBR core namespace
  creator: Ian Davis
  date: 2005-08-08
definition: An adaption of a work or expression.
history note: Added domain and range of Work or Expression
  creator: Ian Davis
  date: 2005-08-10

imitation of
type: ObjectProperty
domain: Class
  union of: work
  union of: expression
range: Class
  union of: work
  union of: expression
sub property of: related endeavour
issued: 2005-07-15
inverse of: imitation
change note: Added definition
  creator: Ian Davis
  date: 2005-08-09
change note: Added isDefinedBy property referring to FRBR core namespace
  creator: Ian Davis
  date: 2005-08-08
definition: A work or expression that is imitated.
history note: Added domain and range of Work or Expression
  creator: Ian Davis
  date: 2005-08-10

abridgement of
type: ObjectProperty
domain: expression
range: expression
sub property of: related endeavour
issued: 2005-07-15
inverse of: abridgement
change note: Added definition
  creator: Ian Davis
  date: 2005-08-09
change note: Added isDefinedBy property referring to FRBR core namespace
  creator: Ian Davis
  date: 2005-08-08
definition: An expression that is abridged.
history note: Added domain and range of Expression
  creator: Ian Davis
  date: 2005-08-10

creator
type: ObjectProperty
domain: work
range: responsible entity
sub property of: responsible entity
issued: 2005-07-15
inverse of: creator of
change note: Added isDefinedBy property referring to FRBR core namespace
  creator: Ian Davis
  date: 2005-08-08
change note: Added definition
  creator: Ian Davis
  date: 2005-08-09
definition: An entity in some way responsible for the creation of a work.

complement
type: ObjectProperty
domain: Class
  union of: work
  union of: expression
range: Class
  union of: work
  union of: expression
sub property of: related endeavour
issued: 2005-07-15
inverse of: complement of
change note: Added definition
  creator: Ian Davis
  date: 2005-08-09
change note: Added isDefinedBy property referring to FRBR core namespace
  creator: Ian Davis
  date: 2005-08-08
definition: A complement to a work or expression.
history note: Added domain and range of Work or Expression
  creator: Ian Davis
  date: 2005-08-10

reconfiguration of
type: ObjectProperty
domain: item
range: item
sub property of: related endeavour
issued: 2005-08-10
inverse of: reconfiguration
definition: An item that is reconfigured.

transformation of
type: ObjectProperty
domain: Class
  union of: work
  union of: expression
range: Class
  union of: work
  union of: expression
sub property of: related endeavour
issued: 2005-07-15
inverse of: transformation
change note: Added definition
  creator: Ian Davis
  date: 2005-08-09
change note: Added isDefinedBy property referring to FRBR core namespace
  creator: Ian Davis
  date: 2005-08-08
definition: A work or expression that is transformed.
history note: Added domain and range of Work or Expression
  creator: Ian Davis
  date: 2005-08-10

corporate body
type: Class
comment: This class corresponds to the FRBR group two entity 'Corporate Body'.
subclass of: responsible entity
issued: 2005-07-15
equivalent class: the union of all organizations and groups
  type: Class
  union of: Organization
  union of: Group
change note: Extracted definition from existing comment
  creator: Ian Davis
  date: 2005-08-09
change note: Added comment
  creator: Ian Davis
  date: 2005-08-08
change note: Added isDefinedBy property referring to FRBR core namespace
  creator: Ian Davis
  date: 2005-08-08
definition: An organization or group of individuals and/or other organizations.

Turtle
type: Document
type: Text
format: text/plain

supplement of
type: ObjectProperty
domain: Class
  union of: work
  union of: expression
range: Class
  union of: work
  union of: expression
sub property of: related endeavour
issued: 2005-07-15
inverse of: supplement
change note: Added definition
  creator: Ian Davis
  date: 2005-08-09
change note: Added isDefinedBy property referring to FRBR core namespace
  creator: Ian Davis
  date: 2005-08-08
definition: A work or expression that is supplemented.
history note: Added domain and range of Work or Expression
  creator: Ian Davis
  date: 2005-08-10

reproduction of
type: ObjectProperty
domain: a manifestation or an item
  type: Class
  union of: manifestation
  union of: item
range: a manifestation or an item
  type: Class
  union of: manifestation
  union of: item
sub property of: related endeavour
issued: 2005-07-15
inverse of: reproduction
change note: Added isDefinedBy property referring to FRBR core namespace
  creator: Ian Davis
  date: 2005-08-08
change note: Added definition
  creator: Ian Davis
  date: 2005-08-09
definition: A manifestation or item that is reproduced.
history note: Added domain and range of Manifestation or Item
  creator: Ian Davis
  date: 2005-08-10

part
type: ObjectProperty
sub property of: related endeavour
issued: 2005-07-15
inverse of: part of
change note: Added definition
  creator: Ian Davis
  date: 2005-08-09
change note: Added isDefinedBy property referring to FRBR core namespace
  creator: Ian Davis
  date: 2005-08-08
definition: A part of an endeavour.

producer of
type: ObjectProperty
domain: responsible entity
range: manifestation
sub property of: responsible entity of
issued: 2005-07-15
inverse of: producer
change note: Added definition
  creator: Ian Davis
  date: 2005-08-09
change note: Added isDefinedBy property referring to FRBR core namespace
  creator: Ian Davis
  date: 2005-08-08
definition: A manifestation that was in some way produced an entity.

successor
type: ObjectProperty
domain: Class
  union of: work
  union of: expression
range: Class
  union of: work
  union of: expression
sub property of: related endeavour
issued: 2005-07-15
inverse of: successor of
change note: Added definition
  creator: Ian Davis
  date: 2005-08-09
change note: Added isDefinedBy property referring to FRBR core namespace
  creator: Ian Davis
  date: 2005-08-08
definition: A successor to a work or expression.
history note: Added domain and range of Work or Expression
  creator: Ian Davis
  date: 2005-08-10

object
type: Class
comment: This class corresponds to the FRBR group three entity 'Object'.
subclass of: SpatialThing
subclass of: subject
issued: 2005-07-15
disjoint with: place
disjoint with: event
disjoint with: concept
change note: Added comment
  creator: Ian Davis
  date: 2005-08-08
change note: Extracted definition from existing comment
  creator: Ian Davis
  date: 2005-08-09
change note: Added isDefinedBy property referring to FRBR core namespace
  creator: Ian Davis
  date: 2005-08-08
definition: A tangible or material thing.
history note: Made subclass of geo:SpatialThing
  creator: Ian Davis
  date: 2005-08-08

exemplar
type: ObjectProperty
domain: manifestation
range: item
sub property of: related endeavour
issued: 2005-07-15
inverse of: exemplar of
change note: Added isDefinedBy property referring to FRBR core namespace
  creator: Ian Davis
  date: 2005-08-08
change note: Added definition
  creator: Ian Davis
  date: 2005-08-09
definition: An item that is an exemplar of a manifestation.

transformation
type: ObjectProperty
domain: Class
  union of: work
  union of: expression
range: Class
  union of: work
  union of: expression
sub property of: related endeavour
issued: 2005-07-15
inverse of: transformation of
change note: Added definition
  creator: Ian Davis
  date: 2005-08-09
change note: Added isDefinedBy property referring to FRBR core namespace
  creator: Ian Davis
  date: 2005-08-08
definition: A transformation of a work or expression.
history note: Added domain and range of Work or Expression
  creator: Ian Davis
  date: 2005-08-10

image
type: Class
subclass of: expression
issued: 2005-10-14

data
type: Class
subclass of: expression
issued: 2005-10-14

successor of
type: ObjectProperty
domain: Class
  union of: work
  union of: expression
range: Class
  union of: work
  union of: expression
sub property of: related endeavour
issued: 2005-07-15
inverse of: successor
change note: Added definition
  creator: Ian Davis
  date: 2005-08-09
change note: Added isDefinedBy property referring to FRBR core namespace
  creator: Ian Davis
  date: 2005-08-08
definition: A work or expression that is succeeded.
history note: Added domain and range of Work or Expression
  creator: Ian Davis
  date: 2005-08-10

realizer of
type: ObjectProperty
domain: responsible entity
range: expression
sub property of: responsible entity of
issued: 2005-07-15
inverse of: realizer
change note: Added isDefinedBy property referring to FRBR core namespace
  creator: Ian Davis
  date: 2005-08-08
change note: Added definition
  creator: Ian Davis
  date: 2005-08-09
definition: An expression that was in some way realized by an entity.

realization
type: ObjectProperty
domain: work
range: expression
sub property of: related endeavour
issued: 2005-07-15
inverse of: realization of
change note: Added isDefinedBy property referring to FRBR core namespace
  creator: Ian Davis
  date: 2005-08-08
change note: Added definition
  creator: Ian Davis
  date: 2005-08-09
definition: An expression that is an intellectual or artistic realization of a work.

supplement
type: ObjectProperty
domain: Class
  union of: work
  union of: expression
range: Class
  union of: work
  union of: expression
sub property of: related endeavour
issued: 2005-07-15
inverse of: supplement of
change note: Added isDefinedBy property referring to FRBR core namespace
  creator: Ian Davis
  date: 2005-08-08
change note: Added definition
  creator: Ian Davis
  date: 2005-08-09
definition: A supplement to a work or expression.
history note: Added domain and range of Work or Expression
  creator: Ian Davis
  date: 2005-08-10

person
type: Class
comment: This class corresponds to the FRBR group two entity 'Person'.
issued: 2005-08-08
disjoint with: subject
disjoint with: endeavour
equivalent class: Person
change note: Extracted definition from existing comment
  creator: Ian Davis
  date: 2005-08-09
change note: Added comment
  creator: Ian Davis
  date: 2005-08-08
change note: Added isDefinedBy property referring to FRBR core namespace
  creator: Ian Davis
  date: 2005-08-08
definition: A living or dead individual.

place
type: Class
comment: This class corresponds to the FRBR group three entity 'Place'.
subclass of: SpatialThing
subclass of: subject
issued: 2005-07-15
disjoint with: concept
disjoint with: object
disjoint with: event
change note: Added isDefinedBy property referring to FRBR core namespace
  creator: Ian Davis
  date: 2005-08-08
change note: Added comment
  creator: Ian Davis
  date: 2005-08-08
change note: Extracted definition from existing comment
  creator: Ian Davis
  date: 2005-08-09
definition: A location.
history note: Made subclass of geo:SpatialThing
  creator: Ian Davis
  date: 2005-08-08

imitation
type: ObjectProperty
domain: Class
  union of: work
  union of: expression
range: Class
  union of: work
  union of: expression
sub property of: related endeavour
issued: 2005-07-15
inverse of: imitation of
change note: Added isDefinedBy property referring to FRBR core namespace
  creator: Ian Davis
  date: 2005-08-08
change note: Added definition
  creator: Ian Davis
  date: 2005-08-09
definition: An imitation of a work or expression.
history note: Added domain and range of Work or Expression
  creator: Ian Davis
  date: 2005-08-10

embodiment
type: ObjectProperty
domain: expression
range: manifestation
sub property of: related endeavour
issued: 2005-07-15
inverse of: embodiment of
change note: Added isDefinedBy property referring to FRBR core namespace
  creator: Ian Davis
  date: 2005-08-08
change note: Added definition
  creator: Ian Davis
  date: 2005-08-09
definition: A manifestation that embodies an expression.

moving image
type: Class
subclass of: expression
issued: 2005-10-14

reconfiguration
type: ObjectProperty
domain: item
range: item
sub property of: related endeavour
issued: 2005-08-10
inverse of: reconfiguration of
definition: A recongifuration of an item.

event
type: Class
comment: This class corresponds to the FRBR group three entity 'Event'.
subclass of: subject
subclass of: Event
issued: 2005-07-15
disjoint with: concept
disjoint with: object
disjoint with: place
change note: Extracted definition from existing comment
  creator: Ian Davis
  date: 2005-08-09
change note: Added comment
  creator: Ian Davis
  date: 2005-08-08
definition: An action or occurrence.
history note: Made subclass of owltime:Event
  creator: Ian Davis
  date: 2005-08-08

alternate
type: ObjectProperty
domain: manifestation
range: manifestation
sub property of: related endeavour
issued: 2005-08-10
inverse of: alternate of
definition: An alternative to a manifestation.

Ian Davis
type: Person

endeavour
type: Class
comment: This class represents any one of the FRBR group one entities.
issued: 2005-07-15
disjoint with: responsible entity
disjoint with: subject
equivalent class: the union of all expressions, items, manifestations and works
  type: Class
  union of: expression
  union of: item
  union of: manifestation
  union of: work
change note: Added comment
  creator: Ian Davis
  date: 2005-08-08
change note: Added isDefinedBy property referring to FRBR core namespace
  creator: Ian Davis
  date: 2005-08-08
change note: Extracted definition from existing comment
  creator: Ian Davis
  date: 2005-08-09
definition: Any of the products of artistic or creative endeavour.

translation
type: ObjectProperty
domain: expression
range: expression
sub property of: related endeavour
issued: 2005-07-15
inverse of: translation of
change note: Added definition
  creator: Ian Davis
  date: 2005-08-09
change note: Added isDefinedBy property referring to FRBR core namespace
  creator: Ian Davis
  date: 2005-08-08
definition: A translation of an expression.
history note: Added domain and range of Expression
  creator: Ian Davis
  date: 2005-08-10

concept
type: Class
comment: This class corresponds to the FRBR group three entity 'Concept'.
subclass of: subject
subclass of: Concept
issued: 2005-07-15
disjoint with: place
disjoint with: object
disjoint with: event
change note: Added isDefinedBy property referring to FRBR core namespace
  creator: Ian Davis
  date: 2005-08-08
change note: Added comment
  creator: Ian Davis
  date: 2005-08-08
change note: Extracted definition from existing comment
  creator: Ian Davis
  date: 2005-08-09
definition: An abstract idea or notion.
history note: Made subclass of skos:Concept
  creator: Ian Davis
  date: 2005-08-08

manifestation
type: Class
comment: This class corresponds to the FRBR group one entity 'Manifestation'.
subclass of: endeavour
issued: 2005-07-15
disjoint with: work
disjoint with: expression
disjoint with: item
change note: Added comment
  creator: Ian Davis
  date: 2005-08-08
change note: Added isDefinedBy property referring to FRBR core namespace
  creator: Ian Davis
  date: 2005-08-08
change note: Extracted definition from existing comment
  creator: Ian Davis
  date: 2005-08-09
definition: The physical embodiment of one or more expressions.

embodiment of
type: ObjectProperty
domain: manifestation
range: expression
sub property of: related endeavour
issued: 2005-07-15
inverse of: embodiment
change note: Added isDefinedBy property referring to FRBR core namespace
  creator: Ian Davis
  date: 2005-08-08
change note: Added definition
  creator: Ian Davis
  date: 2005-08-09
definition: An expression that is embodied by a manifestation.

revision
type: ObjectProperty
domain: expression
range: expression
sub property of: related endeavour
issued: 2005-07-15
inverse of: revision of
change note: Added definition
  creator: Ian Davis
  date: 2005-08-09
change note: Added isDefinedBy property referring to FRBR core namespace
  creator: Ian Davis
  date: 2005-08-08
definition: A revision of an expression.
history note: Added domain and range of Expression
  creator: Ian Davis
  date: 2005-08-10

producer
type: ObjectProperty
domain: manifestation
range: responsible entity
sub property of: responsible entity
issued: 2005-07-15
inverse of: producer of
change note: Added isDefinedBy property referring to FRBR core namespace
  creator: Ian Davis
  date: 2005-08-08
change note: Added definition
  creator: Ian Davis
  date: 2005-08-09
definition: An entity in some way responsible for producing a manifestation.

subject
type: Class
comment: This class represents any of the FRBR group three entities.
issued: 2005-07-15
disjoint with: endeavour
disjoint with: responsible entity
equivalent class: the union of all events, objects, places and concepts
  type: Class
  union of: event
  union of: object
  union of: place
  union of: concept
change note: Added comment
  creator: Ian Davis
  date: 2005-08-08
change note: Extracted definition from existing comment
  creator: Ian Davis
  date: 2005-08-09
change note: Added isDefinedBy property referring to FRBR core namespace
  creator: Ian Davis
  date: 2005-08-08
definition: Something that may serve as the subject of a work.

complement of
type: ObjectProperty
domain: Class
  union of: work
  union of: expression
range: Class
  union of: work
  union of: expression
sub property of: related endeavour
issued: 2005-07-15
inverse of: complement
change note: Added definition
  creator: Ian Davis
  date: 2005-08-09
change note: Added isDefinedBy property referring to FRBR core namespace
  creator: Ian Davis
  date: 2005-08-08
definition: A work or expression that is complemented.
history note: Added domain and range of Work or Expression
  creator: Ian Davis
  date: 2005-08-10

alternate of
type: ObjectProperty
domain: manifestation
range: manifestation
sub property of: related endeavour
issued: 2005-08-10
inverse of: alternate
definition: A manifestation that is alternated.

literary work
type: Class
subclass of: work
issued: 2005-10-14

performance
type: Class
subclass of: expression
issued: 2005-10-14

creator of
type: ObjectProperty
domain: responsible entity
range: work
sub property of: responsible entity of
issued: 2005-07-15
inverse of: creator
change note: Added isDefinedBy property referring to FRBR core namespace
  creator: Ian Davis
  date: 2005-08-08
change note: Added definition
  creator: Ian Davis
  date: 2005-08-09
definition: A work that was in some way created by of an entity.

translation of
type: ObjectProperty
domain: expression
range: expression
sub property of: related endeavour
issued: 2005-07-15
inverse of: translation
change note: Added definition
  creator: Ian Davis
  date: 2005-08-09
change note: Added isDefinedBy property referring to FRBR core namespace
  creator: Ian Davis
  date: 2005-08-08
definition: An expression that is translated.
history note: Added domain and range of Expression
  creator: Ian Davis
  date: 2005-08-10

work
type: Class
comment: This class corresponds to the FRBR group one entity 'Work'.
subclass of: endeavour
subclass of: Work~2
issued: 2005-07-15
disjoint with: manifestation
disjoint with: expression
disjoint with: item
change note: Added isDefinedBy property referring to FRBR core namespace
  creator: Ian Davis
  date: 2005-08-08
change note: Added comment
  creator: Ian Davis
  date: 2005-08-08
change note: Extracted definition from existing comment
  creator: Ian Davis
  date: 2005-08-09
definition: An abstract notion of an artistic or intellectual creation.
history note: Made subclass of wordnet:Work~2
  creator: Ian Davis
  date: 2005-08-08

realizer
type: ObjectProperty
domain: expression
range: responsible entity
sub property of: responsible entity
issued: 2005-07-15
inverse of: realizer of
change note: Added definition
  creator: Ian Davis
  date: 2005-08-09
change note: Added isDefinedBy property referring to FRBR core namespace
  creator: Ian Davis
  date: 2005-08-08
definition: An entity in some way responsible for realizing an expression.

realization of
type: ObjectProperty
domain: expression
range: work
sub property of: related endeavour
issued: 2005-07-15
inverse of: realization
change note: Added isDefinedBy property referring to FRBR core namespace
  creator: Ian Davis
  date: 2005-08-08
change note: Added definition
  creator: Ian Davis
  date: 2005-08-09
definition: The work that has been realized by an expression.

expression
type: Class
comment: This class corresponds to the FRBR group one entity 'Expression'.
subclass of: endeavour
issued: 2005-07-15
disjoint with: manifestation
disjoint with: work
disjoint with: item
change note: Extracted definition from existing comment
  creator: Ian Davis
  date: 2005-08-09
change note: Added comment
  creator: Ian Davis
  date: 2005-08-08
change note: Added isDefinedBy property referring to FRBR core namespace
  creator: Ian Davis
  date: 2005-08-08
definition: A realization of a single work usually in a physical form.

JSON
type: Document
type: Text
format: application/json

arrangement
type: ObjectProperty
domain: expression
range: expression
sub property of: related endeavour
issued: 2005-07-15
inverse of: arrangement of
change note: Added definition
  creator: Ian Davis
  date: 2005-08-09
change note: Added isDefinedBy property referring to FRBR core namespace
  creator: Ian Davis
  date: 2005-08-08
definition: An arrangement of an expression.
history note: Added domain and range of Expression
  creator: Ian Davis
  date: 2005-08-10

sound
type: Class
subclass of: expression
issued: 2005-10-14

subject
type: ObjectProperty
domain: work
range: Class
  union of: endeavour
  union of: responsible entity
  union of: subject
issued: 2005-07-15
change note: Added definition
  creator: Ian Davis
  date: 2005-08-09
change note: Added isDefinedBy property referring to FRBR core namespace
  creator: Ian Davis
  date: 2005-08-08
definition: The subject of a work.