financial entity
type: Class
comment: An entity primarily to do with money.
subclass of: Thing

is donated by
type: ObjectProperty
comment: An object property linking a gift to the benefactor who provided it.
range: Agent
description: Domain constraints have been removed from this object property to permit it to be used in unforeseen ways.
inverse of: donates

annual turnover
type: Class
comment: The anual financial turnover of an organization (in a specified currency).
subclass of: financial entity

stipend
type: Class
comment: A sum of money allotted on a regular basis, usually for some specific purpose.
subclass of: funding

data repository
type: Class
comment: A facility in which digital data are deposited for long-term preservation and (optional) publication.
subclass of: repository
description: May also be described as a data archive, or as a database.

admission application
type: Class
comment: The activity of applying for admission to some group or institution, for example a learned society or a university.
subclass of: application

has milestone
type: DatatypeProperty
comment: A data property that permits one to define a significant event (a 'milestone') in the progress of a project.

service costs
type: budget category
type: NamedIndividual
comment: A budget category to cover the costs of services used by a project, for example a DNA sequencing service, or an equipment maintenance service.

has serial number
type: DatatypeProperty
comment: A data property linking something, for example a piece of equipment, to its serial number.
sub property of: identifier

tender
type: Class
comment: Sealed bid or offer document submitted in response to a request for tenders, containing detailed information on costs, requirements and terms associated with a potential contract. (Adapted from http://www.businessdictionary.com/definition/tender.html).
subclass of: financial entity

has cost
type: DatatypeProperty
comment: A data property enabling the cost of something that can be paid for to be defined.

has expiry date
type: FunctionalProperty
type: DatatypeProperty
comment: A data property linking something, for example a drug, to its expiry date, beyond which the manufacture recommends that it should not be used.
range: dateTime
sub property of: date

host institution
type: Class
comment: An institution that acts as a host, for example of a project or a person.
subclass of: Organization

not-for-profit organization
type: Class
comment: An organization that does not primarily exist to make profit, for example a charity or charitable foundation, a learned society, or a standards body such as the World Wide Web Consortium.
subclass of: Organization

has postal address
type: DatatypeProperty
comment: A data property identifying a postal address for an agent.
sub property of: has information

is owned by
type: ObjectProperty
comment: An object property linking an entity to the agent that owns it.
range: Agent
inverse of: owns

is employed by
type: ObjectProperty
comment: An object property relating an employed agent, typically a person or an organization, to an employing agent.
domain: Agent
range: Agent
sub property of: topObjectProperty
description: This property should not be used for the other meaning of 'employ', meaning to use something, e.g. 'Great skill is employed by master craftsmen . . .'/
inverse of: employs

employs
type: ObjectProperty
comment: An object property relating an employing agent to an employed agent, for example a person or an organization, who is typically employed to undertaking specified work in exchange for payment.
domain: Agent
range: Agent
description: This property should not be used for the other meaning of 'employ', meaning to use something, e.g. 'He employed great skill . . .'/

service contract fee
type: Class
comment: A fee paid periodically, typically annually, to obtain access when required to a service such as an equipment maintenance contract."
subclass of: fee

family name initial
type: DatatypeProperty
comment: A data property permitting specification of the initial(s) of a person's family name.
sub property of: initials

has expertise
type: DatatypeProperty
comment: A data property identifying the area(s) of expertise and skills posessed by an individual or an organization.
sub property of: has information

has value
type: DatatypeProperty
comment: A data property enabling one to specify the monetary value of a financial entity such as a grant, a gift or a budget category. Use in conjuction with frapo:hasCurrency.

building costs
type: budget category
type: NamedIndividual
comment: A budget category to cover the costs of constructing, renovating or modifying a physical building.

status
type: Class
comment: The status of something such as an application, an investigation or a project.
subclass of: Thing

has country
type: DatatypeProperty
comment: A data property specifying a country, for example as the location of an event.

spin-off company
type: Class
comment: A company that has been established by a university or research institute to mature and market the results of research conducted at that research institution.
subclass of: company

is funded by
type: ObjectProperty
comment: An object property linking something to the funding that funds it (i.e. that finances or pays for it), or to the funding agency providing that funding. This flexibility is given because of alternative usages of the English word 'funds'. [See also frapo:isAwardedBy and frapo:hasFundingAgency and frapo:isSupportedBy.]
sub property of: is supported by

bursary
type: Class
comment: An amount of money given to a person by an organization, for example by a university to a university student in need to enable that student to continue his/her studies.
subclass of: funding

has currency code
type: DatatypeProperty
comment: A data property specifying the three-letter currency code used to identify a currency, as defined by ISO 4217 (e.g. EUR or GBP) (see http://en.wikipedia.org/wiki/ISO_4217). Not to be confused with the symbol used with numbers to denote an amount of money in a particular currency (e.g.€500; £3.40)
sub property of: has code

funds
type: ObjectProperty
comment: An object property that links a grant to something that it funds (i.e. that it finances or pays for), or that links an agent providing funding to something that it funds. This flexibility is given because of alternative usages of the English word 'funds'. [See also frapo:awards and frapo:supports.]
sub property of: supports
inverse of: is funded by

purchaser
type: Class
comment: An agent who purchases something from a supplier.
subclass of: Agent

has completion date
type: FunctionalProperty
type: DatatypeProperty
comment: A data property linking something such as a building or a contract to its date of completion.
range: dateTime
sub property of: date

library
type: Class
comment: A facility in which printed documents (for example books and journals) are deposited for long-term preservation and access.
subclass of: repository

contract
type: Class
comment: A legally binding agreement between parties.
subclass of: financial entity

unfunded
type: status
type: NamedIndividual
comment: The status of something such as an investigation or a project as being unfunded.

investigation
type: Class
comment: An investigation is an endeavour that involves research, enabled by a project. The investigation relate to the scholarly and practical aspects of conducting the research itself, including the hypotheses being investigated, the experiments being undertaken, the data being gathered and analysed, the interpretations being drawn from the data, and the results obtained. In contrast, the project that enables it encompasses the administrative aspects of undertaking the endeavour, including the funding obtained, the people employed, and the management of the project in terms of deadlines and deliverables.
subclass of: endeavour
description: Equivalent class in ISA-RDF: 'Investigation'.

document repository
type: Class
comment: A facility in which digital documents are deposited for long-term preservation and (optional) publication.
subclass of: repository
description: May also be described as a document archive, or a digital library.

has application deadline
type: FunctionalProperty
type: DatatypeProperty
type: AnnotationProperty
comment: The date by which an application, for example a job application, a fellowship application or a grant application, has to be submitted if it is to be considered for acceptance or funding.
domain: application
range: dateTime
sub property of: date
description: owl:equivalentProperty fabio:hasApplicationDeadline .

has fax number
type: DatatypeProperty
comment: A data property identifying a Fax number for an agent.
sub property of: has information

has acronym
type: DatatypeProperty
comment: A data property linking an entity to an acronym used to identify it, based on its full name or title. For example, this ontology has the full name 'Funding, Research Administration and Projects Ontology' and the acronym 'FRAPO'.

publishing costs
type: budget category
type: NamedIndividual
comment: A budget category to cover the cost of publishing outpots from a project, for example author fees for journal articles in an open access journal.

submits
type: ObjectProperty
comment: An object property linking an agent to an entity that is submitted to some third party, for example a grant application submitted to a funding agency, a manuscript submitted to a publisher, a quotation submitted by a vendor, or a dataset submitted by a researcher to a data repository.
domain: Agent

specifies expenditure
type: ObjectProperty
comment: An object property relating an agent or a budget to the expenditure specified by that agent or budget.
domain: Class
  union of: budget
  union of: Agent
description: Range constraints have been removed from this object property to permit it to be used in unforeseen ways.

studentship
type: Class
comment: A financial grant to a student to enable him/her to undertake advanced academic study.
subclass of: stipend

has invoice date
type: FunctionalProperty
type: DatatypeProperty
type: AnnotationProperty
comment: A data property linking an invoice to its date.
domain: invoice
range: date
sub property of: date

is supplied by
type: ObjectProperty
comment: An object property relating an entity that is supplied, or an agent to whom an entity is supplied, to the supplier.
range: supplier
inverse of: supplies

has quotation date
type: DatatypeProperty
comment: A data property linking a quotation to its date.
range: dateTime
sub property of: date

contributions in kind
type: budget category
type: NamedIndividual
comment: A budget category to categorize the financial worth of contributions in kind (e.g. staff effort, access to facilities, sharing of know-how) given to a project by an agent, for example by the host institution or by a commerical partner in an academic project.

has contact information
type: DatatypeProperty
comment: A data property linking a person to information about that person.
domain: Person
sub property of: has information

investment
type: Class
comment: An investment of money, generally in stocks and shares, or in property, for the purpose of safeguarding the capital and yielding an income.
subclass of: financial entity

supports
type: ObjectProperty
comment: An object property linking an agent to something that the agent supports by financial or other means.
domain: Class
  union of: funding
  union of: Agent
description: This property is not intended for use to describe mechanical or physical support, as in 'The plinth supports the statue'.

registration authority
type: Class
comment: An agency with responsibility for registering and maintaining international standards, internet domain names, patents, controlled vocabularies and other similar entities required for reliable international cooperatative activities.
subclass of: Organization

endeavour
type: Class
comment: In FRAPO, an endeavour is an activity such as a research investigation that is enabled by a project. An endeavour relate to the academic and practical aspects of undertaking that endeavour - thus for a research investigation the research itself, including the hypotheses being investigated, the experiments being undertaken, the data being gathered and analysed, the interpretations being drawn from the data, and the results obtained. In contrast, the project relates to the administrative aspects of undertaking an endeavour, including the funding obtained, the people employed, and the management of the project in terms of deadlines and deliverables.
subclass of: Thing

material output
type: Class
comment: A material or physical output created or produced as a result of a project or an endeavour such as a research investigation. Examples include a building constructed as a result of a building project, and research outputs such as a cell line, a mouse mutant or a new form of microscope.
subclass of: output

is awarded by
type: FunctionalProperty
type: ObjectProperty
comment: An object property linking something awarded to the agent making the award, for example linking a grant to a funding agency, a degree to a university, or a prize to the awarding organization.
range: Agent
description: Domain constraints have been removed from this object property to permit it to be used in unforeseen ways.
inverse of: awards

funding
type: Class
comment: An amount of money available to finance some project or activity.
subclass of: financial entity

indirect costs
type: budget category
type: NamedIndividual
comment: A budget category to cover the indirect costs of running a project, for example heating and lighting, and the employment of non-project staff including administrators, accountants and cleaners.

given name initial
type: DatatypeProperty
comment: A data property permitting specification of the initial(s) of a person's given name(s).
sub property of: initials

has dispatch date
type: DatatypeProperty
comment: The date on which something, for example an item of equipment, is dispatched by the supplier.
range: dateTime
sub property of: date

has headcount
type: DatatypeProperty
comment: A data property specifying the number of people employed by an organization.
sub property of: has organizational information

has code
type: DatatypeProperty
comment: A data property defining a code.

fee
type: Class
comment: An amount of money paid for something that is not purchased.
subclass of: financial entity

budget category
type: Class
comment: A category of expenditure within a budget, determining what the allocated money can be spent on, for example salaries, equipment, travel.
subclass of: financial entity

identifier
type: DatatypeProperty
comment: A unique and unambiguous reference to the resource within a given context. Recommended best practice is to identify the resource by means of a string conforming to a formal identification system.

employment contract
type: Class
comment: A contract of employment between a person and an organization.
subclass of: contract

has creation date
type: FunctionalProperty
type: DatatypeProperty
comment: A data property linking something to its date of creation.
range: dateTime
sub property of: date

rejected
type: status
type: NamedIndividual
comment: The status of something such as an application as having been rejected.

expenditure
type: Class
comment: Money going out of an account, because of expenditure on various entities. May be associated with a particular budget category.
subclass of: budget information

account statement
type: Class
comment: A statement of income and expenditure for an account, typically presented as dated income receipts and outgoings against categories in a budget for that account.
subclass of: financial entity

has familiar suffix
type: DatatypeProperty
comment: The letters that may be displayed after a person's name to indicate familial status, e.g. Sn., Jn., III, 3rd.
sub property of: has name suffix

consultancy agreement
type: Class
comment: A contract between an employer and a consultant, detailing the terms of the consultancy.
subclass of: contract

purchases
type: ObjectProperty
comment: An object property relating a purchaser to a purchased entity.
domain: Agent
description: Range constraints have been removed from this object property to permit it to be used in unforeseen ways.
inverse of: was purchased by

available funds
type: Class
comment: The amount available to spend in a budget category, equalling the income minus the expenditure to date plus future expenditure commitments.
subclass of: budget information

subscription
type: Class
comment: Payment, commonly made annually, to obtain access to something on a periodic or continuing basis, such as a journal.
subclass of: fee

service contract
type: Class
comment: A contract for the provision of a service such as a cleaning service, or for the regular servicing, maintenance and repair of some item of equipment or infrastructure.
subclass of: contract

research institute
type: Class
comment: An organization primarily dedicated to undertaking research, that might be part of a university or of a commercial company, or might be independently funded by a research funding agency.
subclass of: Organization

funding agency
type: Class
comment: An organization that provides funding for projects, often in the form of grants awarded on the basis of competitive application.
subclass of: Organization

has language code
type: DatatypeProperty
comment: A data property specifying the two-letter or three-letter lower-case code used to identify a language (e.g. fr/fra for French, de/deu for Germany) (see http://en.wikipedia.org/wiki/List_of_ISO_639-1_codes).
sub property of: has code

company
type: Class
comment: A commercial company or business run for profit.
subclass of: Organization

has exchange rate
type: DatatypeProperty
comment: A data property specifying the currency exchange rate between two specified currencies.

has information
type: DatatypeProperty
comment: A data property linking an agent to information about that agent.
domain: Agent

has output
type: ObjectProperty
comment: An object property linking an activity such as a project or endeavour to something that is created or produced as a result of that activity. Examples include a building created as a result of a building project, and a journal article published to describe the results of a research investigation.
description: Domain and range constraints have been removed from this object property to permit it to be used in unforeseen ways.

has project identifier
type: DatatypeProperty
type: AnnotationProperty
comment: A data property linking a project to an identifier for that project.
domain: project
sub property of: identifier

has deliverable
type: DatatypeProperty
comment: A data property that permits one to define a deliverable of a project.

conference fee
type: Class
comment: A fee paid to attend a conference.
subclass of: fee

donates
type: ObjectProperty
comment: An object property linking a benefactor to a gift.
domain: Agent
description: Range constraints have been removed from this object property to permit it to be used in unforeseen ways.

non-staff costs
type: budget category
type: NamedIndividual
comment: A budget category to cover all the costs associated with a project that do not involve the employment of staff by the institution, thus, for example, including consumables purchase, travel costs and consultancy fees, but excluding the salary, estates and indirect costs associated with the allocation of the PI's time to the project and the direct employment of a project manager.

has country code
type: DatatypeProperty
comment: A data property specifying the two-letter or three-letter upper-case country code used to identify a country (e.g. FR/FRA for France, DE/DEU for Germany) (see http://countrycode.org/).
sub property of: has code

entrepreneur
type: NamedIndividual
type: Person
label: A person who invests in novel enterprises.

computational service
type: Class
comment: A service provided by a computer system.
subclass of: service

scholarship
type: Class
comment: A financial grant to a scholar to enable him/her to undertake advanced academic study.
subclass of: stipend

college
type: Class
comment: An academic organization that is either a small degree-giving university, or (in the OxBridge sense) an independent corporation of scholars within a larger university, providing undergraduate tuition and a social environment for its students and fellows.
subclass of: Organization

business angel
type: NamedIndividual
type: Person
comment: A person willing to invest in start-up companies.

budgeted amount
type: Class
comment: The amount of money originally available to spend in a particular budget category.
subclass of: budget information

project
type: Class
comment: In FRAPO, a project is an administrative entity that enables an endeavour such as a research investigation. A project relates to the administrative aspects of undertaking an endeavour, including the funding obtained, the people employed, and the management of the project in terms of deadlines and deliverables. In contrast, an endeavour such as a research investigation relate to the academic and practical aspects of undertaking that endeavour - thus for a research investigation: the research itself, including the hypotheses being investigated, the experiments being undertaken, the data being gathered and analysed, the interpretations being drawn from the data, and the results obtained.
subclass of: Thing
description: Super-class of cerif:Project.

sells to
type: ObjectProperty
comment: An object property relating a supplier to a purchaser to whom an entity is sold.
domain: Agent
range: Agent
description: Domain and range constraints on this object property have been relaxed to permit it to be used in unforeseen ways.
inverse of: purchases from

government organization
type: Class
comment: An organization that is part of, or funded by, central or local goverment.
subclass of: Organization

FRAPO, the Funding, Research Administration and Projects Ontology
type: Ontology
comment: FRAPO, the Funding, Research Administration and Projects Ontology, is a CERIF-compliant ontology written in OWL 2 DL for describing research project administrative information. This ontology is available at http://purl.org/cerif/frapo/, and uses the namespace prefix 'frapo'.
contributor: Silvio Peroni
creator: David Shotton
date: 2014-01-31
description: FRAPO is an ontology for use to describe research project administrative information and to work with CRIS (Current Research Information Systems). It can be used for the characterization of grant applications, funding bodies, projects, project partners, etc. It can also be used to describe other types of projects, for example building projects and educational projects. FRAPO imports FOAF and is designed to work with SCoRO, the Scholarly Contributions and Roles Ontology (http://purl.org/spar/scoro/), which is used to characterize the contributions and time-limited roles that may exist between agents such as people and organizations and entities such as projects, research investigations or research outputs. FaBiO, the FRBR-alightned bibliographic ontology (http://purl.org/spar/fabio/), provides terms for documents of relevance, such as grant applications, project plans, project reports, datasets and journal articles, which are therefore not included within FRAPO. FRAPO is not intended to describe the details of research investigations enabled by funded research projects, nor their component studies and assays, which are the domain of a complementary ontology, ISA-RDF (under development - add URL).
rights: This work is distributed under a Creative Commons Attribution License (http://creativecommons.org/licenses/by/3.0/).
imports: foaf-essential
version info: 1.1

has purchase order number
type: DatatypeProperty
comment: A data property identifying an official purchase order issued by a purchasing agent to a supplier of goods or services, and used by the supplier to identify the order when delivering goods or submitting an invoice.
domain: purchase order
sub property of: identifier

has decision date
type: FunctionalProperty
type: DatatypeProperty
comment: The date on which a particular action is or will be decided upon, or when an application, such as a grant application, is or will be approved or rejected. [See also frapo:hasAwardDate.]
range: dateTime
sub property of: date
description: This same data property appears in FaBiO, the FRBR-aligned Bibliographic Ontology (http://purl.org/spar/fabio/).

estates costs
type: budget category
type: NamedIndividual
comment: A budget category to cover the 'overhead' costs of maintaining the premises in which work is undertaken.

research group
type: Class
comment: A group of people, usually within a university department or a research institute, and typically under a single group leader, dedicated to working together to undertake research on one or more topics. May also be called a research unit.
subclass of: Group

is manufactured by
type: ObjectProperty
comment: An object property relating a manufactured entity to its manufacturer.
range: manufacturer
inverse of: manufactures

legacy
type: Class
comment: A gift of money or property specified in the will of a person, that is made after that person's death.
subclass of: gift

deliverable
type: Class
comment: A class defining a 'deliverable' of a project, i.e. something that the project set out to deliver, or succeeds in delivering.
subclass of: output

has ORCID
type: DatatypeProperty
comment: A data property relating an individual to his/her Open Researcher and Contributor ID (ORCID), an alphanumeric identifier for individual scholars described at http://about.orcid.org/.
sub property of: has personal identifier
description: owl:equivalentProperty <http://purl.org/spar/scoro/hasORCID> .

owns
type: ObjectProperty
comment: An object property linking an agent to an entity owned by that agent.
domain: Agent

has provenance
type: DatatypeProperty
comment: A data property that permits the provenance of an entity to be described.
sub property of: topDataProperty

university
type: Class
comment: A university at which higher education and research is conducted.
subclass of: Organization

enables
type: ObjectProperty
comment: An object property relating an entity to another entity that it enables, e.g. linking a project to an endeavour that the project enables.
description: Domain and range constraints have been removed from this object property to permit it to be used in unforeseen ways.

has award date
type: FunctionalProperty
type: DatatypeProperty
comment: The date on which notification is given or received that something, for example a scholarship or a grant, has been awarded. [See also frapo:hasDecisionDate.]
range: date
sub property of: date

has qualification
type: DatatypeProperty
comment: A data property permitting specification of the qualification held by a person.
sub property of: has contact information

has catalog number
type: DatatypeProperty
comment: A data property linking something to its catalog number.
sub property of: identifier

funded
type: status
type: NamedIndividual
comment: The status of something such as an investigation or a project as being funded.

initials
type: DatatypeProperty
comment: A data property permitting specification of the initial(s) of a person's name.
sub property of: has contact information

collaborates with
type: SymmetricProperty
type: ObjectProperty
comment: An object property linking agents, for example different organizations, or people typically from different groups or organizations, that work together on a common task, project or endeavour, or towards a common goal.
domain: Agent
range: Agent

purchase
type: Class
comment: The payment for obtaining something, for example property, goods or services.
subclass of: financial entity

is applied for by
type: ObjectProperty
comment: An object property linking something applied for to the agent making the application.
range: Agent
inverse of: applies for

owns IPR of
type: ObjectProperty
comment: An object property linking an agent who owns IPR arising from or relating to an entity to that entity.
domain: Agent
sub property of: owns
inverse of: has IPR owner

manufactures
type: ObjectProperty
comment: An object property relating a manufacturer to a manufactured entity.
domain: manufacturer

has delivery date
type: DatatypeProperty
comment: The date on which something is delivered, or is due to be delivered.
range: dateTime
sub property of: date

awards
type: InverseFunctionalProperty
type: ObjectProperty
comment: An object property linking an agent to something the agent awards, for example linking a funding agency to a grant, a university to a degree, or an organization to a prize.
domain: Agent

Document
description: Ontology terms and definitions for many documents relevant to FRAPO are given as 'Expression' classes in FaBiO, the FRBR-aligned Bibliographic Ontology, e.g. fabio:CallForApplications, fabio:DataManagementPlan, fabio:GrantApplicationDocument, fabio:ProjectPlan. Others are given as sub-classes of this class.

account
type: Class
comment: A mechanism for administering money, typically owned by an agent and dedicated to a particular purpose, for example the equipment account of a university department, to be used only for the purchase or maintenance of items of equipment.
subclass of: financial entity

has call identifier
type: DatatypeProperty
comment: A data property specifying the identifying number of a call for applications issued by a funding agency.
sub property of: identifier

computational agent
type: Class
comment: A computer system or software program whose action has an effect on external events, for example a laboratory robot that undertakes your experiments, or the financial control system that controls an institution's payrole, or that, following programmed business rules, prevents the principal investigator from placing an order for research equipment because there is insufficient money left in the project budget.
subclass of: Agent

is supported by
type: ObjectProperty
comment: An object property linking something to an agent that provides funding or other support for it.
range: Class
  union of: funding
  union of: Agent
description: This property is not intended for use to describe mechanical or physical support, as in 'The statue is supported by the plinth'.
inverse of: supports

accepted
type: status
type: NamedIndividual
comment: The status of something such as an application as having been accepted.

department
type: Class
comment: A department or sub-section within a larger organization, for example a university academic department.
subclass of: Organization

fellowship
type: Class
comment: The stipend paid to a fellow in a college or university.
subclass of: stipend

has postal address line
type: DatatypeProperty
comment: A data property permitting specification of a single line of a postal address.
domain: postal address
sub property of: has information

has job title
type: DatatypeProperty
comment: A data property permitting specification of the job title held by a person, such as might appear next to the name in a directory or on a conference name badge. For example, the person's specific Job Title might be 'Linacre Professor of Zoology' or 'Regius Professor of Moral Philosophy'. This job title properly refers to the **role** held by that person (e.g. 'Head of Department'), which can be separately defined using SCoRO, the Scholarly Contributions and Roles Ontology (http://purl.org/spar/scoro/). [see scoro:withJobTitle].
domain: Person
sub property of: has contact information

is evaluated by
type: ObjectProperty
comment: An object property linking an entity to an agent that evaluates it.
range: Agent
inverse of: evaluates

division
type: Class
comment: A grouping of similar departments within a larger organization. In the university context, also known as a school or a faculty, for example the Humanities Division, the Mathematics Faculty, or the School of Medicine.
subclass of: Organization

quotation
type: Class
comment: A formal statement of promise (usually provided in response to a request for quotation) by potential supplier to supply goods or services at specified prices and within a specified period. Acceptance of the quotation by the buyer constitutes an agreement binding on both parties. (Shortened from http://www.businessdictionary.com/definition/quotation.html).
subclass of: financial entity

has organizational information
type: DatatypeProperty
comment: It describes information about the organization.
domain: Organization
sub property of: has information

repository
type: Class
comment: A facility in which entities can be deposited for long-term preservation.
subclass of: facility
description: May also be described as an archive, or as a database.

registration agency
type: Class
comment: An organization that acts to register things. For example, CrossRef is a registration agency for DOIs relating to documents, while DataCite is a registration agency for DOIs relating to datasets.
subclass of: Organization

directly incurred costs
type: budget category
type: NamedIndividual
comment: A budget category to cover all costs directly incurred because of a legitimate expenditure on a project, for example the purchase of reagents or the employment of a post-doctoral researcher.
description: Also known as the 'direct costs' of the project.

other costs
type: budget category
type: NamedIndividual
comment: A budget category to cover costs not covered in other budget categories.

gift
type: Class
comment: A gift, donation, benefaction or legacy, typically of money.
subclass of: funding

was purchased by
type: ObjectProperty
comment: An object property relating a purchased entity to its purchaser.
range: Agent
description: Domain constraints have been removed from this object property to permit it to be used in unforeseen ways.

has end date
type: FunctionalProperty
type: DatatypeProperty
comment: A data property linking something such as a project to its end date.
range: dateTime
sub property of: date

faculty
type: Class
comment: A grouping of similar departments within a university context, also known as a school or a division, for example the Humanities Division, the Mathematics Faculty, or the School of Medicine.
subclass of: division

has model number
type: DatatypeProperty
comment: A data property linking something, for example a piece of equipment, to its model number.
sub property of: identifier

is submitted by
type: ObjectProperty
comment: An object property linking an entity that is submitted (to some third party) to the agent who submits it.
range: Agent
inverse of: submits

funding programme
type: Class
comment: A programme of related funded activities or projects, typically established by a funding agency. Often associated with publication of a call for applications (fabio:CallForApplications).
subclass of: Thing

uses facility
type: ObjectProperty
comment: An object property linking an activity such as an expedition, a research project or an investigation, to a facility employed in that activity.
range: facility
sub property of: topObjectProperty
description: Domain constraints have been removed from this object property to permit it to be used in unforeseen ways.

software costs
type: budget category
type: NamedIndividual
comment: A budget category to cover the costs of software licenses required by a project.

has alternate name
type: DatatypeProperty
comment: An alternative name that a person uses for professional purposes, for example the pen name of an author, or a married woman's maiden name used as her professional name.
sub property of: has contact information

application
type: Class
comment: The activity of making an application, for example for a job, or for funding.
subclass of: Thing

vendor
type: Class
comment: An agent who supplies goods or services in exchange for payment, in response to receipt of payment or of an official purchase order from a purchaser that is responded to by submission of an invoice for what is supplied.
subclass of: supplier

has data of manufacture
type: FunctionalProperty
type: DatatypeProperty
comment: A data property linking something to its date of manufacture.
range: dateTime
sub property of: date

owner
type: Class
comment: The agent who owns an entity.
subclass of: Agent

manufacturer
type: Class
comment: An agent who manufactures goods or equipment.
subclass of: Agent

funding application
type: Class
comment: The activity of applying for funding.
subclass of: application
description: For the documents supporting a funding application, use fabio:GrantApplicationDocument and fabio:CaseForSupportDocument.

equipment
type: Class
comment: An item of equipment or apparatus, or a laboratory instrument, for example a refrigerated centrifuge.
subclass of: infrastructure entity

has funding agency
type: ObjectProperty
comment: An object property linking something to a funding agency that provides funding for it.
range: funding agency
sub property of: is supported by

has supplier number
type: DatatypeProperty
comment: A data property linking a supplier to an identifying number for that supplier, typically used by the accounting system of the purchasing institution when placing and tracking orders.
domain: supplier
sub property of: identifier

has time zone
type: FunctionalProperty
type: DatatypeProperty
comment: A data property that permits the time zone relating to an entity to be specified.

full economic costs
type: budget category
type: NamedIndividual
comment: A budget category to cover all the direct and indirect costs of a project.
description: Frequently abbreviated 'FEC'.

invoice
type: Class
comment: An invoice for payment of goods or services.
subclass of: financial entity

laboratory
type: Class
comment: A facility in which research can be conducted.
subclass of: facility

postal address
type: Class
comment: A postal address.
subclass of: Thing

research information system
type: Class
comment: A database containing administrative information about the research undertaken in an institution, and the publications and other outputs from such research.
subclass of: computational service

has funder identifer
type: DatatypeProperty
comment: A data property linking a funding agency to an identifier for that funding agency.
domain: funding agency
sub property of: identifier

has IPR owner
type: ObjectProperty
comment: An object property linking an entity such as a project, an endeavour or an output to an agent who owns the IPR arising from or related to that entity.
range: Agent
sub property of: is owned by

has birth date
type: DatatypeProperty
comment: A data property permitting specification of the birth date of a person.
domain: Person
range: dateTime
sub property of: birthday

Organization
description: owl:equivalentClass cerf:OrganizationalUnit .

article processing charge
type: Class
comment: A fee levied by a publisher on an author or an institution to cover the cost of publishing an Open Access journal article. Also knows as Article Processing Fee, Article Publication Charge, Author Processing Charge or Author Publishing Charge.
subclass of: fee

percentage of total funding
type: ObjectProperty
comment: An object property linking funding to a budget, specifying what fraction of the total budget is provided by that source of funding.
domain: funding
range: budget

is funding agency for
type: ObjectProperty
comment: An object property linking a funding agency to an entity for which it provides funding.
domain: funding agency
sub property of: supports
inverse of: has funding agency

has start date
type: FunctionalProperty
type: DatatypeProperty
comment: A data property linking something such as a project to its start date.
range: dateTime
sub property of: date

is enabled by
type: ObjectProperty
comment: An object property relating an entity to another entity that enables it, e.g. linking an investigation to a project that enables it.
description: Domain and range constraints have been removed from this object property to permit it to be used in unforeseen ways.
inverse of: enables

uses service
type: ObjectProperty
comment: An object property linking an activity such as an expedition, a research project or an investigation, to a service employed in that activity.
range: service
description: Domain constraints have been removed from this object property to permit it to be used in unforeseen ways.

has degrees
type: DatatypeProperty
comment: The letters that should be displayed after a person's name to indicate an academic degree, e.g. BA, BVSc, PhD, DSc.
sub property of: has name suffix

uses equipment
type: ObjectProperty
comment: An object property linking an activity such as an expedition, a research project or an investigation, to an item of equipment employed in that activity.
range: equipment
sub property of: topObjectProperty
description: Domain constraints have been removed from this object property to permit it to be used in unforeseen ways.

has batch number
type: DatatypeProperty
comment: A data property linking something, for example a chemical or drug, to its manufacturing batch number.
sub property of: identifier

facility
type: Class
comment: A place or installation built or designed to serve a specific function or provide a specific service, for example an animal breeding centre, a DNA sequencing facility or a confocal imaging laboratory.
subclass of: infrastructure entity

has domain name
type: DatatypeProperty
comment: A data property linking an entity to an internet domain name that has been registered for that entity, for example http://www.miidi.org for MIIDI, the Minimal Information standard for reporting an Infectious Disease Investigation.

commitments
type: Class
comment: Money set aside to honour expenditures already made but for which no invoices have yet been received, or expenditures planned for the future, for example for salaries.
subclass of: budget information

has application outcome
type: DatatypeProperty
comment: A data property that permits the outcome of an application to be described, for example that a job has been offered or that a grant has been awarded.
sub property of: topDataProperty

has keyword
type: DatatypeProperty
comment: A data property permitting specification of a keyword relating to an entity.

has curriculum vitae
type: ObjectProperty
comment: An object property linking a person to an on-line version of that person's curriculum vitae.
domain: Person
range: Document

consultancy costs
type: budget category
type: NamedIndividual
comment: A budget category to cover the costs of consultancy fees.

budget
type: Class
comment: A structured statement of how funds are to be used for expenditure in defined budget categories. A budget is created, for example, when applying for funding for a project, and is subsequently used to manage the expenditure from the awarded grant for that project.
subclass of: financial entity

is output of
type: ObjectProperty
comment: An object property linking something that is created or produced to the activity that created or produced it.
description: Domain and range constraints have been removed from this object property to permit it to be used in unforeseen ways.
inverse of: has output

scholarship application
type: Class
comment: The activity of applying for an educational scholarship.
subclass of: application

has purchase date
type: FunctionalProperty
type: DatatypeProperty
comment: A data property linking something to its purchase date.
range: dateTime
sub property of: date

expenditure to date
type: Class
comment: Total money expended to date from an an account, or from a particular budget category.
subclass of: expenditure

financial control system
type: Class
comment: A software system controlling the financial activities of an organization, for example determining full economic cost budgets for grant applications, and managing the funding of funded projects.
subclass of: computational service

overhead costs
type: budget category
type: NamedIndividual
comment: A budget category to cover all the non-directly incurred costs of a project, including estates costs and indirect costs, that enable an institution to host an externally-funded project.

grant
type: Class
comment: A financial award by a funding agency for a particular project or purpose, usually awarded on the basis of a competitive application.
subclass of: funding

service
type: Class
comment: A service of help to others, often requiring funding, employees, equipment and/or facilities for its provision, for example a library service, a transportation service, a DNA sequencing service.
subclass of: infrastructure entity

project budget
type: Class
comment: A budget for a research project.
subclass of: budget

endowment
type: Class
comment: A transfer, generally as a gift, of money or property to an institution to provide a permanent fund, the income from which is to be used for a particular purpose. (Abbreviated from http://legal-dictionary.thefreedictionary.com/endowment).
subclass of: gift

employment application
type: Class
comment: The activity of applying for a job.
subclass of: application

has post code
type: DatatypeProperty
comment: A data property defining the postal code of an address.
sub property of: has code

applies for
type: ObjectProperty
comment: An object property linking an agent to something for which that agent applies, for example a job, membership of an organization, or a grant from a funding agency.
domain: Agent

has personal identifier
type: DatatypeProperty
comment: A unique and unambiguous identifier for an individual person within a given context.
domain: Person
sub property of: identifier
sub property of: has contact information
description: owl:equivalentProperty <http://purl.org/spar/scoro/hasPersonalIdentifier> .
description: owl:equivalentProperty <http://purl.org/spar/datacite/hasPersonalIdentifier> .

has phone number
type: DatatypeProperty
comment: A data property identifying a telephone number for an agent.
sub property of: has information

evaluates
type: ObjectProperty
comment: An object property linking an agent to an entity which that agent evaluates, for example a funding agency that is evaluating a grant application to determine whether the proposed project is worthy of funding, or a publisher evaluating a manuscript to determine whether it is suitable for publication.
domain: Agent

travel and subsistence costs
type: budget category
type: NamedIndividual
comment: A budget category to cover the costs of travel and subsistence incurred on behalf of the project.

supplier
type: Class
comment: An agent who supplies something, such as goods or services.
subclass of: Agent

infrastructure entity
type: Class
comment: An entity that facilitates work.
subclass of: Thing
description: owl:equivalentClass cerif:InfrastructureEntity .

provides service
type: ObjectProperty
comment: An agent that provides a service.
domain: Agent
description: Range constraints have been removed from this object property to permit it to be used in unforeseen ways.

purchases from
type: ObjectProperty
comment: An object property relating a purchaser to a supplier from whom the purchase is made.
domain: Agent
range: Agent
description: Domain and range constraints on this object property have been relaxed to permit it to be used in unforeseen ways.

academic
type: NamedIndividual
type: Person
comment: A member of the academic staff of an academic institution such as a university.

has customer number
type: DatatypeProperty
comment: A data property linking an agent to an identifying number for that agent, typically used by the accounting system of the supplier when issuing quotations, fulfilling orders and submitting invoices.
domain: purchaser
sub property of: identifier

has currency
type: DatatypeProperty
comment: A data property defining the currency used to specify a financial entity. Use in conjection with frapo:hasMonetaryValue.

has grant number
type: DatatypeProperty
comment: A data property specifying the grant number of a grant provided by a funding agency.
domain: grant
sub property of: identifier

facilities costs
type: budget category
type: NamedIndividual
comment: A budget category to cover the costs of maintaining facilities used by a project, for example an electron microscopy facility.

purchase order
type: Class
comment: An official order from a purchasing institution to a supplier for the purchase of goods or services, often issued in response to the receipt of a quotation from the supplier.
subclass of: financial entity

payment
type: Class
comment: A financial payment made, for example in exchange for something purchased such as property, goods or services, or to refund expenses incurred.
subclass of: financial entity

output
type: Class
comment: Something that is created or produced as a result of a project or an endeavour. Examples include a building resulting from a building project, educated students graduating from an educational programme, and a journal article published as a result of a research project. Research outputs can also include reports, datasets, experimental protocols, workflows and mathematical models, and material outputs such as a cell line, a mouse mutant or a new form of microscope.
subclass of: Thing
subclass of: equipment
description: Ontology terms and definitions for most publishable project outputs are given as 'Expression' classes in FaBiO, the FRBR-aligned Bibliographic Ontology, e.g. fabio:JournalArticle, fabio:DataSet. For 'deliverables', use frapo:Deliverable. For material outputs, use frapo:MaterialOutput.

directly allocated costs
type: budget category
type: NamedIndividual
comment: A budget category to cover those costs normally borne by an institution, that are assigned to the budget of an externally funded project to cover the value of contributions to that project, for example to pay for the salary of a permanent member of staff seconded to work on the project, to compensate the employing organization for the loss of that person's efforts on other activities that he or she would otherwise be undertaking were it not for that secondment.

fee or free
type: DatatypeProperty
comment: A data property defining whether participation in an event is free, or requires payment of a fee.

consumables costs
type: budget category
type: NamedIndividual
comment: A budget category to cover the costs of purchasing consumables.

has city or town
type: DatatypeProperty
comment: A data property specifying a city or town, for example as the location of an event.

supplies
type: ObjectProperty
comment: An object property relating a supplier to a supplied entity, or to an agent to whom the entity is supplied.
domain: Agent
description: Domain constraints on this object property have been relaxed to permit it to be used in unforeseen ways.

sme
type: Class
comment: A small to medium enterprise, having up to 250 employees.
label: small to medium enterprise
subclass of: company

has name suffix
type: DatatypeProperty
comment: The letters that should be displayed after a person's name.
sub property of: has contact information

budget information
type: Class
comment: Information about an aspect of a budget.
subclass of: financial entity

benefactor
type: NamedIndividual
type: Person
comment: A person who gives a gift.

income
type: Class
comment: Money coming into an account. May be associated with a particular budget category.
subclass of: budget information

has reference number
type: DatatypeProperty
comment: A data property linking something to a reference number for that item.
sub property of: identifier

has registration deadline
type: FunctionalProperty
type: DatatypeProperty
comment: The date by which registration must be made, for example renewal of an internet domain name.
range: dateTime
sub property of: date

has location
type: DatatypeProperty
comment: A data property link an entity to a relevant location, which might be geographical (e.g. New York City) or local (e.g. Freezer B, second shelf).

consortium agreement
type: Class
comment: A formal agreement between members of a consortium, for example between research groups at different universities engaged in a multi-partner research project.
subclass of: contract

has temporal duration
type: DatatypeProperty
comment: A data property enabling one to define the temporal duration of some entity such as an event or a project.
range: dateTime

post-nominals
type: DatatypeProperty
comment: The letters that should be displayed after a person's name to indicate qualification, membership or fellowship in a professional society, honours or elite status, e.g. MRCVS, FRCS, FRS, OBE, Kt.
sub property of: has name suffix

has account number
type: DatatypeProperty
comment: A data property linking a financial account to an identifying number for that account.
domain: account
sub property of: identifier