is creator (family) of
type: Property
domain: Family
label: es creadora (familia) de @es
range: C1001
name: isCreatorFamilyOf
status: Published
definition: Relates a family to a work of which it is responsible for the creation of the intellectual or artistic content.

Name of a Work
type: Class
name: NameOfAWork
status: Published
definition: A name which is the appellation of a work.

has language of name
type: Property
domain: Name
name: hasLanguageOfName
status: Published
definition: Relates a name to the language in which the name is expressed.

has shared characteristic (item) relationship
type: Property
domain: C1004
label: tiene relación de característica compartida (ejemplar) @es
range: C1004
name: hasSharedCharacteristicItemRelationship
status: Published
definition: Relates two items that have some characteristic in common.
scope note: Excludes specific characteristics represented by other properties.

creates
type: Property
domain: Agency
label: crea @es
range: Controlled Access Point
name: creates
status: Published
inverse of: is created by
definition: Relates an agency to a controlled access point that is created by the agency.

has biography or history
type: Property
domain: C1005
label: tiene biografía o historia @es
name: hasBiographyOrHistory
status: Published
definition: Relates a person to information pertaining to the life or history of the person.

has earlier name
type: Property
domain: Name of a Person
label: tiene nombre anterior @es
range: Name of a Person
name: hasEarlierName
status: Published
inverse of: has later name
definition: Relates a name of a person to a name that person used at an earlier stage in life.

has equivalence (manifestation) relationship
type: Property
domain: C1003
range: C1003
name: hasEquivalenceManifestationRelationship
status: Published
definition: Relates a manifestation to another manifestation that embodies the same intellectual or artistic content (work or work-expression).

has alternative linguistic form (person)
type: Property
domain: Name of a Person
label: tiene forma lingüística alternativa (persona) @es
range: Name of a Person
name: hasAlternativeLinguisticFormPerson
status: Published
definition: Relates a name of a person and an alternative linguistic form of name by which that person is known.
scope note: Includes translations of a name into other languages.

has member (corporate body)
type: Property
domain: Corporate Body
range: C1005
name: hasMemberCorporateBody
status: Published
inverse of: is member of (corporate body)
definition: Relates a corporate body to a person who is a member of or affiliated with the corporate body.

has rules identifier
type: Property
domain: Rules
label: tiene identificador de reglas @es
name: hasRulesIdentifier
status: Published
property disjoint with: are applied by
property disjoint with: has citation for rules
property disjoint with: govern
definition: Relates rules to an acronym or initials or alphanumeric code identifying the rules.

has sibling
type: Property
domain: Corporate Body
range: Corporate Body
name: hasSibling
status: Published
definition: Relates two persons who have the same “parent(s)” (in an actual family or within a group).

has related identifier
type: Property
domain: Controlled Access Point
label: tiene identificador relacionado @es
range: Identifier
name: hasRelatedIdentifier
status: Published
definition: Relates a controlled access point based on an authorized or variant form of name of a bibliographic entity to an identifier for the same bibliographic entity.

has place of residence
type: Property
domain: C1005
label: tiene lugar de residencia @es
name: hasPlaceOfResidence
status: Published
definition: Relates a person to a country, state/province, city, etc., in which the person resides or has resided.

has history of family
type: Property
domain: Family
name: hasHistoryOfFamily
status: Published
property disjoint with: has places associated with family
property disjoint with: has type of family
property disjoint with: has dates of family
property disjoint with: has field of activity (family)
definition: Relates a family to information pertaining to the history of the family.

has history (work)
type: Property
domain: C1001
label: tiene historia (obra) @es
name: hasHistoryWork
status: Published
definition: Relates a work to information pertaining to the history of the work.
scope note: Includes historical information pertaining to a work, including title changes for continuing resources.

has appellation
type: Property
domain: Bibliographic Entity
range: Name
name: hasAppellation
status: Published
inverse of: is appellation of
definition: Relates a bibliographic entity to a name.

FRAD model
note: This is the element set of native RDF classes and properties described in the Functional Requirements for Authority Data model. The model also uses elements previously described in the Functional Requirements for Bibliographic Records (FRBR) entity-relationship model.

Name
type: Class
label: Nombre @es
name: Name
status: Published
definition: A character, word, or group of words and/or characters by which an entity is known.
scope note: Includes names by which persons, families, and corporate bodies are known. Includes titles by which works, expressions, and manifestations are known. Includes names and terms by which concepts, objects, events, and places are known. Includes real names, pseudonyms, religious names, initials, and separate letters, numerals, or symbols. Includes forenames (or given names), matronymics, patronymics, family names (or surnames), dynastic names, etc. Includes given names of sovereigns, popes, etc., with associated roman numerals. Includes names of families, clans, dynasties, houses of nobility, etc. Includes names representing the successive holders of a title in houses of nobility, etc., viewed collectively (e.g., Dukes of Norfolk). Includes names used by a corporate body at various periods in its history. Includes names of associations, institutions, business firms, not-for-profit enterprises, etc. Includes names of governments, government agencies, projects, programmes, government officials, delegations, legislative bodies, armed forces, etc. Includes names of religious bodies, local churches, etc., religious councils, religious officials, provinces, dioceses, synods, etc., papal diplomatic missions, etc. Includes names of conferences, congresses, meetings, etc. Includes names of exhibitions, athletic contests, expeditions, fairs, festivals, etc. Includes names of subordinate and related bodies. Includes numbers that form an integral part of the name of a corporate body or event. Includes trade names. Includes titles of content, parts of content, compilations of content, etc. Includes titles by which a work has become known. Includes the title proper of the original manifestation of a work. Includes titles by which a work is identified in reference sources. Includes titles under which a work has been published. Includes titles by which manifestations of an expression have become known. Includes the title proper of the original manifestation of an expression. Includes t…

has addition
type: Property
comment: Sometimes referred to as a "qualifier".
domain: Controlled Access Point
label: tiene adición @es
name: hasAddition
status: Published
definition: Relates a controlled access point to a name, title, date, place, number, or other designation added to the base access point.
scope note: Includes the fuller form of name added to the base access point. Includes the title of nobility, title of royalty, or ecclesiastical title added to the base access point. Includes dates added to the base access point. Includes the place name associated with a corporate body added to the base access point. Includes a number associated with a corporate body or a musical work added to the base access point. Includes a title of an adaptation or version of a work added to the base access point. Includes the name and/or number of a section or part of a work added to the base access point. Includes a term designating the form of a work added to the base access point. Includes a term designating language of expression added to the base access point. Includes a term designating the key in which a musical work was originally composed added to the base access point. Includes a term designating the medium of performance for which a musical work was originally conceived added to the base access point. Includes other designations associated with persons and corporate bodies added to the base access point.

is realized by (family)
type: Property
domain: C1002
label: es realizada por (familia) @es
range: Family
name: isRealizedByFamily
status: Published
definition: Relates an expression to a family that is responsible for the specifics of the intellectual or artistic realization or execution of the expression.

has official identity
type: Property
domain: C1005
label: tiene identidad oficial @es
range: C1005
name: hasOfficialIdentity
status: Published
inverse of: is official identity of
definition: Relates a person and an identity that person assumes in an official capacity.

has owner
type: Property
domain: Corporate Body
label: tiene propietario @es
range: Family
name: hasOwner
status: Published
inverse of: is owner of
definition: Relates a corporate body to a family which owns it.

has expanded name
type: Property
domain: Name of a Corporate Body
label: tiene nombre extenso @es
range: Name of a Corporate Body
name: hasExpandedName
status: Published
inverse of: has acronym or initials or abbreviation
property disjoint with: has acronym or initials or abbreviation
property disjoint with: has other variant name (corporate body)
property disjoint with: has alternative linguistic form (corporate body)
definition: Relates a name of a corporate body and the expanded form of name by which that body is known.

has language of the corporate body
type: Property
domain: Corporate Body
name: hasLanguageOfTheCorporateBody
status: Published
property disjoint with: has field of activity (corporate body)
property disjoint with: has address (corporate body)
property disjoint with: has history (corporate body)
definition: Relates a corporate body to a language that the corporate body uses in its communications.

has script of base access point
type: Property
domain: Controlled Access Point
name: hasScriptOfBaseAccessPoint
status: Published
definition: Relates a controlled access point to the form of graphic characters in which the data in the base access point are recorded.

is created by (family)
type: Property
domain: C1001
label: es creada por (familia) @es
range: Family
sub property of: is associated with
name: isCreatedByFamily
status: Published
definition: Relates a work to a family which is responsible for the creation of the intellectual or artistic content of the work.

has religious identity
type: Property
domain: C1005
label: tiene identidad religiosa @es
range: C1005
name: hasReligiousIdentity
status: Published
equivalent property: is secular identity of
inverse of: is religious identity of
definition: Relates a person and an identity that person assumes in a religious capacity.

Name of a Family
type: Class
name: NameOfAFamily
status: Published
definition: A name which is the appellation of a family.

has dates of usage
type: Property
domain: Name
label: tiene fechas de uso @es
name: hasDatesOfUsage
status: Published
definition: Relates a name to dates associated with the use of a particular name established by a person, corporate body, or family.

has shared characteristic (manifestation) relationship
type: Property
domain: C1003
label: tiene relación de característica compartida (manifestación) @es
range: C1003
name: hasSharedCharacteristicManifestationRelationship
status: Published
definition: Relates two manifestations that have some characteristic in common.
scope note: Excludes specific characteristics represented by other properties.

is created by
type: Property
domain: Controlled Access Point
label: es creado por @es
range: Agency
name: isCreatedBy
status: Published
inverse of: creates
definition: Relates a controlled access point to the agency that creates it.

has profession or occupation
type: Property
domain: C1005
name: hasProfessionOrOccupation
status: Published
definition: Relates a person to a profession or occupation in which the person works or worked.

is derivative of
type: Property
domain: C1001
label: es derivativa de @es
range: C1001
name: isDerivativeOf
status: Published
inverse of: has derivative
definition: Relates a work to another work of which it is an adaptation or modification.
scope note: Includes relationships between an original work and a broad range of modifications from the original, including variations or versions of that work, such as editions, revisions, translations, summaries, abstracts, and digests. Includes new works that are adaptations or modifications that become new works but are based on an earlier work (improvisations, etc.); new works that are changes of genre (transformations, dramatizations, novelizations, etc.); and, new works based on the style or thematic content of other works (free translations, paraphrases, imitations, parodies, etc.).

has other variant name (work)
type: Property
domain: Name of a Work
range: Name of a Work
name: hasOtherVariantNameWork
status: Published
definition: Relates a name of a work and a name by which that work is known (other than conventional name, and alternative linguistic form).
scope note: Includes orthographic variant names(spelling variations, transliterations, punctuation variations, capitalization variations), word order variant names(inversions, permutations), variant title variant names (titles for the work based on titles found on manifestations or items, including cover title, spine title, caption title, container title, parallel title).

is member of (family)
type: Property
domain: C1005
range: Family
name: isMemberOfFamily
status: Published
definition: Relates a person to a family of which the person is a member.

has as subject (family)
type: Property
domain: C1001
label: tiene como materia (familia) @es
range: Family
name: hasAsSubjectFamily
status: Published
definition: Relates a work to a family that is the subject of the work.

has corresponding subject term or classification number
type: Property
domain: Controlled Access Point
name: hasCorrespondingSubjectTermOrClassificationNumber
status: Published
property disjoint with: has base access point
property disjoint with: has type of controlled access point
property disjoint with: has status of controlled access point
property disjoint with: has designated usage of controlled access point
property disjoint with: has undifferentiated access point
definition: Relates a controlled access point for the name of a bibliographic entity and a subject term in a controlled vocabulary or a classification number for that entity.
scope note: The subject term and the classification number may also be viewed as parallel names or identifiers for the name of the same entity.

has country
type: Property
domain: C1005
label: tiene país @es
name: hasCountry
status: Published
definition: Relates a person to a country with which the person is identified.

has field of activity (family)
type: Property
domain: Family
label: tiene campo de actividad (familia) @es
name: hasFieldOfActivityFamily
status: Published
property disjoint with: has history of family
property disjoint with: has dates of family
property disjoint with: has type of family
property disjoint with: has places associated with family
definition: Relates a family to afield of endeavour, area of expertise, etc., in which the family is engaged or was engaged.

is based on (identifier)
type: Property
domain: Controlled Access Point
label: está basado en (identificador) @es
range: Identifier
name: isBasedOnIdentifier
status: Published
inverse of: is basis (identifier) for
definition: Relates a controlled access point to an identifier on which it is based.

has place of origin of the work
type: Property
domain: C1001
label: tiene lugar de origen de la obra @es
name: hasPlaceOfOriginOfTheWork
status: Published
definition: Relates a work to the country or other territorial jurisdiction or cultural area from which the work originated.
scope note: Includes area of origin, etc.

has base access point
type: Property
domain: Controlled Access Point
name: hasBaseAccessPoint
status: Published
property disjoint with: has status of controlled access point
property disjoint with: has type of controlled access point
property disjoint with: has undifferentiated access point
property disjoint with: has corresponding subject term or classification number
property disjoint with: has designated usage of controlled access point
definition: Relates a controlled access point to all elements in a controlled access point that are integral to the name or identifier that forms the basis for the access point.
scope note: Includes the name element in a controlled access point beginning with the name of a person, family, or corporate body. Includes the phrase element in a controlled access point beginning with a phrase associated with a person that is used in lieu of a name as such when the name of the person is unknown (e.g., A Physician, Author of Early Impressions). Includes the name element for a subordinate or related body in a controlled access point beginning with the name of a superior body. Includes the name element for a government agency, official, legislative body, court, etc., in a controlled access point beginning with the name for the territorial authority. Includes the name element for a religious council, official, province, synod, etc., in a controlled access point beginning with the name for the religious body. Includes the title element in a controlled access point for a work. Includes a term designating form at the beginning of the title element of a controlled access point for a musical work or expression (e.g., Symphony, Concerto). Includes conventional and collective titles at the beginning of the title element of a controlled access point for a work or expression (e.g., Treaties, Laws, Works, Selections, Piano music). Includes the additional element(s) in a collective title controlled access point (i.e., a subsequent term or terms used to subdivide the collective uniform title)

is producer (family) of
type: Property
domain: Family
label: es productora (familia) de @es
range: C1003
name: isProducerFamilyOf
status: Published
definition: Relates a family to a manifestation of which it is responsible for publishing, distributing, fabricating or manufacturing.

is religious identity of
type: Property
domain: C1005
range: C1005
name: isReligiousIdentityOf
status: Published
equivalent property: has secular identity
inverse of: has religious identity
definition: Relates an identity a person assumes in a religious capacity and the person.

is owner of
type: Property
domain: Family
label: es propietario de @es
range: Corporate Body
name: isOwnerOf
status: Published
inverse of: has owner
definition: Related a family to a corporate body which the family owns.

has alternative linguistic form (corporate body)
type: Property
domain: Name of a Corporate Body
label: tiene forma lingüística alternativa (entidad corporativa) @es
range: Name of a Corporate Body
name: hasAlternativeLinguisticFormCorporateBody
status: Published
property disjoint with: has expanded name
property disjoint with: has other variant name (corporate body)
property disjoint with: has acronym or initials or abbreviation
definition: Relates a name of a corporate body and an alternative linguistic form of name by which that body is known.
scope note: Includes translations of the name for the corporate body.

has language of cataloguing
type: Property
domain: Controlled Access Point
label: tiene lengua de catalogación @es
name: hasLanguageOfCataloguing
status: Published
definition: Relates a controlled access point to the language in which additions to the base access point are recorded.

is secular identity of
type: Property
domain: C1005
range: C1005
name: isSecularIdentityOf
status: Published
equivalent property: has religious identity
inverse of: has secular identity
definition: Relates an identity a person assumes in a secular capacity and the person.

has language of family
type: Property
domain: Family
name: hasLanguageOfFamily
status: Published
definition: Relates a family to a language associated with the family.

Name of a Person
type: Class
name: NameOfAPerson
status: Published
definition: A name which is the appellation of a person.

has scope of usage
type: Property
domain: Name
label: tiene alcance de uso @es
name: hasScopeOfUsage
status: Published
definition: Relates a name to the form of work associated with a particular name for a persona.
scope note: Includes forms, genres, etc., (e.g., literary works, critical works, works on mathematics, detective novels) associated with a name used by an author.

has shared characteristic (expression) relationship
type: Property
domain: C1002
label: tiene relación de característica compartida (expresión) @es
range: C1002
name: hasSharedCharacteristicExpressionRelationship
status: Published
definition: Relates two expressions that have some characteristic in common.
scope note: Excludes specific characteristics represented by other properties.

govern
type: Property
domain: Rules
label: regula @es
range: Controlled Access Point
name: govern
status: Published
inverse of: is governed by
property disjoint with: has rules identifier
property disjoint with: has citation for rules
definition: Relates rules to a controlled access point that they govern.

has field of activity (person)
type: Property
domain: C1005
label: tiene campo de actividad (persona) @es
name: hasFieldOfActivityPerson
status: Published
definition: Relates a person to a field of endeavour, area of expertise, etc., in which the person is engaged or was engaged.

has undifferentiated access point
type: Property
domain: Controlled Access Point
label: tiene punto de acceso no diferenciado @es
name: hasUndifferentiatedAccessPoint
status: Published
property disjoint with: has base access point
property disjoint with: has corresponding subject term or classification number
property disjoint with: has status of controlled access point
property disjoint with: has designated usage of controlled access point
property disjoint with: has type of controlled access point
definition: Relates a controlled access point to an indication that the controlled access point for the authorized form of name (i.e., authorized access point) is insufficiently precise to differentiate between two or more entities identified by the same name.

has derivative
type: Property
domain: C1001
label: tiene derivada @es
range: C1001
name: hasDerivative
status: Published
inverse of: is derivative of
definition: Relates a work to another work which is an adaptation or modification of the prior work.
scope note: Includes relationships between an original work and a broad range of modifications from the original, including variations or versions of that work, such as editions, revisions, translations, summaries, abstracts, and digests. Includes new works that are adaptations or modifications that become new works but are based on an earlier work (improvisations, etc.); new works that are changes of genre (transformations, dramatizations, novelizations, etc.); and, new works based on the style or thematic content of other works (free translations, paraphrases, imitations, parodies, etc.).

has other variant name (corporate body)
type: Property
domain: Name of a Corporate Body
range: Name of a Corporate Body
name: hasOtherVariantNameCorporateBody
status: Published
property disjoint with: has alternative linguistic form (corporate body)
property disjoint with: has acronym or initials or abbreviation
property disjoint with: has expanded name
definition: Relates a name of a corporate body and a name by which that body is known (other than expanded name, acronym, initials, abbreviation, and alternative linguistic form).
scope note: Includes orthographic variant names (spelling variations, transliterations, punctuation variations, capitalization variations), word order variant names (inversions, permutations).

has member (family)
type: Property
domain: Family
range: C1005
name: hasMemberFamily
status: Published
definition: Relates a family to a person who is a member of the family.

has collaborative relationship
type: Property
domain: C1005
label: tiene relación colaborativa con @es
range: C1005
name: hasCollaborativeRelationship
status: Published
definition: Relates two persons (i.e., individuals) who collaborate in intellectual or artistic endeavours

is successor of
type: Property
domain: Corporate Body
label: es sucesora de @es
range: Corporate Body
name: isSuccessorOf
status: Published
inverse of: is predecessor of
definition: Relates a corporate body to another corporate body of which it is a successor.

has place of death
type: Property
domain: C1005
label: tiene lugar de fallecimiento @es
name: hasPlaceOfDeath
status: Published
property disjoint with: has address (person)
property disjoint with: has language of person
property disjoint with: has affiliation
property disjoint with: has biography or history
property disjoint with: has country
property disjoint with: has field of activity (person)
property disjoint with: has gender
property disjoint with: has profession or occupation
definition: Relates a person to the town, city, province, state, and/or country in which the person died.

has places associated with family
type: Property
domain: Family
name: hasPlacesAssociatedWithFamily
status: Published
property disjoint with: has history of family
property disjoint with: has dates of family
property disjoint with: has type of family
property disjoint with: has field of activity (family)
definition: Relates a family to information pertaining to places where the family resides or resided or had some connection.

is basis (identifier) for
type: Property
domain: Identifier
range: Controlled Access Point
name: isBasisIdentifierFor
status: Published
inverse of: is based on (identifier)
property disjoint with: has type of identifier
definition: Relates an identifier to a controlled access point for which it is the basis.

has source of controlled access point
type: Property
domain: Controlled Access Point
name: hasSourceOfControlledAccessPoint
status: Published
definition: Relates a controlled access point to the publication or reference source used in establishing the form of name or title on which the controlled access point is based.
scope note: Includes the title, publisher, date, etc., of the resource for which the controlled access point was originally created. Includes the title, edition, etc., of the reference source(s) used to establish the conventional name or title.

is produced by (family)
type: Property
domain: C1003
label: es producida por (familia) @es
range: Family
name: isProducedByFamily
status: Published
definition: Relates a manifestation to a family that is responsible for publishing, distributing, fabricating or manufacturing the manifestation.

has gender
type: Property
domain: C1005
label: tiene género @es
name: hasGender
status: Published
property disjoint with: has place of birth
property disjoint with: has country
property disjoint with: has place of residence
property disjoint with: has address (person)
property disjoint with: has field of activity (person)
property disjoint with: has biography or history
property disjoint with: has affiliation
property disjoint with: has language of person
property disjoint with: has profession or occupation
property disjoint with: has place of death
definition: Relates a person to a gender by which the person is identified.
scope note: E.g., male, female, unknown, other.

has founder
type: Property
domain: Corporate Body
range: Family
name: hasFounder
status: Published
inverse of: is founder of
definition: Relates a corporate body to a family which created it.

has equivalence (item) relationship
type: Property
domain: C1004
range: C1004
name: hasEquivalenceItemRelationship
status: Published
definition: Relates an item to another item that exemplifies the same intellectual or artistic content (work or work-expression).

is basis (name) for
type: Property
domain: Name
range: Controlled Access Point
name: isBasisNameFor
status: Published
inverse of: is based on (name)
definition: Relates a name to a controlled access point for which it is the basis.

has alternative linguistic form (family)
type: Property
domain: Name of a Family
label: tiene forma lingüística alternativa (familia) @es
range: Name of a Family
name: hasAlternativeLinguisticFormFamily
status: Published
definition: Relates a name of a family and an alternative linguistic form of name by which that family is known.

has language of base access point
type: Property
domain: Controlled Access Point
name: hasLanguageOfBaseAccessPoint
status: Published
definition: Relates a controlled access point to the language in which the base access point is recorded.

has secular identity
type: Property
domain: C1005
label: tiene identidad secular @es
range: C1005
name: hasSecularIdentity
status: Published
equivalent property: is religious identity of
inverse of: is secular identity of
definition: Relates a person and an identity that person assumes in a secular capacity.

has (predecessor) genealogical relationship
type: Property
domain: Family
range: Family
name: hasPredecessorGenealogicalRelationship
status: Published
inverse of: has (descendent) genealogical relationship
property disjoint with: has (descendent) genealogical relationship
definition: Relates a family to another family which is the precursor of the prior family.

has numeric designation
type: Property
domain: C1001
label: tiene designación numérica @es
name: hasNumericDesignation
status: Published
definition: Relates a work to a number assigned to it.
scope note: Includes serial numbers, opus numbers assigned by the composer of a musical work, etc.

Name of a Corporate Body
type: Class
name: NameOfACorporateBody
status: Published
definition: A name which is the appellation of a corporate body.

has name string
type: Property
domain: Name
label: tiene cadena de caracteres @es
name: hasNameString
status: Published
definition: Relates a name to a sequence of numeric and/or alphabetic characters or symbols that represents the name of an entity.

has shared characteristic (work) relationship
type: Property
domain: C1001
label: tiene relación de característica compartida (obra) @es
range: C1001
name: hasSharedCharacteristicWorkRelationship
status: Published
definition: Relates two works that have some characteristic in common.
scope note: Excludes specific characteristics represented by other properties.

is governed by
type: Property
domain: Controlled Access Point
label: es regulado por @es
range: Rules
name: isGovernedBy
status: Published
inverse of: govern
definition: Relates a controlled access point to the rules that govern it.

has language of person
type: Property
domain: C1005
name: hasLanguageOfPerson
status: Published
definition: Relates a person to a language the person uses when creating an expression for publication, broadcasting, etc.

has designated usage of controlled access point
type: Property
domain: Controlled Access Point
name: hasDesignatedUsageOfControlledAccessPoint
status: Published
property disjoint with: has status of controlled access point
property disjoint with: has base access point
property disjoint with: has type of controlled access point
property disjoint with: has undifferentiated access point
property disjoint with: has corresponding subject term or classification number
definition: Relates a controlled access point to an indication of whether the rules under which the controlled access point was constructed designate it as an authorized (or preferred) form (i.e., authorized access point) or as a variant (or non-preferred) form (i.e., variant access points).

is assigned to
type: Property
domain: Identifier
range: Bibliographic Entity
name: isAssignedTo
status: Published
inverse of: is assigned
property disjoint with: has type of identifier
definition: Relates an identifier to a bibliographic entity to which it is assigned.

has immediate source of acquisition of item
type: Property
domain: C1004
name: hasImmediateSourceOfAcquisitionOfItem
status: Published
definition: Relates an item to the source from which an item was directly acquired and the circumstances under which it was acquired.

Identifier
type: Class
label: Identificador @es
name: Identifier
status: Published
definition: A number, code, word, phrase, logo, device, etc., that is associated with an entity, and serves to differentiate that entity from other entities within the domain in which the identifier is assigned. An identifier can consist of an identifier string (i.e., a sequence of numeric and/or alphabetic characters assigned to an entity to serve as a unique identifier within the domain to which the identifier is assigned) and a prefix and/or suffix (a character or set of characters (numeric and/or alphabetic) appearing before or after an identifier string).
scope note: Includes identifiers such as social insurance numbers assigned by a government authority. Includes personal identifiers assigned by other registration authorities. Includes business registration numbers, registration numbers for charitable organizations, etc., assigned by a government authority. Includes corporate body identifiers assigned by other registration authorities (e.g., ISBN publisher’s prefix). Includes standard identifiers assigned by registration authorities identifying content (e.g., ISRC, ISWC, ISAN). Includes standard identifiers assigned by registration authorities identifying manifestations (e.g., ISBN, ISSN). Includes thematic index numbers assigned to a musical work by the publisher, or a musicologist. Includes catalogue raisonné numbers. Includes identifiers for items assigned by repositories (e.g., shelf number). Includes classification numbers referencing specific entities (e.g., a classification number assigned to a particular painting). Includes registered trademarks.

has other variant name (person)
type: Property
domain: Name of a Person
range: Name of a Person
name: hasOtherVariantNamePerson
status: Published
definition: Relates a name of a person and several other variations on a name (other than earlier name, later name, and alternative linguistic form).
scope note: Includes orthographic variant names (spelling variations, transliterations, punctuation variations, capitalization variations), word order variant names (inversions, permutations), alternative name/synonym variant names (bynames, nicknames, courtesy names).

has different rules form
type: Property
domain: Controlled Access Point
range: Controlled Access Point
name: hasDifferentRulesForm
status: Published
property disjoint with: has alternate script form
property disjoint with: has parallel language form
definition: Relates controlled access points for the authorized forms of name for the same entity that have been established according to different sets of rules.

has sequential relationship
type: Property
domain: C1001
range: C1001
name: hasSequentialRelationship
status: Published
definition: Relates a work to another work of different content that is a successor or a predecessor of that work,
scope note: E.g. a sequel, a serial or series that has changed title. Excludes derivative works that modify the content of an earlier work.

has attributed works from
type: Property
domain: C1005
range: C1005
name: hasAttributedWorksFrom
status: Published
inverse of: has works attributed to
definition: Relates a person (either a "real" individual or a persona) or identity to whom one or more works by another person have been attributed, either erroneously or falsely, and that other person.

is predecessor of
type: Property
domain: Corporate Body
label: es predecesora de @es
range: http://iflastandards.info/ns/fr/frad/1003
name: isPredecessorOf
status: Published
inverse of: is successor of
definition: Relates a corporate body to another corporate body of which it is a predecessor.
scope note: Includes splits, mergers, subsequent meetings or conferences.

has place of birth
type: Property
domain: C1005
label: tiene lugar de nacimiento @es
name: hasPlaceOfBirth
status: Published
property disjoint with: has field of activity (person)
property disjoint with: has address (person)
property disjoint with: has country
property disjoint with: has biography or history
property disjoint with: has profession or occupation
property disjoint with: has language of person
property disjoint with: has gender
property disjoint with: has affiliation
definition: Relates a person to the town, city, province, state, and/or country in which the person was born.

has dates of family
type: Property
domain: Family
name: hasDatesOfFamily
status: Published
property disjoint with: has history of family
property disjoint with: has type of family
property disjoint with: has field of activity (family)
property disjoint with: has places associated with family
definition: Relates a family to dates associated with the family.

is based on (name)
type: Property
domain: Controlled Access Point
range: Name
name: isBasedOnName
status: Published
inverse of: is basis (name) for
definition: Relates a controlled access point to a name on which it is based.

has conventional name
type: Property
domain: Name of a Work
label: tiene nombre convencional @es
range: Name of a Work
name: hasConventionalName
status: Published
inverse of: is conventional name of
definition: Relates a name of a work and a conventional name by which that work is known

has history (corporate body)
type: Property
domain: Corporate Body
name: hasHistoryCorporateBody
status: Published
property disjoint with: has field of activity (corporate body)
property disjoint with: has address (corporate body)
property disjoint with: has language of the corporate body
definition: Relates a corporate body to information pertaining to the history of the corporate body.
scope note: Includes historical information pertaining to an organization, institution, etc.

Corporate Body
type: Class
comment: Description is modified from that in Functional requirements for bibliographic records : final report, by the IFLA Study Group on the Functional Requirements for Bibliographic Records, published by K.G. Saur, 1998.
subclass of: Bibliographic Entity
name: CorporateBody
status: Published
definition: An organization or group of persons and/or organizations identified by a particular name acting as a unit.
scope note: Includes occasional groups and groups that are constituted as meetings, conferences, congresses, expeditions, exhibitions, festivals, fairs, etc. Includes musical performing groups, groups of visual artists, and dance companies producing collective work. Includes organizations that act as territorial authorities, exercising or claiming to exercise government functions over a certain territory, such as a federation, a state, a region, a local municipality. Includes organizations and groups that are defunct as well as those that continue to operate. Includes fictitious organizations or groups of persons.

has transliteration scheme of cataloguing
type: Property
domain: Controlled Access Point
name: hasTransliterationSchemeOfCataloguing
status: Published
definition: Relates a controlled access point to an indication of the scheme used in transliterating any additions to the base access point.

is owner (family) of
type: Property
domain: Family
label: es propietaria (familia) de @es
range: C1004
name: isOwnerFamilyOf
status: Published
definition: Relates a family to an item of which it is the owner or custodian.

has transliteration scheme of name
type: Property
domain: Name
label: tiene esquema de transliteración del nombre @es
name: hasTransliterationSchemeOfName
status: Published
definition: Relates a name to the scheme used to produce the transliterated form of the name.

is founder of
type: Property
domain: Family
label: es fundador de @es
range: Corporate Body
name: isFounderOf
status: Published
inverse of: has founder
definition: Relates a family to a corporate body which the family created.

is descriptive work of
type: Property
domain: C1001
name: isDescriptiveWorkOf
status: Published
definition: Relates a new work to a target work or expression or manifestation or item that it refers to as its subject.
scope note: Includes criticism, commentary, review, casebook, etc., and the object of that analysis (that is, the target work, expression, or manifestation).

modifies
type: Property
domain: Agency
label: modifica @es
range: Controlled Access Point
name: modifies
status: Published
inverse of: is modified by
definition: Relates an agency to a controlled access point that is modified by the agency.

is pseudonymous persona of
type: Property
domain: C1005
range: C1005
name: isPseudonymousPersonaOf
status: Published
inverse of: has pseudonymous persona
definition: Relates a persona(ae) or identity adopted by an individual through the use of one or more pseudonyms and the "real" person (i.e., the individual).

has subject of the work
type: Property
domain: C1001
name: hasSubjectOfTheWork
status: Published
definition: Relates a work to the subject aspects of the work and its content.
scope note: Includes information about the subject of the work. Includes classification numbers.

has (descendent) genealogical relationship
type: Property
domain: Family
range: Family
name: hasDescendentGenealogicalRelationship
status: Published
inverse of: has (predecessor) genealogical relationship
property disjoint with: has (predecessor) genealogical relationship
definition: Relates a family to another family that descended from the prior family.

Bibliographic Entity
type: Class
has sub class: Corporate Body
has sub class: Family
name: BibliographicEntity
status: Published
definition: An entity which reflects intellectual constructs or concepts that are integral to the rules used to create library catalogues.
scope note: What is perceived as a specific instance of a particular entity type may vary from one set of rules to another.

has type of name
type: Property
domain: Name
label: tiene tipo de nombre @es
name: hasTypeOfName
status: Published
definition: Relates a name to the category of a name.
scope note: Includes personal names, corporate names, names of families, trade names, and titles of works and manifestations. Includes names of concepts, objects, events, and places.

has child
type: Property
domain: C1005
range: C1005
name: hasChild
status: Published
inverse of: has parent
property disjoint with: has parent
definition: Relates a person to another person who is a "child" of that person.

has accompanying relationship
type: Property
domain: C1001
range: C1001
name: hasAccompanyingRelationship
status: Published
definition: Relates a work to another work that is a supplement to that work (i.e., a work that is intended to be used in conjunction with or to augment the related work, such as a teacher’s guide or incidental music to a play; or intended to complement or be a companion to another work, such as a set of maps to a video travelogue, a computer disk to accompany a textbook, a set of coloured plates to accompany a text, the equal parts of a kit).

applies
type: Property
domain: Agency
label: aplica @es
range: Rules
name: applies
status: Published
inverse of: are applied by
definition: Relates an agency to rules that it applies when creating or modifying a controlled access point.

has address (person)
type: Property
domain: C1005
label: tiene dirección (persona) @es
name: hasAddressPerson
status: Published
definition: Relates a person to the current or former address of the person's place of residence, business, or employer.
scope note: Includes street address, postal address, telephone number, e-mail address, etc. Includes the address of a World Wide Web site operated by the person, about the person or related to the person.

has status of controlled access point
type: Property
domain: Controlled Access Point
name: hasStatusOfControlledAccessPoint
status: Published
property disjoint with: has base access point
property disjoint with: has type of controlled access point
property disjoint with: has undifferentiated access point
property disjoint with: has corresponding subject term or classification number
property disjoint with: has designated usage of controlled access point
definition: Relates a controlled access point to an indication of the level of establishment of the authorized access point for the entity (e.g., provisional).

is assigned
type: Property
domain: Bibliographic Entity
range: Identifier
name: isAssigned
status: Published
inverse of: is assigned to
definition: Relates a bibliographic entity to an identifier assigned to the entity.

has custodial history of item
type: Property
domain: C1004
name: hasCustodialHistoryOfItem
status: Published
definition: Relates an item to the record of previous ownership of an item.

Agency
type: Class
label: Agencia @es
name: Agency
status: Published
definition: An organization responsible for creating or modifying a controlled access point. The agency is responsible for application and interpretation of the rules it creates and/or uses. The agency may also be responsible for the creation and maintenance of identifiers within its domain.
scope note: Includes libraries, national bibliographic agencies, bibliographic utilities, consortia, museums, archives, rights management organizations, etc.

is conventional name of
type: Property
domain: Name of a Work
label: es nombre convencional de @es
range: Name of a Work
name: isConventionalNameOf
status: Published
inverse of: has conventional name
definition: Relates a conventional name by which a work is known to a name of the same work.

has alternate script form
type: Property
domain: Controlled Access Point
range: Controlled Access Point
name: hasAlternateScriptForm
status: Published
property disjoint with: has different rules form
property disjoint with: has parallel language form
definition: Relates controlled access points that are established as alternate script forms of the access point for the authorized forms of name for the same entity.

is associated with
type: Property
has subproperty: is created by (family)
name: isAssociatedWith
status: Published
definition: Relates a person, a family, or a corporate body to a work, expression, manifestation, or item.

Published
type: Concept

has works attributed to
type: Property
domain: Corporate Body
range: Corporate Body
name: hasWorksAttributedTo
status: Published
inverse of: has attributed works from
definition: Relates one person and another person (either a "real" individual or a persona) or identity to whom one or more works by the former have been attributed, either erroneously or falsely.

is subordinate of
type: Property
domain: Corporate Body
label: es subordinado de @es
range: Corporate Body
name: isSubordinateOf
status: Published
inverse of: has subordinate
definition: Relates a corporate body to another corporate body to which it is subordinate.

has type of family
type: Property
domain: Family
name: hasTypeOfFamily
status: Published
property disjoint with: has dates of family
property disjoint with: has places associated with family
property disjoint with: has field of activity (family)
property disjoint with: has history of family
definition: Relates a family to a categorization or generic descriptor for the type of family.
scope note: Includes categorizations, such as clan, dynasty, family unit, patriarchy, matriarchy, etc.

has alternative linguistic form (work)
type: Property
domain: Name of a Work
label: tiene forma lingüística alternativa (obra) @es
range: Name of a Work
name: hasAlternativeLinguisticFormWork
status: Published
definition: Relates a name of a work and an alternative linguistic form of name by which that work is known.

has field of activity (corporate body)
type: Property
domain: Corporate Body
label: tiene campo de actividad (entidad corporativa) @es
name: hasFieldOfActivityCorporateBody
status: Published
property disjoint with: has language of the corporate body
property disjoint with: has history (corporate body)
property disjoint with: has address (corporate body)
definition: Relates a corporate body to a field of business in which the corporate body is engaged, its area of competence, responsibility, jurisdiction, etc.

Family
type: Class
label: Familia @es
subclass of: Bibliographic Entity
name: Family
status: Published
definition: Two or more persons related by birth, marriage, adoption, civil union, or similar legal status, or who otherwise present themselves as a family.
scope note: Includes royal families, dynasties, houses of nobility, etc. Includes patriarchies and matriarchies. Includes groups of individuals sharing a common ancestral lineage. Includes family units (parents, children, grandchildren, etc.). Includes the successive holders of a title in a house of nobility, viewed collectively (e.g., Dukes of Norfolk).

has transliteration scheme of base access point
type: Property
domain: Controlled Access Point
name: hasTransliterationSchemeOfBaseAccessPoint
status: Published
definition: Relates a controlled access point to an indication of the scheme used in transliterating the base access point.

is owned by (family)
type: Property
domain: C1004
label: es poseida por (familia) @es
range: Family
name: isOwnedByFamily
status: Published
definition: Relates an item to a family that is the owner or custodian of the item.

has script of name
type: Property
domain: Name
name: hasScriptOfName
status: Published
definition: Relates a name to the script in which the name is rendered

has descriptive work
type: Property
label: tiene obra descriptiva @es
range: C1001
name: hasDescriptiveWork
status: Published
definition: Relates a target work or expression or manifestation or item and a new work that refers to that target as its subject.
scope note: Includes criticism, commentary, review, casebook, etc., and the object of that analysis (that is, the target work, expression, or manifestation).

is modified by
type: Property
domain: Controlled Access Point
label: es modificado por @es
range: Agency
name: isModifiedBy
status: Published
inverse of: modifies
definition: Relates a controlled access point to the agency that modifies it.

has later name
type: Property
domain: Name of a Person
label: tiene nombre posterior @es
range: Name of a Person
name: hasLaterName
status: Published
inverse of: has earlier name
definition: Relates a name of a person and a name that person used at a later stage in life.

has pseudonymous persona
type: Property
domain: C1005
range: C1005
name: hasPseudonymousPersona
status: Published
inverse of: is pseudonymous persona of
definition: Relates a "real" person (i.e., an individual) and a persona(ae) or identity adopted by that individual through the use of one or more pseudonyms.

is member of (corporate body)
type: Property
domain: C1005
range: Corporate Body
name: isMemberOfCorporateBody
status: Published
inverse of: has member (corporate body)
definition: Relates a person to a corporate body in which the person is a member or with which the person is affiliated.

has type of identifier
type: Property
domain: Identifier
label: tiene tipo de identificador @es
name: hasTypeOfIdentifier
status: Published
property disjoint with: is assigned to
property disjoint with: is basis (identifier) for
definition: Relates an identifier to a code or other designation indicating the type of identifier (i.e., the domain in which the identifier is assigned).
scope note: Includes alphabetic strings identifying the numbering system (e.g., "ISBN", "ISSN", "ISRC"). Includes symbols designating the type of identifier (e.g., registered trademark symbol)

has parent
type: Property
domain: Corporate Body
range: Corporate Body
name: hasParent
status: Published
inverse of: has child
property disjoint with: has child
definition: Relates a person to another person who is a “parent” of that person.

are applied by
type: Property
domain: Rules
label: son aplicadas por @es
range: Agency
name: areAppliedBy
status: Published
inverse of: applies
property disjoint with: has rules identifier
property disjoint with: has citation for rules
definition: Relates rules to an agency that applies them when creating or modifying a controlled access point.

has affiliation
type: Property
domain: C1005
label: tiene afiliación @es
name: hasAffiliation
status: Published
definition: Relates a person to a group with which the person is affiliated or has been affiliated through employment, membership, cultural identity, etc.

has type of controlled access point
type: Property
domain: Controlled Access Point
name: hasTypeOfControlledAccessPoint
status: Published
property disjoint with: has status of controlled access point
property disjoint with: has base access point
property disjoint with: has undifferentiated access point
property disjoint with: has corresponding subject term or classification number
property disjoint with: has designated usage of controlled access point
definition: Relates a controlled access point to a categorization or generic descriptor for the controlled access point.
scope note: Includes terms and/or codes designating the type of access point (e.g., personal name access point, family name access point, corporate name access point, meeting name access point, territorial name access point, title access point, collective title access point or access points consisting of a combination of names, such as creator/title access points).

is appellation of
type: Property
domain: Name
range: Bibliographic Entity
name: isAppellationOf
status: Published
inverse of: has appellation
definition: Relates a name to a bibliographic entity.

has location of item
type: Property
comment: Scope note not present in original documentation; added to clarify semantic difference with "is part (item)" property (http://iflastandards.info/ns/fr/frbr/frbrer/P2092).
domain: C1004
name: hasLocationOfItem
status: Published
definition: Relates an item to the collection and/or institution in which the item is held, stored, or made available for access.
scope note: E.g. Moir rare book collection, http://www.juilliardmanuscriptcollection.org/, Short loan collection (School of African and Oriental Studies, University of London), Library of Congress. Does not include collections where the item is originally published or manufactured as a component part.

Rules
type: Class
label: Reglas @es
name: Rules
status: Published
definition: A set of instructions relating to the formulation and/or recording of controlled access points (authorized forms, variant forms or references, etc.).
scope note: Includes cataloguing rules and interpretations of those rules. Includes coding conventions.

has citation for rules
type: Property
domain: Rules
label: tiene cita de reglas @es
name: hasCitationForRules
status: Published
property disjoint with: are applied by
property disjoint with: has rules identifier
property disjoint with: govern
definition: Relates rules to a citation for the cataloguing code, set of rules, instructions, etc.
scope note: Includes the title of the rules, etc., and, as necessary, the name of the body responsible for the rules, the edition designation, date, etc.

has parallel language form
type: Property
domain: Controlled Access Point
range: Controlled Access Point
name: hasParallelLanguageForm
status: Published
property disjoint with: has different rules form
property disjoint with: has alternate script form
definition: Relates controlled access points that are established as parallel language forms of access point for the authorized forms of name for the same entity.

is realizer (family) of
type: Property
domain: Family
label: es realizadora (familia) de @es
range: C1002
name: isRealizerFamilyOf
status: Published
definition: Relates a family to an expression of which it is responsible for the specifics of the intellectual or artistic realization or execution.

is official identity of
type: Property
domain: C1005
range: C1005
name: isOfficialIdentityOf
status: Published
inverse of: has official identity
definition: Relates an identity a person assumes in an official capacity and the person.

has subordinate
type: Property
domain: Corporate Body
label: tiene subordinado @es
range: Corporate Body
name: hasSubordinate
status: Published
inverse of: is subordinate of
definition: Relates a corporate body to another corporate body which is subordinate to the prior corporate body.

has acronym or initials or abbreviation
type: Property
domain: Name of a Corporate Body
label: tiene acrónimo o iniciales o abreviaturas @es
range: Name of a Corporate Body
name: hasAcronymOrInitialsOrAbbreviation
status: Published
inverse of: has expanded name
property disjoint with: has expanded name
property disjoint with: has other variant name (corporate body)
property disjoint with: has alternative linguistic form (corporate body)
definition: Relates a name of a corporate body and an acronym or initials or an abbreviation by which that body is known.

has address (corporate body)
type: Property
domain: Corporate Body
name: hasAddressCorporateBody
status: Published
property disjoint with: has field of activity (corporate body)
property disjoint with: has history (corporate body)
property disjoint with: has language of the corporate body
definition: Relates a corporate body to the current or former address of the corporate body's office(s).
scope note: Includes addresses for the corporate body's headquarters and/or other offices. Includes street address, postal address, telephone number, e-mail address, etc. Includes the address of a World Wide Web site operated by the corporate body, about the corporate body or related to the corporate body.

Controlled Access Point
type: Class
comment: Description is modified from: Guidelines for authority records and references / revised by the Working Group on GARE Revision. Second edition. München : K.G. Saur, 2001.
name: ControlledAccessPoint
status: Published
definition: A name, term, code, etc., under which a bibliographic or authority record or reference will be found.
scope note: Includes access points designated as authorized (or preferred) forms of names (i.e., authorized access points) as well as those designated as variant forms of name (i.e., variant access points). Includes access points based on personal, family, and corporate names. Includes access points based on titles (i.e., names) for works, expressions, manifestations, and items. Includes access points consisting of a combination of two access points, as in the case of a creator/title access point for a work which consists of an authorized access point for the name of the creator combined with an authorized access point for the name (i.e., the title) of the work. Includes access points based on names and terms for events, objects, concepts, and places. Includes access points based on identifiers, such as standard numbers, classification indicia. Elements added to the name per se (e.g., dates) form an integral part of the controlled access point.

has script of cataloguing
type: Property
domain: Controlled Access Point
name: hasScriptOfCataloguing
status: Published
definition: Relates a controlled access point to the form of graphic characters in which any additions to the base access point are recorded.