Vocabulario de Ofertas de Empleo
type: Ontology
date: 2013-09-03
issued: 2010-10-01
comment: El objetivo de este vocabulario es la creación de un esquema que permita definir los contenidos de la información relacionada con la oferta de empleo público. Se identifican ciertas variables en el dominio de la oferta de empleo público, que se modelan a través de ciertos tipos de datos y de propiedades relacionadas entre los recursos.
creator: CTIC CT. Martín Álvarez (martin.alvarez[at]fundacionctic.org)
creator: CTIC CT. Rubén Martín
license: http://creativecommons.org/licenses/by-nc-sa/3.0
rights: CTIC CT - Creative Commons 3.0 (BY-NC-SA)
replaces: oferta_20120901
preferred namespace uri: http://purl.org/ctic/empleo/oferta#
preferred namespace prefix: emp
has format: oferta 20130903.html
has format: oferta 20130903.rdf
history note: Añadidos dos nuevos esquemas de conceptos a la ontología: categorías profesionales y tipos de contrato. Añadidas nuevas propiedades para la descripción de la oferta de empleo.
  date: 2012-09-01
  creator: CTIC-CT
change note: Corregidas erratas de etiquetado de idiomas.
  date: 2013-09-03
  creator: Martín Álvarez
history note: Añadidos dos nuevos esquemas de conceptos a la ontología: categorías profesionales y tipos de contrato. Añadidas nuevas propiedades para la descripción de la oferta de empleo.
  date: 2012-09-01
  creator: CTIC-CT
change note: Corregidas erratas de etiquetado de idiomas.
  date: 2013-09-03
  creator: Martín Álvarez

oferta 20130903.html
type: Text
format: text/html
  type: IMT
  label: HTML
format: text/html
  type: IMT
  label: HTML

oferta 20130903.rdf
type: Text
format: application/rdf+xml
  type: IMT
  label: RDF
format: application/rdf+xml
  type: IMT
  label: RDF

Anuncio
type: ObjectProperty
comment: Anuncio de la convocatoria de la oferta
range: Anuncio de oferta
domain: Oferta de Empleo
sub property of: isReferencedBy
issued: 2010-10-01

Bases
type: ObjectProperty
comment: Bases de la convocatoria
domain: Oferta de Empleo
sub property of: references
issued: 2010-10-01

Categoría profesional
type: ObjectProperty
comment: Tipo de la categoría profesional destinataria de la oferta
domain: Oferta de Empleo
range: Concept
sub property of: audience
issued: 2010-10-01
history note: Añadido el rango para que se utilice con la nueva taxonomía http://purl.org/ctic/empleo/oferta#esquemaCategorias
  date: 2012-09-01
  creator: CTIC-CT
history note: Añadido el rango para que se utilice con la nueva taxonomía http://purl.org/ctic/empleo/oferta#esquemaCategorias
  date: 2012-09-01
  creator: CTIC-CT

Grupo Profesional
type: ObjectProperty
comment: Grupo de clasificación profesional
domain: Oferta de Empleo
issued: 2010-10-01

Plantilla de personal
type: ObjectProperty
comment: El tipo de plantilla de personal del puesto de trabajo
domain: Oferta de Empleo
range: Plantilla de personal
issued: 2010-10-01

Tribunal
type: ObjectProperty
comment: Tribunal que evaluará la convocatoria
domain: Oferta de Empleo
sub property of: references
issued: 2010-10-01

Tipo de contrato
type: ObjectProperty
comment: Tipo de contrato de la oferta de empleo. Referencia un concepto del esquema Tipos de contrato
domain: Oferta de Empleo
range: Concept
issued: 2012-09-01

Año de la oferta
type: DatatypeProperty
comment: Año o años de la oferta
domain: Oferta de Empleo
issued: 2010-10-01

Boletín Oficial Autonómico
type: DatatypeProperty
comment: Ejemplar del Boletín Oficial Autonómico donde aparece información sobre la oferta
domain: Oferta de Empleo
issued: 2010-10-01

Boletín Oficial del Estado
type: DatatypeProperty
comment: Ejemplar del Boletín Oficial del Estado donde aparece información sobre la oferta
domain: Oferta de Empleo
issued: 2010-10-01

Boletín Oficial Provincial
type: DatatypeProperty
comment: Ejemplar del Boletín Oficial Provincial donde aparece información sobre la oferta
domain: Oferta de Empleo
issued: 2010-10-01

Escala profesional
type: DatatypeProperty
comment: Escala profesional de la oferta
domain: Oferta de Empleo
issued: 2010-10-01

Tipo de exámen
type: DatatypeProperty
comment: Tipo del examen de la oferta
domain: Oferta de Empleo
issued: 2010-10-01

Expediente
type: DatatypeProperty
comment: Expediente relacionado con la oferta
domain: Oferta de Empleo
issued: 2010-10-01

Fecha de presentación de la instancia
type: DatatypeProperty
comment: Fecha límite de presentación de la instancia para la oferta en formato “ISO 8601”
domain: Oferta de Empleo
sub property of: valid
issued: 2010-10-01

Número de plazas para promoción interna
type: DatatypeProperty
comment: Número de plazas reservadas a promoción interna en la oferta de trabajo
domain: Oferta de Empleo
issued: 2010-10-01

Número de plazas para minusválidos
type: DatatypeProperty
comment: Número de plazas reservadas a personas discapacitadas para el puesto de trabajo
domain: Oferta de Empleo
issued: 2010-10-01

Plazas totales
type: DatatypeProperty
comment: Número de plazas para el puesto de trabajo
domain: Oferta de Empleo
sub property of: extent
issued: 2010-10-01

Titulación
type: DatatypeProperty
comment: La titulación que se requiere para la oferta de trabajo
domain: Oferta de Empleo
issued: 2010-10-01

Turno
type: DatatypeProperty
comment: Turno de la oferta
domain: Oferta de Empleo
issued: 2010-10-01

Jornada laboral
type: DatatypeProperty
comment: Jornada laboral que tendrá el puesto laboral de la oferta de empleo
domain: Oferta de Empleo
issued: 2012-09-01

Duración del contrato
type: DatatypeProperty
comment: Periodo de tiempo que durará el contrato ofertado
domain: Oferta de Empleo
issued: 2012-09-01

Salario
type: DatatypeProperty
comment: Salario y/o remuneraciones del contrato ofertado para el puesto
domain: Oferta de Empleo
issued: 2012-09-01

Requisito
type: DatatypeProperty
comment: Requisitos generales necesarios y/o deseados para acceder al puesto de trabajo
domain: Oferta de Empleo
issued: 2012-09-01

Experiencia
type: DatatypeProperty
comment: Experiencia mínima necesario para acceder al puesto de trabajo
domain: Oferta de Empleo
sub property of: Requisito
issued: 2012-09-01

Formación
type: DatatypeProperty
comment: Formación mínima necesaria y/o la formación deseada para acceder al puesto de trabajo
domain: Oferta de Empleo
sub property of: Requisito
issued: 2012-09-01

Idiomas
type: DatatypeProperty
comment: Conocimientos de idiomas necesarios y/o deseados para acceder al puesto de trabajo
domain: Oferta de Empleo
sub property of: Requisito
issued: 2012-09-01

Informática
type: DatatypeProperty
comment: Conocimientos de informática necesarios y/o deseados para acceder al puesto de trabajo
domain: Oferta de Empleo
sub property of: Requisito
issued: 2012-09-01

Anuncio de oferta
type: Class
subclass of: Document
comment: Un anuncio de una oferta de empleo
issued: 2010-10-01

Oferta de Empleo
type: Class
subclass of: Document
comment: Una oferta de empleo es un documento que describe los detalles de uno o más trabajos que deben ser cubiertos. Nótese que no es lo mismo un trabajo, que una oferta de trabajo.
issued: 2010-10-01

Plantilla de personal
type: Class
subclass of: synset-staff-noun-1
comment: La plantilla de personal es un grupo de personas contratadas bajo unas condiciones o estatutos similares
issued: 2010-10-01

Taxonomía de las categorías de las ofertas de empleo
type: ConceptScheme
comment: Esquema de conceptos de las diferentes categorías y subcategorías que puede tener una oferta de empleo
issued: 2012-09-01

ADMINISTRACIÓN
type: Concept
in scheme: Taxonomía de las categorías de las ofertas de empleo

AGRICULTURA / JARDINERÍA / ALIMENTACIÓN
type: Concept
in scheme: Taxonomía de las categorías de las ofertas de empleo

ALMACENES / REPONEDORES
type: Concept
in scheme: Taxonomía de las categorías de las ofertas de empleo

APRENDICES / PRIMER EMPLEO
type: Concept
in scheme: Taxonomía de las categorías de las ofertas de empleo

ARQUITECTURA / DISEÑO
type: Concept
in scheme: Taxonomía de las categorías de las ofertas de empleo

COMERCIAL / VENTAS
type: Concept
in scheme: Taxonomía de las categorías de las ofertas de empleo

COMUNICACIÓN / CULTURA / ENTRETENIMIENTO
type: Concept
in scheme: Taxonomía de las categorías de las ofertas de empleo

CONDUCTORES / TRANSPORTE
type: Concept
in scheme: Taxonomía de las categorías de las ofertas de empleo

CONSTRUCCIÓN
type: Concept
in scheme: Taxonomía de las categorías de las ofertas de empleo

DEPENDIENTES/INFORMACIÓN
type: Concept
in scheme: Taxonomía de las categorías de las ofertas de empleo

DERECHO/PSICOLOGÍA/CIENCIAS SOCIALES
type: Concept
in scheme: Taxonomía de las categorías de las ofertas de empleo

DIRECTIVOS
type: Concept
in scheme: Taxonomía de las categorías de las ofertas de empleo

EDUCACIÓN / SERVICIOS SOCIALES
type: Concept
in scheme: Taxonomía de las categorías de las ofertas de empleo

ELECTRICIDAD / ELECTRÓNICA / ENERGÍA
type: Concept
in scheme: Taxonomía de las categorías de las ofertas de empleo

FABRICAS / INDUSTRIAS
type: Concept
in scheme: Taxonomía de las categorías de las ofertas de empleo

HOSTELERÍA / TURISMO
type: Concept
in scheme: Taxonomía de las categorías de las ofertas de empleo

INFORMÁTICA/TELECOMUNICACIONES
type: Concept
in scheme: Taxonomía de las categorías de las ofertas de empleo

INGENIERÍA / CALIDAD / CIENCIAS
type: Concept
in scheme: Taxonomía de las categorías de las ofertas de empleo

LIMPIEZA / CUIDADO DE PERSONAS
type: Concept
in scheme: Taxonomía de las categorías de las ofertas de empleo

METAL / MECÁNICA
type: Concept
in scheme: Taxonomía de las categorías de las ofertas de empleo

PELUQUERÍA / ESTÉTICA
type: Concept
in scheme: Taxonomía de las categorías de las ofertas de empleo

SALUD / DEPORTE
type: Concept
in scheme: Taxonomía de las categorías de las ofertas de empleo

VIGILANCIA / SERVICIOS
type: Concept
in scheme: Taxonomía de las categorías de las ofertas de empleo

Taxonomía de los tipos de contrato de una oferta de empleo
type: ConceptScheme
comment: Esquema de conceptos de los tipos de contrato que puede tener una oferta de empleo
issued: 2012-09-01

Contrato laboral indefinido
type: Concept
in scheme: Taxonomía de los tipos de contrato de una oferta de empleo

Contrato laboral temporal
type: Concept
in scheme: Taxonomía de los tipos de contrato de una oferta de empleo

Contrato mercantil
type: Concept
in scheme: Taxonomía de los tipos de contrato de una oferta de empleo