Estructura de Información Interoperable de Aragón EI2A v.2
type: Ontology
creator: Dirección General de Administración Electrónica y Sociedad de la Información. Departamento de Ciencia, Universidad y Sociedad del Conocimiento. Gobierno de Aragón
rights: This work is licensed under a Creative Commons Attribution-ShareAlike 4.0 International. @en
comment: Esta sección detalla la ontología de Información Interoperable de Aragón EI2A para describir datos básicos del dominio del Gobierno de Aragón, destinados a apoyar la interoperabilidad de datos con el objetivo de estandarizar información y explotarla en un futuro. En la descripción de la ontología se incorpora un diagrama de clases o entidades de la ontología que permiten visualizar su organización más fácilmente, el espacio de nombres utilizado y las clases, propiedades e individuos que la componen. De acuerdo a las recomendaciones de la Web Semántica, la ontología EI2A reutiliza diversas ontologías, esquemas y vocabularios para describir entidades que se adecuen al dominio del Gobierno de Aragón. Reutilizar ontologías facilita el intercambio de conocimiento y la comunicación entre personas, agentes inteligentes y sistemas. De esta forma, se consigue describir los conceptos deseados del dominio del Gobierno de Aragón introduciendo un número mínimo de nuevos elementos.
comment: The initiative Aragón Open Data was initiated by agreement of 17 of July of 2012 of the Government of Aragon. Under the same was ordered the start of the project to open public data and on February 6, 2013 was implemented through the Portal opendata.aragon.es . Throughout this time there have been numerous works to achieve automation in the publication of information to ensure that third parties can reuse it in the best way. Given the volume of data that begins to exist, within the line of work of automation in information management, all those elements that help in the improvement of the structuring of information and the standardization of the data contained in the databases are beginning to have a special relevance. Based on this, within the General Directorate of Electronic Administration and Information Society, the idea arises of generating a set of technical and legal rules that allow to deepen in that standardization and that lead to think in the creation of the Interoperable Information Scheme Of Aragon (E2IA). The E2IA thus emerges as the framework in which the open data and in general the information of the Government of Aragon can begin to be automated in a much more profound way. The E2IA has to have a number of technical, organizational and legal elements that need to be developed. For this reason, the Technological Institute of Aragon (ITAINNOVA) has been entrusted with carrying out actions consisting in identifying, studying and analyzing current research trends and technological development in relation to ontologies and dictionaries of data interoperability, defining the ontological proposal, performing The necessary tests to validate the ontological proposal and generate the text and web versions of the ontology. @en
version info: 2.0.3
type: NamedIndividual
description: La iniciativa Aragón Open Data se inició por Acuerdo de 17 de julio de 2012 del Gobierno de Aragón. En virtud del mismo se ordenó el inicio del proyecto de apertura de datos públicos y el 6 de febrero de 2013 se implantó a través del Portal opendata.aragon.es. Uno de los resultados de la iniciativa es el modelo ontológico EI2A, que se presenta en su versión 2, simplificando la versión anterior para facilitar su reutilización y mantenimiento. En este sentido, el nuevo modelo reutiliza vocabularios y ontologías de referencia, minimizado las soluciones particulares. Este modelo se ha desarrollado en el ámbito del Proyecto de Evolución de la infraestructura semántica de la Aragón Open Data (2020-21)

subpropiedad de rdfs:comment
type: AnnotationProperty
sub property of: comment
type: DatatypeProperty
domain: Observación
range: string
comment: subpropiedad de rdfs:comment

Valor
type: AnnotationProperty
sub property of: label
type: DatatypeProperty
type: FunctionalProperty
domain: Componente
range: string
comment: Valor

Etiqueta
type: AnnotationProperty
range: string
domain: Concepto
type: DatatypeProperty
type: FunctionalProperty
comment: Etiqueta

Enlace inversa con normativa que modifica
type: ObjectProperty
domain: Recurso legal
range: Recurso legal
comment: Enlace inversa eli:amends

Normativa a la cual modifica
type: ObjectProperty
domain: Recurso legal
range: Recurso legal
comment: Enlace con normativa a la cual modifica

Enlace con tipo documento
type: ObjectProperty
type: FunctionalProperty
domain: Recurso legal
range: ELI Tipo de recurso
comment: Enlace con tipo documento

Enlace con Periodo
type: ObjectProperty
domain: Contrato
range: Period
comment: Enlace con Periodo

hasContractValue
type: ObjectProperty
domain: Contrato
range: Value
comment: Valor

Contrato
type: ObjectProperty
domain: Organización
range: Contrato
comment: Enlace con el contrato

Licitación
type: ObjectProperty
domain: Organización
range: Licitación
comment: Enlace con la licitación

Legislatura
type: ObjectProperty
domain: Organización
range: Legislatura
comment: Enlace con legislatura

Especificaciones de los componentes
type: ObjectProperty
domain: Definición de la estructura de datos
range: Especificación de componente
comment: Enlace a las especificaciones de los componentes

propiedades de componente
type: ObjectProperty
domain: Especificación de componente
range: Componente
comment: Enlace a la entidad raiz de propiedades de componente

Categorías
type: ObjectProperty
domain: Propiedad dimensión
range: Concepto
comment: Enlace con Categoria Skos

dataSet
type: ObjectProperty
domain: Observación
comment: Enlace al DataSet

Dimensión
type: ObjectProperty
domain: Especificación de componente
range: Propiedad dimensión
comment: Enlace a dimensión

Medidas
type: ObjectProperty
domain: Especificación de componente
range: Medida
comment: Enlace con medidas

Definición de estructura
type: ObjectProperty
type: FunctionalProperty
domain: Cube Dataset
range: Definición de la estructura de datos
comment: Enlace a la definición de la estructura

Colaborador
type: ObjectProperty
domain: Trabajo creativo
comment: Enlace con persona, colaborador

Documento al que pertenece
type: ObjectProperty
domain: Trabajo creativo
range: Trabajo creativo
comment: Enlace con documento al que pertenece

Parte de documento
type: ObjectProperty
domain: Trabajo creativo
range: Trabajo creativo
comment: Inversa de schema:hasPart

Lugar
type: ObjectProperty
domain: Evento
range: Lugar
comment: Enlace con lugar

Lugar de creación
type: ObjectProperty
domain: Trabajo creativo
range: Lugar
comment: Enlace con lugar de creación

Agencia
type: ObjectProperty
domain: Ruta
range: Empresa
comment: Agencia

Destino
type: ObjectProperty
type: FunctionalProperty
domain: Ruta
range: Parada
comment: Destino

Inicio
type: ObjectProperty
type: FunctionalProperty
domain: Ruta
range: Parada
comment: Inicio

Ruta
type: ObjectProperty
type: FunctionalProperty
domain: Viaje
comment: Enlace con ruta

routeType
type: ObjectProperty
type: FunctionalProperty
domain: Ruta
comment: Tipo de ruta

Parada
type: ObjectProperty
type: FunctionalProperty
domain: Hora de parada
range: Parada
comment: Parada

viaje
type: ObjectProperty
type: FunctionalProperty
domain: Hora de parada
range: Viaje
comment: Enlace con viaje

Padre
type: ObjectProperty
domain: Concepto
range: Concepto
comment: Apunta a las categorías padre

Categoría
type: ObjectProperty
domain: Ítem de una lista
range: Concepto
comment: Enlace categoría

Categorías raíz del tesauro
type: ObjectProperty
domain: Collection
range: Concepto
comment: Categorías raíz del tesauro

inXSDDateTimeStamp
type: ObjectProperty
type: FunctionalProperty
domain: Entidad temporal
range: dateTimeStamp
comment: null

Organización
type: ObjectProperty
domain: Lugar
comment: Enlace con organización

Evento modificación de organización
type: ObjectProperty
domain: Organización
range: Evento de cambio
comment: Enlace con evento modificación de organización

Categoría
type: ObjectProperty
type: FunctionalProperty
domain: Organización
range: Concepto
comment: Enlace categoría

Inversa Puesto
type: ObjectProperty
domain: Organización
range: Puesto
comment: Puesto, inversa de org:postIn

Centro
type: ObjectProperty
domain: Organización
range: Site
comment: Enlace con Centro

Enlace inverso a persona
type: ObjectProperty
type: FunctionalProperty
domain: Puesto
range: Persona
comment: Inversa de org:holds de persona

linkedTo
type: ObjectProperty
domain: Organización
range: Organización
comment: Organizacion relacionada
alternative label: Organizacion relacionada

Organización
type: ObjectProperty
domain: Class
  union of: ELI Agent
  union of: Contrato
  union of: Licitación
  union of: Trabajo creativo
  union of: Ítem de una lista
  union of: Empresa
range: Organización
comment: Enlace con organización

Organización que ha sido creada tras un evento
type: ObjectProperty
domain: Evento de cambio
range: Organización
comment: Organización que ha sido creada tras un evento, inversa org:resultedFrom

Enlace con organismo
type: ObjectProperty
domain: Puesto
range: Organización
comment: Indica la pertenencia a un organismo

Evento creación de organización
type: ObjectProperty
domain: Organización
range: Evento de cambio
comment: Enlace a evento creación de organización

Organización que ha sido modificada tras un evento
type: ObjectProperty
domain: Evento de cambio
range: Organización
comment: Organización que ha sido modificada tras un evento, inversa org:changedBy

Rol
type: ObjectProperty
type: FunctionalProperty
domain: Puesto
range: Rol
comment: Enlace con Rol

Dirección de la sede
type: ObjectProperty
domain: Class
  union of: Trabajo creativo
  union of: Parada
  union of: Lugar
  union of: Site
  union of: Característica de interés
range: Lugar
comment: Dirección de la sede según una codificación adecuada. Se recomienda el uso de vCard (que utiliza el vocabulario en vcard), pero el rango no se restringe únicamente al uso de este vocabulario sino que se permite el uso de otros códigos. La dirección puede constar de una dirección de correo electrónico, un número de teléfono o información de geo-localización, y no se limita a una dirección postal física
comment: Enlace con lugar
comment: Indicates an address for the site in a suitable encoding. Use of vCard (using the vcard vocabulary) is encouraged but the range is left open to allow other encodings to be used. The address may include email, telephone, and geo-location information and is not restricted to a physical address @en
label: Site address @en

Organización padre
type: ObjectProperty
domain: Organización
range: Organización
comment: Enlace con Organización padre

observacion
type: ObjectProperty
type: FunctionalProperty
domain: Característica de interés
range: Observación
comment: Enlace observacion

hasFeatureOfInterest
type: ObjectProperty
type: FunctionalProperty
domain: Observación
range: Característica de interés
comment: Enlace a hasFEatureOfInterest

phenomenonTime
type: ObjectProperty
type: FunctionalProperty
domain: Observación
range: Entidad temporal
comment: Enlace con sosa:phenomenonTime

geo
type: ObjectProperty
domain: Lugar
comment: Enlace con geo

distribution
type: ObjectProperty
domain: DCAT Dataset
comment: A specific representation of a dataset. @en
comment: Una representación específica de un conjunto de datos.

landingPage
type: ObjectProperty
domain: DCAT Dataset
comment: A Web page that can be navigated to in a Web browser to gain access to the catalog
comment: Una página web a la que se puede navegar en un navegador web para obtener acceso al catálogo

Fecha de aplicación
type: DatatypeProperty
domain: Class
  union of: Recurso legal
  union of: Trabajo creativo
range: dateTime
comment: Fecha de aplicación

Fecha de publicación
type: DatatypeProperty
domain: Class
  union of: Recurso legal
  union of: Trabajo creativo
range: dateTime
comment: Fecha de publicación

Texto
type: DatatypeProperty
type: FunctionalProperty
domain: Recurso legal
range: string
comment: Texto

Fecha de entrada en vigor
type: DatatypeProperty
domain: Class
  union of: Recurso legal
  union of: Trabajo creativo
range: dateTime
comment: Fecha de entrada en vigor

Tipo
type: DatatypeProperty
type: FunctionalProperty
domain: Recurso legal
range: string
comment: Tipo

Identificador
type: DatatypeProperty
domain: Recurso legal
range: string
comment: Identificador de la normativa

Agente
type: DatatypeProperty
type: FunctionalProperty
domain: Recurso legal
range: string
comment: Enlace con agente

Identificador
type: DatatypeProperty
type: FunctionalProperty
domain: Class
  union of: Contrato
  union of: Licitación
range: string
comment: Identificador

Descripción
type: DatatypeProperty
type: FunctionalProperty
domain: Class
  union of: Contrato
  union of: Licitación
range: string
comment: Descripción

Fecha de final
type: DatatypeProperty
domain: Period
range: dateTime
comment: Fecha de final

Fecha de inicio
type: DatatypeProperty
type: FunctionalProperty
domain: Period
range: dateTime
comment: Fecha de inicio

valueAmount
type: DatatypeProperty
type: FunctionalProperty
domain: Value
range: float
comment: ocds:valueAmount

isDefinedBy
type: DatatypeProperty
type: FunctionalProperty
domain: Cube Dataset
range: string
comment: subpropiedad de rdfs:isDefinedBy

Orden
type: DatatypeProperty
type: FunctionalProperty
domain: Class
  union of: Organización
  union of: Puesto
range: int
comment: Orden

Decreto
type: DatatypeProperty
domain: Trabajo creativo
range: string
comment: Decreto

Entidad relacionada
type: DatatypeProperty
sub property of: range
type: FunctionalProperty
domain: Componente
range: string
comment: Entidad relacionada

Fecha
type: DatatypeProperty
domain: Class
  union of: Viaje
  union of: Organización
  union of: Característica de interés
range: dateTime
comment: Fecha

Observaciones
type: DatatypeProperty
domain: Class
  union of: Viaje
  union of: Organización
  union of: DCAT Dataset
range: string
comment: Observaciones

Identificador
type: DatatypeProperty
domain: Class
  union of: Empresa
  union of: Ruta
  union of: Hora de parada
  union of: Viaje
  union of: Concepto
  union of: Organización
  union of: Rol
  union of: Site
  union of: Característica de interés
  union of: Persona
  union of: Puesto
range: string
comment: Identificador

Indentificador
type: DatatypeProperty
type: FunctionalProperty
domain: Class
  union of: Collection
  union of: Concepto
range: string
comment: Indentificador

Título
type: DatatypeProperty
domain: Class
  union of: Contrato
  union of: Licitación
  union of: Cube Dataset
  union of: Empresa
  union of: Ruta
  union of: Parada
  union of: Organización
  union of: Rol
  union of: Site
  union of: Característica de interés
  union of: DCAT Dataset
range: string
comment: Título

Indica la obligatoridad
type: DatatypeProperty
type: FunctionalProperty
domain: Especificación de componente
range: boolean
comment: Indica si la dimensión o medidas son requeridos

Orden
type: DatatypeProperty
type: FunctionalProperty
domain: Especificación de componente
range: int
comment: Indica el orden de las dimensiones o medidas

biografía
type: DatatypeProperty
domain: Persona
range: string
comment: Datos biográficos de la persona

Descripción
type: DatatypeProperty
domain: Class
  union of: Trabajo creativo
  union of: Lista de Item
  union of: Ítem de una lista
range: string
comment: Descripción

Bibliografía
type: DatatypeProperty
domain: Trabajo creativo
range: string
comment: Bibliografía

Creador
type: DatatypeProperty
domain: Trabajo creativo
range: string
comment: Creador

Descripción
type: DatatypeProperty
type: FunctionalProperty
domain: Evento
range: string
comment: Descripción

Fecha de fin
type: DatatypeProperty
domain: Class
  union of: Evento
  union of: Empresa
range: dateTime
comment: Fecha de fin

Horario del evento
type: DatatypeProperty
domain: Evento
range: string
comment: Horario literal del evento

Fecha de suspensión
type: DatatypeProperty
domain: Trabajo creativo
comment: Fecha de suspensión

Identificador
type: DatatypeProperty
domain: Class
  union of: Trabajo creativo
  union of: Evento
  union of: Lista de Item
  union of: Ítem de una lista
range: string
comment: Identificador

Imagen
type: DatatypeProperty
domain: Class
  union of: Trabajo creativo
  union of: Evento
range: string
comment: Url de la imagen

Idioma
type: DatatypeProperty
domain: Trabajo creativo
range: string
comment: Idioma

Licencia
type: DatatypeProperty
domain: Trabajo creativo
range: string
comment: Licencia

Material
type: DatatypeProperty
domain: Trabajo creativo
range: string
comment: Material

Nombre
type: DatatypeProperty
type: FunctionalProperty
domain: Evento
range: string
comment: Nombre

Editorial
type: DatatypeProperty
domain: Trabajo creativo
range: string
comment: Editorial

Tamaño
type: DatatypeProperty
domain: Trabajo creativo
range: string
comment: Tamaño

Fecha de inicio
type: DatatypeProperty
type: FunctionalProperty
domain: Class
  union of: Evento
  union of: Empresa
range: dateTime
comment: Fecha de inicio

Año
type: DatatypeProperty
domain: Trabajo creativo
range: string
comment: Literal de fecha (año)

Título
type: DatatypeProperty
type: FunctionalProperty
domain: Class
  union of: Trabajo creativo
  union of: Lista de Item
  union of: Ítem de una lista
range: string
comment: Título

URL
type: DatatypeProperty
domain: Trabajo creativo
range: string
comment: URL

Edición
type: DatatypeProperty
domain: Trabajo creativo
range: string
comment: Edición

Llegada
type: DatatypeProperty
domain: Hora de parada
range: dateTime
comment: Llegada

Latitud
type: DatatypeProperty
domain: Class
  union of: Parada
  union of: Lugar
range: float
comment: Latitud

Longitud
type: DatatypeProperty
domain: Class
  union of: Parada
  union of: Lugar
range: float
comment: Longitud

Tipo de documento
type: DatatypeProperty
type: FunctionalProperty
domain: ELI Tipo de recurso
range: string
comment: Tipo de documento

Fecha de inicio
type: DatatypeProperty
domain: Puesto
range: dateTime
comment: Fecha en la que finaliza la pertenicia al puesto

Fecha de fin
type: DatatypeProperty
domain: Puesto
range: dateTime
comment: Fecha en la que finaliza la pertenicia al puesto

Email
type: DatatypeProperty
domain: Lugar
range: string
comment: Email

Nombre
type: DatatypeProperty
domain: Lugar
range: string
comment: Nombre

Localidad
type: DatatypeProperty
domain: Lugar
range: string
comment: Localidad

Código postal
type: DatatypeProperty
domain: Lugar
range: int
comment: Código postal

Provincia
type: DatatypeProperty
domain: Lugar
range: string
comment: Provincia

Dirección
type: DatatypeProperty
domain: Lugar
range: string
comment: Dirección

Teléfono
type: DatatypeProperty
domain: Lugar
range: int
comment: Teléfono

Identificador de la organización
type: DatatypeProperty
type: FunctionalProperty
domain: Organización
range: string
comment: Identificador de la organización

Fecha de inicio del cambio
type: DatatypeProperty
type: FunctionalProperty
domain: Class
  union of: Evento de cambio
  union of: PROV Actividad
range: dateTime
comment: Fecha de inicio del cambio

hasResult
type: DatatypeProperty
type: FunctionalProperty
domain: Observación
range: string
comment: Resultado

Apellidos
type: DatatypeProperty
type: FunctionalProperty
domain: Persona
range: string
comment: Apellidos

Nombre persona
type: DatatypeProperty
type: FunctionalProperty
domain: Persona
range: string
comment: Nombre persona

Página web
type: DatatypeProperty
domain: Class
  union of: Organización
  union of: Persona
range: string
comment: Página web

Imagen de usuario
type: DatatypeProperty
domain: Persona
range: string
comment: Url de la imagen

Correo electrónico
type: DatatypeProperty
domain: Persona
range: string
comment: Correo electrónico

Nombre completo
type: DatatypeProperty
type: FunctionalProperty
domain: Class
  union of: Agente de software
  union of: Persona
range: string
comment: Nombre y apellidos de la persona

Teléfono
type: DatatypeProperty
domain: Persona
range: string
comment: Teléfono

ELI Agent
type: Class
subclass of: Thing
subclass of: Restriction
  on property: Organización
  min cardinality: 1
subclass of: Restriction
  on property: Organización
  max cardinality: 1
comment: Organización que genera una norma
comment: Organization that generates a law @en

Recurso legal
type: Class
subclass of: Thing
subclass of: Restriction
  on property: Enlace inversa con normativa que modifica
  max cardinality: 1
subclass of: Restriction
  on property: Normativa a la cual modifica
  max cardinality: 1
subclass of: Restriction
  on property: Fecha de publicación
  min cardinality: 1
subclass of: Restriction
  on property: Fecha de entrada en vigor
  min cardinality: 1
subclass of: Restriction
  on property: Fecha de aplicación
  max cardinality: 1
subclass of: Restriction
  on property: Fecha de publicación
  max cardinality: 1
subclass of: Restriction
  on property: Fecha de entrada en vigor
  max cardinality: 1
subclass of: Restriction
  on property: Identificador
  max cardinality: 1
comment: Laws modeled according the ELI ontology @en
comment: Normas modeladas según la ontología ELI
label: Legal resource @en

ELI Tipo de recurso
type: Class
comment: Representa el tipo de norma
comment: Represents the law type @en
label: ELI Resource type @en

Contrato
type: Class
subclass of: Thing
subclass of: Restriction
  on property: Organización
  min cardinality: 1
subclass of: Restriction
  on property: Organización
  max cardinality: 1
subclass of: Restriction
  on property: Título
  min cardinality: 1
subclass of: Restriction
  on property: Título
  max cardinality: 1
comment: It models the contract and its process @en
comment: Modela el contrato y su proceso
label: Contract @en

Licitación
type: Class
comment: Model for public tender @en
comment: Modelado de licitación publica
label: Tender @en

Legislatura
type: Class
subclass of: Evento
comment: Event that identifies a legislature of Aragon Government @en
comment: Evento que identifica a una legislatura del Gobierno de Aragón
label: Legislature @en

Componente
type: Class
comment: Indica una propiedad de un Dataset Cube. rdfs:Range indica el tipo de objeto. Ejemplo org:organization
comment: Indicates a property on a Dataset Cube. rdfs:Range indicates the object type. E.g.: org:organization @en
label: Component @en

Especificación de componente
type: Class
subclass of: Thing
subclass of: Restriction
  on property: Dimensión
  min cardinality: 1
subclass of: Restriction
  on property: Medidas
  min cardinality: 1
comment: Se usa para definir propiedades de un componente (atributo, dimensión, etc.) que son específicas de su uso en DataStructureDefinition
comment: Used to define properties of a component (attribute, dimension etc) which are specific to its usage in a DSD @en
label: Component specification @en

Cube Dataset
type: Class
subclass of: Thing
subclass of: Restriction
  on property: Título
  min cardinality: 1
subclass of: Restriction
  on property: Título
  max cardinality: 1
comment: Representa una colección de observaciones, conforme a una estructura de dimensiones común
comment: Represents a collection of observations, conforming to some common dimensional structure @en

Definición de la estructura de datos
type: Class
subclass of: Thing
subclass of: Restriction
  on property: Especificaciones de los componentes
  min cardinality: 1
comment: Define la estructura de un Dataset
comment: Defines the structure of a DataSet @en
label: Data Structure Definition @en

Propiedad dimensión
type: Class
subclass of: Componente
subclass of: Restriction
  on property: Categorías
  max cardinality: 1
comment: It represents the dimensions of the cube @en
comment: Representa las dimensiones de un cubo
label: Dimension property @en

Medida
type: Class
subclass of: Componente
comment: Represent the measured value of the phenomenon being observed @en
comment: Representa el valor medido para el fenómeno observado
label: Measure @en

Observación
type: Class
subclass of: Thing
subclass of: Restriction
  on property: dataSet
  min cardinality: 1
comment: A single observation in the cube, may have one or more associated measured values @en
comment: Una observación individual del cubo, puede tener una o más medidas asociadas
label: Observation @en

Trabajo creativo
type: Class
subclass of: Thing
subclass of: Restriction
  on property: Documento al que pertenece
  max cardinality: 1
subclass of: Restriction
  on property: Parte de documento
  max cardinality: 1
subclass of: Restriction
  on property: Lugar de creación
  max cardinality: 1
subclass of: Restriction
  on property: Organización
  max cardinality: 1
subclass of: Restriction
  on property: Dirección de la sede
  max cardinality: 1
subclass of: Restriction
  on property: Fecha de aplicación
  max cardinality: 1
subclass of: Restriction
  on property: Fecha de publicación
  max cardinality: 1
subclass of: Restriction
  on property: Fecha de entrada en vigor
  max cardinality: 1
subclass of: Restriction
  on property: Decreto
  max cardinality: 1
subclass of: Restriction
  on property: Bibliografía
  max cardinality: 1
subclass of: Restriction
  on property: Creador
  max cardinality: 1
subclass of: Restriction
  on property: Fecha de suspensión
  max cardinality: 1
subclass of: Restriction
  on property: Identificador
  max cardinality: 1
subclass of: Restriction
  on property: Imagen
  max cardinality: 1
subclass of: Restriction
  on property: Idioma
  max cardinality: 1
subclass of: Restriction
  on property: Licencia
  max cardinality: 1
subclass of: Restriction
  on property: Material
  max cardinality: 1
subclass of: Restriction
  on property: Editorial
  max cardinality: 1
subclass of: Restriction
  on property: Tamaño
  max cardinality: 1
subclass of: Restriction
  on property: Año
  max cardinality: 1
subclass of: Restriction
  on property: Edición
  max cardinality: 1
comment: The most generic kind of creative work, including books, movies, photographs, software programs, etc @en
comment: Tipo genérico de trabajo creativo, incluyendo libros, obras de artes, etc.
label: Creative work @en

Evento
type: Class
subclass of: Thing
subclass of: Restriction
  on property: Lugar
  max cardinality: 1
subclass of: Restriction
  on property: Fecha de fin
  max cardinality: 1
subclass of: Restriction
  on property: Horario del evento
  max cardinality: 1
subclass of: Restriction
  on property: Identificador
  max cardinality: 1
subclass of: Restriction
  on property: Imagen
  max cardinality: 1
comment: It models events such as holidays @en
comment: Modela eventos como los días festivos
label: Event @en

Lista de Item
type: Class
subclass of: Thing
subclass of: Restriction
  on property: nextItem
  max cardinality: 1
subclass of: Restriction
  on property: previousItem
  max cardinality: 1
subclass of: Restriction
  on property: Descripción
  min cardinality: 1
subclass of: Restriction
  on property: Descripción
  max cardinality: 1
subclass of: Restriction
  on property: Identificador
  max cardinality: 1
comment: A list of items of any sort, sucha as the steps of an administrative process @en
comment: Una lista de ítems de cualquier tipo, como los pasos de un trámite administrativo
label: Item List @en

Ítem de una lista
type: Class
subclass of: Thing
subclass of: Restriction
  on property: itemListElement
  min cardinality: 1
subclass of: Restriction
  on property: Categoría
  max cardinality: 1
subclass of: Restriction
  on property: Descripción
  min cardinality: 1
subclass of: Restriction
  on property: Identificador
  min cardinality: 1
subclass of: Restriction
  on property: Descripción
  max cardinality: 1
subclass of: Restriction
  on property: Identificador
  max cardinality: 1
comment: An list item, e.g. a step in an administrative process @en
comment: Un ítem de una lista, por ejemplo el paso de un trámite
label: List item @en

Empresa
type: Class
subclass of: Thing
subclass of: Restriction
  on property: Organización
  min cardinality: 1
subclass of: Restriction
  on property: Organización
  max cardinality: 1
comment: An agency operates a certain schedule based transport mode @en
comment: Una empresa opera un cierto modo de transporte de manera programada
label: Agency @en

Ruta
type: Class
subclass of: Thing
subclass of: Restriction
  on property: Agencia
  max cardinality: 1
comment: Es un grupo de viajes (gtfs:Trips) que se muestran a los usuarios como servicio independiente
comment: It is a commercial route followed entirely or partly by gtfs:Trips @en
label: Route @en

Parada
type: Class
subclass of: Thing
subclass of: Restriction
  on property: Dirección de la sede
  min cardinality: 1
subclass of: Restriction
  on property: Dirección de la sede
  max cardinality: 1
subclass of: Restriction
  on property: Título
  min cardinality: 1
subclass of: Restriction
  on property: Latitud
  min cardinality: 1
subclass of: Restriction
  on property: Longitud
  min cardinality: 1
subclass of: Restriction
  on property: Título
  max cardinality: 1
subclass of: Restriction
  on property: Latitud
  max cardinality: 1
subclass of: Restriction
  on property: Longitud
  max cardinality: 1
comment: A location where passengers board or disembark from a transit vehicle @en
comment: Un lugar donde los pasajeros suben o bajan de un vehículo de transporte público
label: Stop @en

Hora de parada
type: Class
subclass of: Thing
subclass of: Restriction
  on property: Identificador
  max cardinality: 1
subclass of: Restriction
  on property: Llegada
  max cardinality: 1
comment: Describe una hora de parada como parte de un viaje
comment: Describes a stop time as part of a trip @en
label: Stop time @en

Viaje
type: Class
subclass of: Thing
subclass of: Restriction
  on property: Fecha
  max cardinality: 1
comment: A collection of gtfs:StopTimes followed by a transit vehicle @en
comment: Trayecto de dos o más paradas realizadas por un vehículo que se produce a una gtfs:StopTime
label: Trip @en

Concepto
type: Class
comment: Used to classify entities, such as the organization types @en
comment: Utilizado para clasificar entidades, como los tipos de organizaciones
label: Concept @en

Entidad temporal
type: Class
comment: A temporal interval or instant @en
comment: Un instante o intervalo temporal
label: Temporal entity @en

Lugar
type: Class
subclass of: Thing
subclass of: Restriction
  on property: Dirección de la sede
  max cardinality: 1
subclass of: Restriction
  on property: Latitud
  max cardinality: 1
subclass of: Restriction
  on property: Longitud
  max cardinality: 1
subclass of: Restriction
  on property: Email
  max cardinality: 1
subclass of: Restriction
  on property: Nombre
  max cardinality: 1
subclass of: Restriction
  on property: Localidad
  max cardinality: 1
subclass of: Restriction
  on property: Código postal
  max cardinality: 1
subclass of: Restriction
  on property: Provincia
  max cardinality: 1
subclass of: Restriction
  on property: Dirección
  max cardinality: 1
subclass of: Restriction
  on property: Teléfono
  max cardinality: 1
comment: An object representing a named geographical place @en
comment: Un objeto que representa un sitio geográfico
label: Location @en

Evento de cambio
type: Class
subclass of: Thing
subclass of: Restriction
  on property: Organización que ha sido creada tras un evento
  max cardinality: 1
subclass of: Restriction
  on property: Organización que ha sido modificada tras un evento
  max cardinality: 1
comment: Evento que da como resultado un cambio sustancial en la organización, por ejemplo, una fusión o una reestructuración total. Está pensado para situaciones en las que la organización resultante es lo suficientemente distinta de las organizaciones originales, tiene una identidad distinta y una URI también distinta. Se deberían definir subtipos de eventos mediante vocabularios específicos (Extension vocabularies) para referirse a categorías de eventos específicos. El momento o periodo en el que el evento ocurre se debería expresar mediante las propiedades prov:startAtTime y prov:endedAtTime, y una descripción del mismo se debería incluir mediante el uso de la propiedad dct:description
comment: Represents an event which resulted in a major change to an organization such as a merger or complete restructuring. It is intended for situations where the resulting organization is sufficient distinct from the original organizations that it has a distinct identity and distinct URI. Extension vocabularies should define sub-classes of this to denote particular categories of event. The instant or interval at which the event occurred should be given by prov:startAtTime and prov:endedAtTime, a description should be given by dct:description @en
label: Change Event @en

Organización
type: Class
subclass of: Thing
subclass of: Restriction
  on property: Legislatura
  max cardinality: 1
subclass of: Restriction
  on property: Evento modificación de organización
  max cardinality: 1
subclass of: Restriction
  on property: Evento creación de organización
  max cardinality: 1
subclass of: Restriction
  on property: Organización padre
  max cardinality: 1
subclass of: Restriction
  on property: Título
  min cardinality: 1
subclass of: Restriction
  on property: Orden
  max cardinality: 1
subclass of: Restriction
  on property: Fecha
  max cardinality: 1
subclass of: Restriction
  on property: Observaciones
  max cardinality: 1
subclass of: Restriction
  on property: Identificador
  max cardinality: 1
subclass of: Restriction
  on property: Página web
  max cardinality: 1
comment: Grupo de personas que se organiza en una comunidad u otro tipo de estructura social, comercial o política. Dicho grupo tiene un objetivo o motivo común para su existencia que va más allá del conjunto de personas que lo forman y que puede actuar como Agente. A menudo las organizaciones se pueden agrupar en estructuras jerárquicas
comment: Represents a collection of people organized together into a community or other social, commercial or political structure. The group has some common purpose or reason for existence which goes beyond the set of people belonging to it and can act as an Agent. Organizations are often decomposable into hierarchical structures @en
label: Organization @en

Rol
type: Class
subclass of: Thing
subclass of: Restriction
  on property: Identificador
  min cardinality: 1
subclass of: Restriction
  on property: Título
  min cardinality: 1
subclass of: Restriction
  on property: Identificador
  max cardinality: 1
subclass of: Restriction
  on property: Título
  max cardinality: 1
comment: Denotes a role that a Person or other Agent can take in an organization. Instances of this class describe the abstract role; to denote a specific instance of a person playing that role in a specific organization use an instance of `org:Membership`. It is common for roles to be arranged in some taxonomic structure and we use SKOS to represent that @en
comment: Función que una persona o agente desempeña en el seno de una organización. Las instancias de esta clase describen la actividad en abstracto; si lo que se pretende es incluir una instancia que refleje la función o actividad que desempeña una persona en concreto en una organización específica, se indica el uso de instancias de la clase org:Membership. Es común que dichas actividades se representen en una estructura taxonómica mediante SKOS
label: Role @en

Site
type: Class
subclass of: Thing
subclass of: Restriction
  on property: Dirección de la sede
  max cardinality: 1
subclass of: Restriction
  on property: Identificador
  min cardinality: 1
subclass of: Restriction
  on property: Identificador
  max cardinality: 1
subclass of: Restriction
  on property: Título
  max cardinality: 1

PROV Actividad
type: Class
comment: An activity is something that occurs over a period of time and acts upon or with entities; it may include consuming, processing, transforming, modifying, relocating, using, or generating entities @en
comment: Una actividad ocurre en un periodo de tiempo y actúa con o sobre entidades; puede incluir consumir, procesar, transformar, modificar, mover, usar o generar entidades del grafo
label: PROV Activity @en

Agente de software
type: Class
comment: A software agent is running software that provides data to the graph @en
comment: Es un software en ejecución que proporciona datos al grafo
label: Software Agent @en

Característica de interés
type: Class
subclass of: Thing
subclass of: Restriction
  on property: Dirección de la sede
  min cardinality: 1
subclass of: Restriction
  on property: Dirección de la sede
  max cardinality: 1
subclass of: Restriction
  on property: Fecha
  min cardinality: 1
subclass of: Restriction
  on property: Identificador
  min cardinality: 1
subclass of: Restriction
  on property: Título
  min cardinality: 1
subclass of: Restriction
  on property: Fecha
  max cardinality: 1
subclass of: Restriction
  on property: Identificador
  max cardinality: 1
subclass of: Restriction
  on property: Título
  max cardinality: 1
comment: La entidad cuya propiedad está siendo estimada o calculada en el curso de una Observation como parte de una recogida de datos
comment: The thing whose property is being estimated or calculated in the course of an Observation to arrive at a Result or whose property is being manipulated by an Actuator, or which is being sampled or transformed in an act of Sampling @en
label: Feature of Interest @en

Observación
type: Class
subclass of: Thing
subclass of: Restriction
  on property: subpropiedad de rdfs:comment
  max cardinality: 1
comment: Act of carrying out an (Observation) Procedure to estimate or calculate a value of a property of a FeatureOfInterest. Links to a Sensor to describe what made the Observation and how; links to an ObservableProperty to describe what the result is an estimate of, and to a FeatureOfInterest to detail what that property was associated with @en
comment: Acto de llevar a cabo una observación. Procedimiento para estimar o calcular el valor de una propiedad de un FeatureOfInterest. Enlaza con un Sensor para describir que hizo la Observación y cómo, enlaza con una ObservableProperty para describir de que estimación es el resultado y con un FeatureOfInterest para detallar con que propiedad estaba asociada
label: Observation @en

Persona
type: Class
subclass of: Thing
subclass of: Restriction
  on property: Identificador
  max cardinality: 1
subclass of: Restriction
  on property: biografía
  max cardinality: 1
subclass of: Restriction
  on property: Correo electrónico
  max cardinality: 1
subclass of: Restriction
  on property: Teléfono
  max cardinality: 1
comment: La clase Persona representa gente, con la condición de que sean personas, con independencia de que estén vivas o muertas, o reales o imaginarias. Es una subclase de Agent
comment: The Person class represents people. Something is a Person if it is a person. We don't nitpic about whether they're alive, dead, real, or imaginary. The Person class is a sub-class of the Agent class, since all people are considered agents in FOAF @en
label: Person @en

Puesto
type: Class
subclass of: Thing
subclass of: Restriction
  on property: Identificador
  min cardinality: 1
subclass of: Restriction
  on property: Identificador
  max cardinality: 1
subclass of: Restriction
  on property: Fecha de inicio
  max cardinality: 1
subclass of: Restriction
  on property: Fecha de fin
  max cardinality: 1
comment: Post with the beginning and ending dates @en
comment: Puesto con las fechas de inicio y fin
label: Post @en

DCAT Dataset
type: Class
subclass of: Thing
subclass of: Restriction
  on property: distribution
  max cardinality: 1
subclass of: Restriction
  on property: landingPage
  max cardinality: 1
subclass of: Restriction
  on property: Título
  min cardinality: 1
subclass of: Restriction
  on property: Observaciones
  max cardinality: 1
subclass of: Restriction
  on property: Título
  max cardinality: 1
comment: A collection of data, published or curated by a single agent, and available for access or download in one or more representations (from CKAN) @en
comment: Una colección de datos, publicado o curado por un agente y disponible para ser accedio o descargado en una o más representaciones (de CKAN)

Categoría
type: NamedIndividual
type: Concepto
comment: Enlace con la categoría correspondiente