hasDiscreteQuantityWithUnit
type: DatatypeProperty
comment: The discrete quantity with unit
domain: EDIFACT Item
range: string
subPropertyOf: topDataProperty
term status: stable
seeXML: Diskrete_Menge_Einheit

orderCurrency
type: DatatypeProperty
comment: The name or symbol of the monetary unit used in an order.
domain: InvoiceDetails
range: string
subPropertyOf: currency
term status: stable
seeXML: WaehrungBestellung

hasNetWeight
type: DatatypeProperty
comment: Weight (mass) of the goods themselves without any packing
domain: EDIFACT Item
range: string
subPropertyOf: topDataProperty
term status: stable
seeXML: Nettonettogewicht

contactPersonCreditorAccounting
type: DatatypeProperty
comment: Department/person responsible for the accounts payable function within a corporation
domain: FormalOrganization
range: string
subPropertyOf: contactPerson
term status: stable
seeEDIFACT: CTA+AP
seeXML: Ansprechpartner_Kreditorenbuchhaltung

timePeriod
type: DatatypeProperty
comment: Contains a time Period
domain: InvoiceContent
range: string
subPropertyOf: topDataProperty
term status: stable

withoutCalculationQuantity
type: DatatypeProperty
comment: Quantity of goods which are free of charge.
domain: EDIFACT Item
range: string
subPropertyOf: quantity
term status: stable
seeXML: Menge_ohne_Berechnung

currency
type: DatatypeProperty
comment: shows the currency
domain: InvoiceContent
range: string
subPropertyOf: topDataProperty
term status: stable

dataExchangeCounter
type: DatatypeProperty
comment: the counter of the exchanged data
domain: EDIFACT-Structure
range: string
subPropertyOf: topDataProperty
term status: stable
seeEDIFACT: 36
seeXML: D_0036

deliveryCondition
type: DatatypeProperty
comment: Specifies the conditions under which the goods must be delivered to the consignee
domain: InvoiceDetails
range: string
subPropertyOf: topDataProperty
term status: stable
seeXML: Lieferbedingung

senderIndicator
type: DatatypeProperty
comment: Indicator who the sender is
domain: EDIFACT-Structure
range: string
term status: stable
seeXML: D_0004

fileLineIdentifier
type: DatatypeProperty
comment: Number assigned by the file issuer or sender to identify a specific line.
domain: InvoiceContent
range: string
subPropertyOf: identifier
term status: stable
seeXML: Bezeichner_Dateizeilen @de

hasAmountDueOrPayable
type: DatatypeProperty
comment: Amount to be paid
domain: InvoiceContent
range: float
subPropertyOf: amount
term status: stable
seeXML: Faelliger_Betrag_oder_zahlbarerBetrag

hasQuantityUnit
type: DatatypeProperty
comment: Contains measure unit qualifier of a quantity
domain: EDIFACT Item
range: string
subPropertyOf: hasUnit
term status: stable
seeXML: D_QTYMaEinheit

itemName
type: DatatypeProperty
comment: Description of the item
domain: EDIFACT Item
range: string
subPropertyOf: topDataProperty
term status: stable
seeXML: D_7008

hasDocumentNumber
type: DatatypeProperty
comment: Document/message number
domain: InvoiceDetails
range: string
subPropertyOf: noteNumber
term status: stable
seeXML: Dokumentennummer

RegulatorRole
type: Class
comment: The role of the party which is the regulator of the invoice
subclass of: AgentRole
term status: stable

reportingInformation
type: DatatypeProperty
comment: The free text contains information for regulatory authority.
domain: InvoiceContent
range: string
subPropertyOf: topDataProperty
term status: stable
seeXML: Meldeinformationen

hasInvoicePercentage
type: DatatypeProperty
comment: Percentage used in the whole invoice
domain: InvoiceContent
range: float
subPropertyOf: percentage
term status: stable
seeXML: RechnungsProzentsatz

hasCity
type: DatatypeProperty
comment: Cotains the city name of a party involved in the invoice
domain: FormalOrganization
range: string
subPropertyOf: topDataProperty
term status: stable
seeXML: D_3164

itemNumberSupplier
type: DatatypeProperty
comment: Number assigned to an article by the supplier of that article.
domain: EDIFACT Item
range: string
subPropertyOf: noteNumber
term status: stable
seeXML: Artikelnummer_des_Lieferanten

hasInvoiceDetails
type: ObjectProperty
comment: Contains the Invoice Details of an Invoice
domain: E-Invoice
range: InvoiceDetails
subPropertyOf: topObjectProperty
term status: stable
inverseOf: isInvoiceDetailsOf

numberOfBundleMessages
type: DatatypeProperty
comment: A batch number identifying a batch of messages.
domain: InvoiceContent
range: string
subPropertyOf: identifier
term status: stable
seeXML: Nummer_eines_Buendels_von_Nachrichten

paymentCurrency
type: DatatypeProperty
comment: The name or symbol of the monetary unit used for payment.
domain: InvoiceContent
range: string
subPropertyOf: currency
term status: stable
seeXML: WaehrungZahlung

dateHarmonisedSystemNumber
type: DatatypeProperty
comment: Date of the number specifying the goods classification under the Harmonised Commodity Description and Coding System of the Customs Co-operation Council (CCC).
domain: InvoiceContent
range: string
subPropertyOf: referenceDate
term status: stable
seeXML: Referenzdatum_Nummer_harmonisiertes_System

consumerUnitsInTradingUnitQuantityWithUnit
type: DatatypeProperty
comment: Numbers of consumer units in the traded unit
domain: EDIFACT Item
range: string
subPropertyOf: topDataProperty
term status: stable
seeXML: Anzahl_der_Verbrauchereinheiten_in_einer_Handelseinheit

calculationPeriod
type: DatatypeProperty
comment: Period for which an invoice is issued.
domain: InvoiceContent
range: string
subPropertyOf: timePeriod
term status: stable
seeXML: Abechnungszeitraum

exportReferenceNumber
type: DatatypeProperty
comment: Reference number given to an export shipment.
domain: InvoiceContent
range: string
subPropertyOf: noteNumber
term status: stable
seeXML: Exportreferenznummer

dateReferenceNumberBusinessContactExtractEANCode
type: DatatypeProperty
comment: Date of the reference number for a business account statement as EAN code
domain: InvoiceContent
range: string
subPropertyOf: referenceDate
term status: stable
seeXML: Referenzdatum_Referenznummer_zu_einem_Geschaeftskontauszug_EAN_Code

InvoiceContent
type: Class
type: AnnotationProperty
comment: Defined as the union of the classes Item and InvoiceDetails
label: Invoice Content
subPropertyOf: E-Invoice
term status: stable

specificationNumber
type: DatatypeProperty
comment: Number assigned by the issuer to his specification.
domain: InvoiceContent
range: string
subPropertyOf: noteNumber
term status: stable
seeXML: Spezifikationsnummer

hasGeneralInformation
type: DatatypeProperty
comment: Contains general information about the Invoice or a Item
domain: InvoiceContent
range: string
subPropertyOf: topDataProperty
term status: stable
seeXML: Generelle_Informationen

hasVATIdentifierBuyer
type: DatatypeProperty
comment: Unique number assigned by the relevant tax authority to identify the buyer for use in relation to Value Added Tax (VAT).
domain: FormalOrganization
range: string
subPropertyOf: VATIdentifier
term status: stable
seeXML: Umsatzsteuernummer_Kaeufer

hasPriceType
type: DatatypeProperty
comment: Identification pricing specification
domain: EDIFACT Item
range: string
subPropertyOf: topDataProperty
term status: stable
seeXML: PreisArt

noDiscountAllowance
type: DatatypeProperty
comment: No increases or reduction in price (list or stated) are included.
domain: InvoiceContent
range: string
term status: stable
seeXML: Kein_Abschlag_Zuschlag

dateRelatedDocumentNumber
type: DatatypeProperty
comment: Date of the realted document number
domain: InvoiceContent
range: string
subPropertyOf: referenceDate
term status: stable
seeXML: Referenzdatum_zugehoerige_Dokumentennummer

contractNumber
type: DatatypeProperty
comment: Reference number of a contract concluded between parties.
domain: FormalOrganization
range: string
subPropertyOf: noteNumber
term status: stable
seeXML: Vertragsnummer

hasUnitPrice
type: DatatypeProperty
comment: Reporting monetary amount is a 'per unit' amount
domain: EDIFACT Item
range: float
subPropertyOf: amount
term status: stable
seeXML: Preis_pro_Einheit

harmonisedSystem
type: DatatypeProperty
comment: Contains the number of the harmonised system
domain: EDIFACT Item
range: string
subPropertyOf: noteNumber
term status: stable
seeXML: Harmonisiertes_System

itemNumberBuyer
type: DatatypeProperty
comment: Item number assigned by the buyer to identify an article.
domain: EDIFACT Item
range: string
subPropertyOf: noteNumber
term status: stable
seeXML: Artikelnummer_des_Kaeufer

returnQuantity
type: DatatypeProperty
comment: The return quantity
domain: EDIFACT Item
range: string
subPropertyOf: quantity
term status: stable
seeXML: Menge_Retour

FormalOrganization
type: Class
comment: An Organization which is recognized in the world at large, in particular in legal jurisdictions, with associated rights and responsibilities. Examples include a Corporation, Charity, Government or Church. Note that this is a super class of `gr:BusinessEntity` and it is recommended to use the GoodRelations vocabulary to denote Business classifications such as DUNS or NAICS."""@en
term status: stable

dateProformaInvoiceNumber
type: DatatypeProperty
comment: Date of the reference number assigned by the seller to a Proforma Invoice.
domain: InvoiceContent
range: string
subPropertyOf: referenceDate
term status: stable
seeXML: Referenzdatum_Proforma_Rechnungsnummer

dateContractNumberBuyer
type: DatatypeProperty
comment: Date of the reference number assigned by buyer to a contract.
domain: InvoiceContent
range: string
subPropertyOf: referenceDate
term status: stable
seeXML: Referenzdatum_Vertragsnummer_des_Kaeufers

hasTransportRestriction
type: DatatypeProperty
comment: A measurement indicating limitations in relation to transportation equipment.
domain: EDIFACT Item
range: string
subPropertyOf: topDataProperty
term status: stable
seeXML: Beschraekung_Transportmittels

hasDocumentType
type: DatatypeProperty
comment: Document/message identifier expressed
domain: InvoiceDetails
range: string
subPropertyOf: topDataProperty
term status: stable
seeXML: Dokumentenname

hasTotalAmountMessage
type: DatatypeProperty
comment: The total Amount of the Message
domain: InvoiceDetails
range: float
subPropertyOf: amount
term status: stable
seeXML: Gesamtbetrag_Nachricht

hasVATamount
type: DatatypeProperty
comment: Amount in national currency resulting from the application, at the appropriate rate, of value added tax (or similar tax) to the invoice amount subject to such tax
domain: InvoiceContent
range: float
subPropertyOf: amount
term status: stable
seeXML: Mehrwertsteuer_Betrag

dateNumberConsolidatedInvoiceEANCode
type: DatatypeProperty
comment: Date of the consolidated invoice number with EAN code
domain: InvoiceContent
range: string
subPropertyOf: referenceDate
term status: stable
seeXML: Referenzdatum_Nummer_einr_konsolidierten_Rechnung_EAN_Code

positionLineNumber
type: DatatypeProperty
comment: Number of the Position of the Line in the whole message
domain: EDIFACT Item
range: string
subPropertyOf: noteNumber
term status: stable
seeXML: Positionszeilennummer

contactPerson
type: DatatypeProperty
comment: Contact Persons
domain: FormalOrganization
range: string
subPropertyOf: topDataProperty
term status: stable

SellerRole
type: Class
comment: The role of the party selling merchandise to a buyer.
subclass of: AgentRole
term status: stable

despatchAdviceNumber
type: DatatypeProperty
comment: Reference number assigned by issuing party to a despatch advice.
domain: InvoiceContent
range: string
subPropertyOf: noteNumber
term status: stable
seeXML: Nummer_Lieferschein

allowanceReason
type: DatatypeProperty
comment: Reason for the allowance
domain: InvoiceContent
range: string
term status: stable
seeXML: Zuschlag

contactPersonTelefonNumber
type: DatatypeProperty
comment: Voice/data transmission by telephone
domain: FormalOrganization
range: string
subPropertyOf: contactPerson
term status: stable
seeEDIFACT: COM+:TE
seeXML: Ansprechpartner_TelefonNummer

percentage
type: DatatypeProperty
comment: Contains percentage
domain: InvoiceContent
range: string
subPropertyOf: topDataProperty
term status: stable

disjointWith
type: AnnotationProperty

contactPersonReceivableAccounting
type: DatatypeProperty
comment: Department/person responsible for the accounts receivable within a corporation
domain: FormalOrganization
range: string
subPropertyOf: contactPerson
term status: stable
seeEDIFACT: CTA+AR
seeXML: Ansprechpartner_Debitorenbuchaltung

promotionalVariantNumber
type: DatatypeProperty
comment: Number of the promotional variant number
domain: EDIFACT Item
range: string
subPropertyOf: noteNumber
term status: stable
seeXML: Nummer_der_Aktionsvariante

globalLocationNumber
type: DatatypeProperty
comment: The Global Location Number of a party involved in the invoice
domain: FormalOrganization
range: string
subPropertyOf: topDataProperty
term status: stable
seeXML: D_3039

contactPersonFaxNumber
type: DatatypeProperty
comment: Device used for transmitting and reproducing fixed graphic material (as printing) by means of signals over telephone lines or other electronic transmission media.
domain: FormalOrganization
range: string
subPropertyOf: contactPerson
term status: stable
seeEDIFACT: COM+:FX
seeXML: Ansprechpartner_TelefaxNummer

hasVATIdentifierSupplier
type: DatatypeProperty
comment: Unique number assigned by the relevant tax authority to identify the supplier for use in relation to Value Added Tax (VAT).
domain: FormalOrganization
range: string
subPropertyOf: VATIdentifier
term status: stable
seeXML: Umsatzsteuernummer_Lieferant

dateCreditNoteNumber
type: DatatypeProperty
comment: Date of the reference number assigned to a credit note.
domain: InvoiceContent
range: string
subPropertyOf: referenceDate
term status: stable
seeXML: Referenzdatum_Gutschriftsnummer

discountTerminationDate
type: DatatypeProperty
comment: Date/time when the deduction from an amount comes to an end.
domain: InvoiceContent
range: string
subPropertyOf: date
term status: stable
seeXML: Datum_Rabattbeendigung

otherServiceInformation
type: DatatypeProperty
comment: General information created by the sender of general or specific value.
domain: InvoiceContent
range: string
subPropertyOf: topDataProperty
term status: stable
seeXML: Andere_Serviceinformationen

taxPeriod
type: DatatypeProperty
comment: Period a tax rate/tax amount etc. is applicable.
domain: InvoiceContent
range: string
subPropertyOf: timePeriod
term status: stable
seeXML: Steuerperiode

hasTAXrate
type: DatatypeProperty
comment: Contains the TAX rate
domain: InvoiceContent
range: string
subPropertyOf: topDataProperty
term status: stable

exchangeRateDate
type: DatatypeProperty
comment: Date/time on which the exchange rate was fixed.
domain: InvoiceContent
range: string
subPropertyOf: date
term status: stable
seeXML: Wechselkursdatum

contactPersonX400Number
type: DatatypeProperty
comment: CCITT Message handling system
domain: FormalOrganization
range: string
subPropertyOf: contactPerson
term status: stable
seeEDIFACT: COM+:XF
seeXML: Ansprechpartner_X400Nummer

invoicedQuantityUnitOfMeasure
type: DatatypeProperty
comment: The quantity as per invoice.
domain: EDIFACT Item
range: string
subPropertyOf: topDataProperty
term status: stable
seeXML: Berechnete_Menge_Einheit

SalesAgentRole
type: Class
comment: The role of the third party who arranged the purchase of merchandise on behalf of the actual buyer
subclass of: AgentRole
term status: stable

contactPersonEmailAddress
type: DatatypeProperty
comment: Creating/sending/receiving of unstructured free text messages or documents using computer network, a mini- computer or an attached modem and regular telephone line or other electronic transmission media.
domain: FormalOrganization
range: string
subPropertyOf: contactPerson
term status: stable
seeEDIFACT: COM+:EM
seeXML: Ansprechpartner_EmailAdresse

totalNumberOfSegments
type: DatatypeProperty
comment: The total number of the segments
domain: EDIFACT-Structure
range: integer
subPropertyOf: topDataProperty
term status: stable
seeXML: D_0074

bilateralAgreed
type: DatatypeProperty
comment: Note contains information mutually defined by trading partners
domain: InvoiceContent
range: string
subPropertyOf: topDataProperty
term status: stable
seeXML: Bilateral_vereinbart

hasAllowancePercentagePaymentConditions
type: DatatypeProperty
comment: Allowance expressed as a percentage with payment condition
domain: InvoiceContent
range: float
subPropertyOf: percentage
term status: stable
seeXML: AbschlagProzentsatzZahlungsbedingungen

hasChargeAmount
type: DatatypeProperty
comment: The amont of the charge
domain: InvoiceContent
range: float
subPropertyOf: amount
term status: stable
seeXML: Zuschlagsbetrag

financialAccountNumberPayee
type: DatatypeProperty
comment: Receiving company account number (ACH transfer), check, draft or wire
domain: InvoiceContent
range: string
subPropertyOf: noteNumber
term status: stable
seeXML: Kontonummer_des_Zahlungsempfaenger

importLicenseNumber
type: DatatypeProperty
comment: Reference number assigned by the issuing authority to an Import Licence.
domain: FormalOrganization
range: string
subPropertyOf: noteNumber
term status: stable
seeXML: Import_Lizenznummer @de

hasStreetAddress
type: DatatypeProperty
comment: Cotains the street address of a party involved in the invoice
domain: FormalOrganization
range: string
subPropertyOf: topDataProperty
term status: stable
seeXML: D_3042

loadPeriod
type: DatatypeProperty
comment: Period a specified charge is valid for.
domain: InvoiceContent
range: string
subPropertyOf: timePeriod
term status: stable
seeXML: Belastungsperiode

hasTaxableAmount
type: DatatypeProperty
comment: Amount for tax calculation
domain: InvoiceContent
range: float
subPropertyOf: amount
term status: stable
seeXML: Steuerpflichtiger_Betrag

countrySubdivision
type: DatatypeProperty
comment: The subdivion of the country the organization is allocated in
domain: FormalOrganization
range: string
subPropertyOf: topDataProperty
term status: stable
seeXML: D_3229

hasVATIdentifierInvoicee
type: DatatypeProperty
comment: Unique number assigned by the relevant tax authority to identify the invoicee for use in relation to Value Added Tax (VAT).
domain: FormalOrganization
range: string
subPropertyOf: VATIdentifier
term status: stable
seeXML: Umsatzsteuernummer_Rechnungsempfaenger

dateOfferNumber
type: DatatypeProperty
comment: Date of the reference number assigned by issuing party to an offer.
domain: InvoiceContent
range: string
subPropertyOf: referenceDate
term status: stable
seeXML: Referenzdatum_Angebotsnummer

descriptionOfGoods
type: DatatypeProperty
comment: Plain language description of the nature of the goods sufficient to identify them at the level required for banking, Customs, statistical or transport purposes, avoiding unnecessary detail (Generic term).
domain: InvoiceContent
range: string
subPropertyOf: topDataProperty
term status: stable
seeXML: Warenbeschreibung

hasFunctionInInvoice
type: DatatypeProperty
comment: Describes the role of a party involved in the invoice
domain: FormalOrganization
range: string
subPropertyOf: topDataProperty
term status: stable
seeXML: D_PaFu

dateOrderNumberBuyer
type: DatatypeProperty
comment: Date of the reference number assigned by the buyer to an order.
domain: InvoiceContent
range: string
subPropertyOf: referenceDate
term status: stable
seeXML: Referenzdatum_Auftragsnummer_Kaeufer

BrokerSalesOfficeRole
type: Class
comment: The role of a party acting in the name of the seller as broker or as sales office.
subclass of: AgentRole
term status: stable

hasBasicTaxAmount
type: DatatypeProperty
comment: The amount specified is the basis for duty/tax or fee.
domain: InvoiceDetails
range: float
subPropertyOf: amount
term status: stable
seeXML: Steuergrundbetrag

hasDocumentFunction
type: DatatypeProperty
comment: Indicates the function of the message
domain: InvoiceDetails
range: string
subPropertyOf: topDataProperty
term status: stable
seeXML: Dokumentenfunktion

EDIFACT-Structure
type: Class
type: AnnotationProperty
comment: Contains all the information which are necessary for the invoice to be a valid EDIFACT Invoice
subPropertyOf: E-Invoice
term status: stable
disjointWith: InvoiceContent

hasPrepaidAmount
type: DatatypeProperty
comment: Amount which has been prepaid in advance
domain: InvoiceContent
range: float
subPropertyOf: amount
term status: stable
seeXML: Vorausbezahlter_Betrag

invoicedQuantity
type: DatatypeProperty
comment: The quantity as per invoice.
domain: EDIFACT Item
range: string
subPropertyOf: quantity
term status: stable
seeXML: Menge_Berechnet

deliveredQuantity
type: DatatypeProperty
comment: Number of pieces actually received at the final destination.
domain: EDIFACT Item
range: string
subPropertyOf: quantity
term status: stable
seeXML: Menge_Geliefert

fiscalNumber
type: DatatypeProperty
comment: Tax payer's number. Number assigned to individual persons as well as to corporates by a public institution; this number is different from the VAT registration number.
domain: FormalOrganization
range: string
subPropertyOf: noteNumber
term status: stable
seeXML: Steuernummer

contactPersonPurchasingDepartment
type: DatatypeProperty
comment: Department/person responsible for issuing this purchase order.
domain: FormalOrganization
range: string
subPropertyOf: contactPerson
term status: stable
seeEDIFACT: CTA+PD
seeXML: Ansprechpartner_Einkaufabteilung

additionalPartnerIdentificationEANCode
type: DatatypeProperty
comment: Additional Partneridentification (GLN-Code)
domain: FormalOrganization
range: string
subPropertyOf: identifier
term status: stable
seeXML: Zusaetzliche_Partneridentifikation_EAN_Code

dateAccountsReceivableNumber
type: DatatypeProperty
comment: Date of the reference number assigned by accounts receivable department to the account of a specific debtor.
domain: InvoiceContent
range: string
subPropertyOf: referenceDate
term status: stable
seeXML: Referenzdatum_Nummer_des_Forderungskontos

recipientIndicator
type: DatatypeProperty
comment: Indiactor whos the recipient of the message
domain: EDIFACT-Structure
range: string
subPropertyOf: topDataProperty
term status: stable
seeXML: D_0010

isStandardOf
type: ObjectProperty
comment: shows of which invoice the EDIFACT Structure is
domain: EDIFACT-Structure
range: E-Invoice
subPropertyOf: topObjectProperty
term status: stable

dateInternalCustomerNumber
type: DatatypeProperty
comment: Date of the number assigned by a seller, supplier etc. to identify a customer within his enterprise.
domain: InvoiceContent
range: string
subPropertyOf: referenceDate
term status: stable
seeXML: Referenzdatum_Interne_Kundennummer

hasTotalAmountUnderPaymentReduction
type: DatatypeProperty
comment: Part of the invoice amount which is subject to payment discount.
domain: InvoiceContent
range: float
subPropertyOf: amount
term status: stable
seeXML: Gesamtbetrag_unterliegt_Zahlungskuerzung

PayeeRole
type: Class
comment: The role of the party initiating payment
subclass of: AgentRole
term status: stable

noteNumber
type: DatatypeProperty
comment: identifier which is a number
domain: InvoiceContent
range: string
subPropertyOf: identifier
term status: stable

hasChargePercentagePaymentConditions
type: DatatypeProperty
comment: Charge expressed as a percentage with the payment conditions
domain: InvoiceContent
range: string
subPropertyOf: percentage
term status: stable
seeXML: ZuschlagProzentsatzZahlungsbedingungen

relatedDocumentNumber
type: DatatypeProperty
comment: Related document number
domain: InvoiceContent
range: string
subPropertyOf: identifier
term status: stable
seeXML: zugehoerige_Dokumentennummer

contactPersonSalesDepartment
type: DatatypeProperty
comment: The sales representative or department contact within an organization.
domain: FormalOrganization
range: string
subPropertyOf: contactPerson
term status: stable
seeEDIFACT: CTA+SR
seeXML: Ansprechpartner_Verkaufsabteilung

beneficiaryReference
type: DatatypeProperty
comment: Reference of the beneficiary
domain: FormalOrganization
range: string
subPropertyOf: identifier
term status: stable
seeXML: Referenz_des_Beguenstigten

effectiveDate
type: DatatypeProperty
comment: Date and/or time at which specified event or document becomes effective.
domain: InvoiceContent
range: string
subPropertyOf: date
term status: stable
seeXML: Gueltigkeitsdatum

proformaInvoiceNumber
type: DatatypeProperty
comment: Reference number assigned by the seller to a Proforma Invoice.
domain: InvoiceDetails
range: string
subPropertyOf: noteNumber
term status: stable
seeXML: Proforma_Rechnungsnummer

seeEDIFACT
type: AnnotationProperty

instructionForInvoicingParty
type: DatatypeProperty
comment: Note contains invoice instructions
domain: InvoiceContent
range: string
subPropertyOf: topDataProperty
term status: stable
seeXML: Anweisung_fur_Rechnungssteller

hasCountryCode
type: DatatypeProperty
comment: Cotains the country code name of a party involved in the invoice
domain: FormalOrganization
range: string
subPropertyOf: topDataProperty
term status: stable
seeXML: D_3207

priceAndDeliveryCondition
type: DatatypeProperty
comment: Price and Delivery Conditions of the article displayed in the invoice
domain: InvoiceDetails
range: string
subPropertyOf: topDataProperty
term status: stable
seeXML: PreisUndAuslieferungsbedingung

orderNumber
type: DatatypeProperty
comment: Reference number of an order.
domain: FormalOrganization
range: string
subPropertyOf: noteNumber
term status: stable

dateBeneficiaryReference
type: DatatypeProperty
comment: Date of the reference of the beneficiary
domain: InvoiceContent
range: string
subPropertyOf: referenceDate
term status: stable
seeXML: Referenzdatum_Referenz_des_Beguenstigten

hasPriceSource
type: DatatypeProperty
comment: Identification of the type of price of an item
domain: EDIFACT Item
range: string
subPropertyOf: topDataProperty
term status: stable
seeXML: PreisQuelle

hasNetWeightPerUnit
type: DatatypeProperty
comment: Weight (mass) of goods including any packing normally going with them to a buyer in a retail sale
domain: EDIFACT Item
range: string
subPropertyOf: topDataProperty
term status: stable
seeXML: Nettogewicht_pro_Einheit

hasInvoiceprice
type: DatatypeProperty
comment: Referenced price taken from an invoice
domain: EDIFACT Item
range: float
subPropertyOf: amount
term status: stable
seeXML: Rechnungspreis

hasGrosspricePerUnit
type: DatatypeProperty
comment: The price stated is the gross price per unit to which allowances/ charges must be applied.
domain: EDIFACT Item
range: float
subPropertyOf: amount
term status: stable
seeXML: Bruttopreis_pro_Einheit

hasItem
type: ObjectProperty
comment: shows which items are included in an invoice
domain: E-Invoice
range: EDIFACT Item
subPropertyOf: topObjectProperty
term status: stable
inverseOf: isItemOf

orderNumberBuyer
type: DatatypeProperty
comment: Reference number assigned by the buyer to an order.
domain: FormalOrganization
range: string
subPropertyOf: orderNumber
term status: stable
seeXML: Auftragsnummer_Kaeufer

hasTotalAmount
type: DatatypeProperty
comment: The amount specified is the total amount
domain: InvoiceDetails
range: float
subPropertyOf: amount
term status: stable
seeXML: Gesamtbetrag

customsTariffNumber
type: DatatypeProperty
comment: Code number of the goods in accordance with the tariff nomenclature system of classification in use where the Customs declaration is made.
domain: InvoiceContent
range: string
subPropertyOf: noteNumber
term status: stable
seeXML: Zolltarifnummer

contactPersonTelexNumber
type: DatatypeProperty
comment: Transmission of text/data via telex.
domain: FormalOrganization
range: string
subPropertyOf: contactPerson
term status: stable
seeEDIFACT: COM+:TL
seeXML: Ansprechpartner_TelexNummer

hasDiscountPercentagePaymentConditions
type: DatatypeProperty
comment: Discount expressed as a percentage with payment condition
domain: InvoiceContent
range: float
subPropertyOf: percentage
term status: stable
seeXML: AbzugProzentsatzZahlungsbedingungen

performsAgentRole
type: ObjectProperty
comment: shows which formal organization an agent role performs
domain: FormalOrganization
range: AgentRole
subPropertyOf: topObjectProperty
term status: stable

dateOrderNumberDelivery
type: DatatypeProperty
comment: Date of the reference number assigned by issuer to a delivery order.
domain: InvoiceContent
range: string
subPropertyOf: referenceDate
term status: stable
seeXML: Referenzdatum_Nummer_Lieferauftrag

WholesalerRole
type: Class
comment: The role of the party that is the wholesaler
subclass of: AgentRole
term status: stable

managingOrganisations
type: DatatypeProperty
comment: Identification of the managing organization
domain: EDIFACT-Structure
range: string
subPropertyOf: topDataProperty
term status: stable
seeEDIFACT: D_0051
seeXML: D_0051

offerNumber
type: DatatypeProperty
comment: Reference number assigned by issuing party to an offer.
domain: InvoiceContent
range: string
subPropertyOf: noteNumber
term status: stable
seeXML: Angebotsnummer

hasStockRestriction
type: DatatypeProperty
comment: A measurement indicating limitation in relation to storage.
domain: EDIFACT Item
range: string
subPropertyOf: topDataProperty
term status: stable
seeXML: Lagerbeschraenkung

hasTotalDutyTasFeeAmount
type: DatatypeProperty
comment: Total of all duty/tax/fee amounts.
domain: InvoiceDetails
range: float
subPropertyOf: amount
term status: stable
seeXML: Gesamter_Zoll_Steuer_Gebuehrenbetrag_der_Nachricht

dateDebitNoteNumber
type: DatatypeProperty
comment: Date of the reference number assigned by issuer to a debit note
domain: InvoiceContent
range: string
subPropertyOf: referenceDate
term status: stable
seeXML: Referenzdatum_Nummer_der_Belastungsanzeige

receivingAdviceNumber
type: DatatypeProperty
comment: A reference number to a receiving advice.
domain: InvoiceContent
range: string
subPropertyOf: noteNumber
term status: stable
seeXML: Wareneingangsmeldung_Nummer

CalculateDeliverToRole
type: Class
comment: The role of the party receiving goods and relevant invoice
subclass of: AgentRole
term status: stable

dateOriginatorReference
type: DatatypeProperty
comment: Date of the reference of the originator
domain: InvoiceContent
range: string
subPropertyOf: referenceDate
term status: stable
seeXML: Referenzdatum_Referenz_des_Absenders

dateFileLineIdentifier
type: DatatypeProperty
comment: Date of number assigned by the file issuer or sender to identify a specific line.
domain: InvoiceContent
range: string
subPropertyOf: referenceDate
term status: stable
seeXML: Referenzdatum_Bezeichner_Dateizeilen

hasPaymentDiscountAmount
type: DatatypeProperty
comment: Amount of the payment discount
domain: InvoiceDetails
range: float
subPropertyOf: amount
term status: stable
seeXML: Zahlungskuerzung

VATIdentifier
type: DatatypeProperty
comment: Unique number assigned by the relevant tax authority to identify a party for use in relation to Value Added Tax (VAT).
domain: FormalOrganization
range: string
subPropertyOf: identifier
term status: stable
seeXML: Umsatzsteuernummer

AgentRole
type: Class
comment: A role which perfomed by an agent for a temporal extend
term status: stable

nationalProductGroupCode
type: DatatypeProperty
comment: National product group code. Administered by a national agency.
domain: EDIFACT Item
range: string
subPropertyOf: noteNumber
term status: stable
seeXML: Nationaler_Produktgruppencode

sellersReferenceNumber
type: DatatypeProperty
comment: Reference number assigned to a transaction by the seller
domain: FormalOrganization
range: string
subPropertyOf: identifier
term status: stable
seeXML: Referenznummer_des_Verkaeufers

dateReceivingAdviceNumber
type: DatatypeProperty
comment: Date of a reference number to a receiving advice.
domain: InvoiceContent
range: string
subPropertyOf: referenceDate
term status: stable
seeXML: Referenzdatum_Wareneingangsmeldung_Nummer

orderNumberSupplier
type: DatatypeProperty
comment: Reference number assigned by supplier to a buyer's purchase order.
domain: FormalOrganization
range: string
subPropertyOf: orderNumber
term status: stable
seeXML: Auftragsnummer_Lieferant

dateInternalVendorNumber
type: DatatypeProperty
comment: Date of the number identifying the company-internal vending department/unit.
domain: InvoiceContent
range: string
subPropertyOf: referenceDate
term status: stable
seeXML: Referenzdatum_Interne_Lieferantennummer

DeliveryPartyRole
type: Class
comment: The role of the party to which goods should be delivered, if not identical with consignee.
subclass of: AgentRole
term status: stable

contactPersonIncomingGoods
type: DatatypeProperty
comment: Department/person responsible for receiving the goods at the place of delivery.
domain: FormalOrganization
range: string
subPropertyOf: contactPerson
term status: stable
seeEDIFACT: CTA+GR
seeXML: Ansprechpartner_Wareneingang

isItemOf
type: ObjectProperty
comment: zeigt an zu welcher Rechnung der Artikel gehört @de
comment: shows to which Invoice the item belongs
domain: EDIFACT Item
range: E-Invoice
subPropertyOf: topObjectProperty
term status: stable

accountsReceivableNumber
type: DatatypeProperty
comment: Reference number assigned by accounts receivable department to the account of a specific debtor.
domain: FormalOrganization
range: string
subPropertyOf: noteNumber
term status: stable
seeXML: Nummer_des_Forderungskontos

hasAllowanceReason
type: DatatypeProperty
comment: The reason for the allowance
domain: InvoiceContent
range: string
subPropertyOf: topDataProperty
term status: stable
seeXML: Abschlag

SendToRole
type: Class
comment: The role of the party to where goods will be or have been shipped
subclass of: AgentRole
term status: stable

hasDueDate
type: DatatypeProperty
comment: Due date
domain: InvoiceContent
range: string
subPropertyOf: date
term status: stable

creationDate
type: DatatypeProperty
comment: Date when the message was created
domain: EDIFACT-Structure
range: integer
subPropertyOf: date
term status: stable
seeXML: D_0017

RecipientRole
type: Class
comment: The role of the party to which goods are consigned.
subclass of: AgentRole
term status: stable

hasLineItemAmount
type: DatatypeProperty
comment: Goods item total minus allowances plus charges for line item.
domain: EDIFACT Item
range: float
subPropertyOf: amount
term status: stable
seeXML: Positionsbetrag

hasVATIdentifierPayer
type: DatatypeProperty
comment: Unique number assigned by the relevant tax authority to identify the payer for use in relation to Value Added Tax (VAT).
domain: FormalOrganization
range: string
subPropertyOf: VATIdentifier
term status: stable
seeXML: Umsatzsteuernummer_Bezahler

deliveryDate
type: DatatypeProperty
comment: Date of the delivery
domain: InvoiceContent
range: string
subPropertyOf: date
term status: stable

dateAdditionalPartnerIdentificationEANCode
type: DatatypeProperty
comment: Date of Additional Partneridentification (GLN-Code)
domain: InvoiceContent
range: string
subPropertyOf: referenceDate
term status: stable
seeXML: Referenzdatum_Zusaetzliche_Partneridentifikation_EAN_Code

InvoicingPartyRole
type: Class
comment: The role of the party issuing an invoice
subclass of: AgentRole
term status: stable

itemNumberManufacturer
type: DatatypeProperty
comment: The number given to an article by its manufacturer.
domain: EDIFACT Item
range: string
subPropertyOf: noteNumber
term status: stable
seeXML: Artikelnummer_des_Herstellers

hasVATrate
type: DatatypeProperty
comment: A tax on domestic or imported goods applied to the value added at each stage in the production/distribution cycle.
domain: InvoiceContent
range: string
subPropertyOf: hasTAXrate
term status: stable
seeXML: Mehrwertsteuer

partNumberBuyer
type: DatatypeProperty
comment: Reference number assigned by the buyer to identify an article.
domain: InvoiceContent
range: string
subPropertyOf: noteNumber
term status: stable
seeXML: Teilnummer_des_Kaeufers

deliveryNoteNumber
type: DatatypeProperty
comment: Reference number assigned by the issuer to a delivery note.
domain: InvoiceContent
range: string
subPropertyOf: noteNumber
term status: stable
seeXML: Lieferscheinnummer

dateGovernmentReferenceNumber
type: DatatypeProperty
comment: Date of the refernce number given by the goverment
domain: InvoiceContent
range: string
subPropertyOf: referenceDate
term status: stable
seeXML: Referenzdatum_Referenznummer_Regierung

supplierNote
type: DatatypeProperty
comment: Remarks from or for a supplier of goods or services.
domain: InvoiceContent
range: string
subPropertyOf: topDataProperty
term status: stable
seeXML: Lieferantenhinweis

recivedAndAcceptedQuantity
type: DatatypeProperty
comment: Quantity which has been received and accepted at a given location.
domain: EDIFACT Item
range: string
subPropertyOf: quantity
term status: stable
seeXML: Menge_Erhalten_und_akzeptiert

governmentReferenceNumber
type: DatatypeProperty
comment: Refernce number given by the goverment
domain: FormalOrganization
range: string
subPropertyOf: identifier
term status: stable
seeXML: Referenznummer_Regierung

creditNoteNumber
type: DatatypeProperty
comment: Reference number assigned to a credit note.
domain: InvoiceContent
range: string
subPropertyOf: noteNumber
term status: stable
seeXML: Gutschriftsnummer

item
type: Class
comment: invoiced goods and services

hasGSTrate
type: DatatypeProperty
comment: Tax levied on the final consumption of goods and services throughout the production and distribution chain.
domain: InvoiceContent
range: string
subPropertyOf: hasTAXrate
term status: stable
seeXML: Waren_Dienstleistungssteuer

contactDepartmentPerson
type: DatatypeProperty
comment: The department or person within an organizational entity.
domain: FormalOrganization
range: string
subPropertyOf: contactPerson
term status: stable
seeXML: D_3412

EDIFACT Item
type: Class
comment: Contains all the information about a item
subclass of: item
subclass of: InvoiceContent
term status: stable

documentDate
type: DatatypeProperty
comment: Date/time when a document/message is issued. This may include authentication.
domain: InvoiceContent
range: string
subPropertyOf: date
term status: stable
seeXML: Dokumenten_oder_Nachrichten_Datum

harmonisedSystemNumber
type: DatatypeProperty
comment: Date of the number specifying the goods classification under the Harmonised Commodity Description and Coding System of the Customs Co-operation Council (CCC).
domain: InvoiceContent
range: string
subPropertyOf: identifier
term status: stable
seeXML: Nummer_harmonisiertes_System

returnQuantityWithUnit
type: DatatypeProperty
comment: The return quantity with unit
domain: EDIFACT Item
range: string
subPropertyOf: quantity
term status: stable
seeXML: Retourmenge_Einheit

invoiceCurrency
type: DatatypeProperty
comment: The name or symbol of the monetary unit used for calculation in an invoice.
domain: InvoiceDetails
range: string
subPropertyOf: currency
term status: stable
seeXML: WaehrungRechnung

hasTermsNetDueDate
type: DatatypeProperty
comment: Date by which payment must be made
domain: InvoiceContent
range: string
subPropertyOf: hasDueDate
term status: stable
seeXML: Faelligkeitsdatum_bei_Zahlung_ohne_Abzug

hasAdditionalProductIdentification
type: DatatypeProperty
comment: Information which specifies and qualifies product identifications.
domain: EDIFACT Item
range: string
subPropertyOf: topDataProperty
term status: stable
seeXML: Zusaetzliche_Produktidentifikation

hasRequiredDeliveryDate
type: DatatypeProperty
comment: Date on which buyer requests goods to be delivered.
domain: InvoiceContent
range: string
subPropertyOf: deliveryDate
term status: stable
seeXML: geforderter_Liefertermin

InvoiceDetails
type: Class
comment: Contains all the general information about an invoice
subclass of: InvoiceContent
term status: stable
disjointWith: EDIFACT Item

dateNumberOfBundleMessages
type: DatatypeProperty
comment: Date of batch number identifying a batch of messages.
domain: InvoiceContent
range: string
subPropertyOf: referenceDate
term status: stable
seeXML: Referenzdatum_Nummer_eines_Buendels_von_Nachrichten

seeXML
type: AnnotationProperty

hasTotalAdditionsAndDeductions
type: DatatypeProperty
comment: The amount specified is the total of all charges/allowances.
domain: InvoiceDetails
range: float
subPropertyOf: amount
term status: stable
seeXML: GesamtZu_Abschlaege

hasChargePercentage
type: DatatypeProperty
comment: Charge expressed as a percentage.
domain: InvoiceContent
range: float
subPropertyOf: percentage
term status: stable
seeXML: ZuschlagProzentsatz

isPerformedBy
type: ObjectProperty
comment: shows by which formal organization a agent role is performed
domain: AgentRole
range: FormalOrganization
subPropertyOf: topObjectProperty
term status: stable
inverseOf: performsAgentRole

referenceDate
type: DatatypeProperty
comment: Reference Date
domain: InvoiceContent
range: string
subPropertyOf: date
term status: stable
seeXML: Referenzdatum

DespatchPartyRole
type: Class
comment: The role of the party where goods are collected or taken over by the carrier (i.e. if other than consignor)
subclass of: AgentRole
term status: stable

numberConsolidatedInvoiceEANCode
type: DatatypeProperty
comment: Consolidated invoice number with EAN code
domain: InvoiceContent
range: string
subPropertyOf: identifier
term status: stable
seeXML: Nummer_einr_konsolidierten_Rechnung_EAN_Code

CentralRegulatorRole
type: Class
comment: The role of the party which is the central regulator
subclass of: AgentRole
term status: stable

debitNoteNumber
type: DatatypeProperty
comment: Reference number assigned by issuer to a debit note
domain: InvoiceContent
range: string
subPropertyOf: noteNumber
term status: stable
seeXML: Nummer_der_Belastungsanzeige

dateSpecificationNumber
type: DatatypeProperty
comment: Date of the number assigned by the issuer to his specification.
domain: InvoiceContent
range: string
subPropertyOf: referenceDate
term status: stable
seeXML: Referenzdatum_Spezifikationsnummer

discreteQuantity
type: DatatypeProperty
comment: The discrete quantity
domain: EDIFACT Item
range: string
subPropertyOf: quantity
term status: stable
seeXML: Menge_Diskret

contractNumberBuyer
type: DatatypeProperty
comment: Reference number assigned by buyer to a contract.
domain: FormalOrganization
range: string
subPropertyOf: noteNumber
term status: stable
seeXML: Vertragsnummer_des_Kaeufers

datePaymentReference
type: DatatypeProperty
comment: Date of the reference number assigned to a payment.
domain: InvoiceContent
range: string
subPropertyOf: referenceDate
term status: stable
seeXML: Referenzdatum_Zahlungsreferenz

EDIFACT Ontology
type: Ontology
comment: An Ontology for EDIFACT Messages
license: https://creativecommons.org/licenses/by-nc/4.0/
contributor: Maribel Acosta
contributor: EDIFACT experts from Einkaufsbüro Deutscher Eisenhändler GmbH
contributor: Johannes Mäkelburg
created: 2023-12-06
creator: Maribel Acosta
creator: Johannes Mäkelburg
description: An Ontology for representing EDIFACT Messages.
issued: 2023-12-06
modified: 2023-12-06
publisher: Johannes Mäkelburg
rights: Copyright © 2024 Johannes Mäkelburg, Maribel Acosta Deibe
preferred namespace prefix: edifact-o
preferred namespace uri: https://purl.org/edifact/ontology#
version info: 1.0

dateReferenceNumberCustomer
type: DatatypeProperty
comment: Date of the reference number assigned by the customer to a transaction.
domain: InvoiceContent
range: string
subPropertyOf: referenceDate
term status: stable
seeXML: Referenzdatum_Referenzsnummer_des_Kunden

dateLineItemReferenceNumber
type: DatatypeProperty
comment: Date of the reference number identifying a particular line in a document.
domain: InvoiceContent
range: string
subPropertyOf: referenceDate
term status: stable
seeXML: Referenzdatum_Referenznummer_der_Position

hasFreightCharge
type: DatatypeProperty
comment: Amount to be paid for moving goods, by whatever means, from one place to another, inclusive discounts, allowances, rebates, adjustment factors and additional cost relating to freight costs (UN/ECE Recommendation no 23).
domain: InvoiceDetails
range: float
subPropertyOf: amount
term status: stable
seeXML: Frachtgebuehr

releaseNumberMessageType
type: DatatypeProperty
comment: Release number within the current message version number.
domain: EDIFACT-Structure
range: string
subPropertyOf: topDataProperty
term status: stable
seeEDIFACT: D_0054
seeXML: D_0054

messageTypeIdentifier
type: DatatypeProperty
comment: The identifier of the message type
domain: EDIFACT-Structure
range: string
subPropertyOf: topDataProperty
term status: stable
seeEDIFACT: D_0065
seeXML: D_0065

RepresentativeOfSupplierRole
type: Class
comment: The role of the party representing the seller for the purpose of the trade transaction.
subclass of: AgentRole
term status: stable

providesAgentRole
type: ObjectProperty
comment: shows which agnezt roles are provided by an invoice
domain: E-Invoice
range: AgentRole
subPropertyOf: topObjectProperty
term status: stable

hasInvoiceAmount
type: DatatypeProperty
comment: Total sum charged in respect of a single Invoice in accordance with the terms of delivery.
domain: InvoiceDetails
range: float
subPropertyOf: amount
term status: stable
seeXML: Rechnungsbetrag

hasHeightDimension
type: DatatypeProperty
comment: Numeric value of height
domain: EDIFACT Item
range: float
subPropertyOf: topDataProperty
term status: stable
seeXML: Hoehenmass

date
type: DatatypeProperty
comment: contains a date
domain: E-Invoice
range: string
subPropertyOf: topDataProperty
term status: stable

FormalOrganization
type: Class
comment: The class containing information about the perfomed role of the involved organizations
subclass of: FormalOrganization
term status: stable

internalVendorNumber
type: DatatypeProperty
comment: Number identifying the company-internal vending department/unit.
domain: InvoiceContent
range: string
subPropertyOf: identifier
term status: stable
seeXML: Interne_Verkaufsnummer

hasPenaltyPercentage
type: DatatypeProperty
comment: Penalty expressed as a percentage.
domain: InvoiceContent
range: float
subPropertyOf: percentage
term status: stable
seeXML: StrafProzentsatz

formalName
type: DatatypeProperty
comment: Name of a party involved in the invoice
domain: FormalOrganization
range: string
subPropertyOf: topDataProperty
term status: stable
seeEDIFACT: 3036
seeXML: D_3036

hasProductIdentification
type: DatatypeProperty
comment: Identification of the product
domain: EDIFACT Item
range: string
subPropertyOf: topDataProperty
term status: stable
seeXML: Produktidentifikation

hasUnit
type: DatatypeProperty
comment: Contains measure unit qualifier
domain: EDIFACT Item
range: string
subPropertyOf: topDataProperty
term status: stable
seeXML: D_MaEinheit

hasNetPriceOfItem
type: DatatypeProperty
comment: The price stated is the net price per item including allowances/ charges. Allowances/charges may be stated for information only.
domain: EDIFACT Item
range: float
subPropertyOf: amount
term status: stable
seeXML: Nettokalkulation

hasCashDiscount
type: DatatypeProperty
comment: Cash discount given by the seller to the buyer where payment is made in advance of receipt of goods.
domain: InvoiceContent
range: float
subPropertyOf: amount
term status: stable
seeXML: Barzahlungsrabatt

contactPersonInformation
type: DatatypeProperty
comment: Department/person to contact for questions regarding transactions
domain: FormalOrganization
range: string
subPropertyOf: contactPerson
term status: stable
seeEDIFACT: COM+IC
seeXML: Ansprechpartner_Information

hasLengthMeasurements
type: DatatypeProperty
comment: Length of pieces or packages stated for transport purposes
domain: EDIFACT Item
range: string
subPropertyOf: topDataProperty
term status: stable
seeXML: Laengenmassangaben

inverseOf
type: AnnotationProperty

hasPenaltyAmount
type: DatatypeProperty
comment: Amount of the penalty
domain: InvoiceContent
range: float
subPropertyOf: amount
term status: stable
seeXML: Strafbetrag

hasDispatchDate
type: DatatypeProperty
comment: Date/time on which the goods are or are expected to be despatched or shipped
domain: InvoiceContent
range: string
subPropertyOf: date
term status: stable
seeXML: Versanddatum

versionNumberMessageType
type: DatatypeProperty
comment: Version number of a message type
domain: EDIFACT-Structure
range: string
subPropertyOf: topDataProperty
term status: stable
seeEDIFACT: D_0052
seeXML: D_0052

hasPriceUnit
type: DatatypeProperty
comment: Contains measure unit qualifier of a price
domain: EDIFACT Item
range: string
subPropertyOf: hasUnit
term status: stable
seeXML: D_PRIMaEinheit

actualDeliveryDate
type: DatatypeProperty
comment: Date/time on which goods or consignment are delivered at their destination.
domain: InvoiceContent
range: string
subPropertyOf: deliveryDate
term status: stable
seeXML: tatsaechliches_Lieferdatum

hasGrosspriceOfItem
type: DatatypeProperty
comment: The price stated is the gross price per item to which allowances/ charges must be applied.
domain: EDIFACT Item
range: float
subPropertyOf: amount
term status: stable
seeXML: Bruttokalkulation

companyOrPlaceRegistristrationNumber
type: DatatypeProperty
comment: Company registration and place as legally required.
domain: FormalOrganization
range: string
subPropertyOf: noteNumber
term status: stable
seeXML: Unternehmes_oder_Ort_Regisstriernummer

e-invoice
type: Class
comment: "‘electronic invoice’ means an invoice that has been issued, transmitted and received in a structured electronic format which allows for its automatic and electronic processing;" (Directive 2014/55/EU)

datePriceListNumber
type: DatatypeProperty
comment: Date of the reference number assigned to a price list.
domain: InvoiceContent
range: string
subPropertyOf: referenceDate
term status: stable
seeXML: Referenzdatum_Nummer_der_Preisliste

synatxVersion
type: DatatypeProperty
comment: Version of the used syntax
domain: EDIFACT-Structure
range: integer
subPropertyOf: topDataProperty
term status: stable
seeXML: SyntaxVersion

hasAmountUnderPriceAdjustment
type: DatatypeProperty
comment: Amount which is used as the basis for price adjustment calculation.
domain: InvoiceContent
range: float
subPropertyOf: amount
term status: stable
seeXML: Betrag_unterliegt_einer_Preisberichtigung

informationCustomsDeclaration
type: DatatypeProperty
comment: Note contains customs declaration information.
domain: EDIFACT Item
range: string
subPropertyOf: topDataProperty
term status: stable
seeXML: Informatioen_zur_Zollerklaerung

messageReferenceNumber
type: DatatypeProperty
comment: The reference number of the message
domain: EDIFACT-Structure
range: string
subPropertyOf: topDataProperty
term status: stable
seeEDIFACT: D_0062
seeXML: D_0062

dateImportLicenseNumber
type: DatatypeProperty
comment: Date of the reference number assigned by the issuing authority to an Import Licence.
domain: InvoiceContent
range: string
subPropertyOf: referenceDate
term status: stable
seeXML: Referenzdatum_Import_Lizenznummer @de

hasTotalGoodsPosition
type: DatatypeProperty
comment: Net price x quantity for the line item
domain: InvoiceDetails
range: float
subPropertyOf: amount
term status: stable
seeXML: WarenpositionInsgesamt

recivedAndAcceptedQuantityWithUnit
type: DatatypeProperty
comment: Quantity which has been received and accepted at a given location with the unit
domain: EDIFACT Item
range: string
subPropertyOf: quantity
term status: stable
seeXML: Erhalten_und_akzeptiert_Einheit

SuppliersCompanyHeadquarterRole
type: Class
comment: The role of the party's headquarters which manufactures or otherwise has possession of goods, and consigns or makes them available in trade.
subclass of: AgentRole
term status: stable

hasAllowanceAmount
type: DatatypeProperty
comment: Amount of the allowance
domain: InvoiceContent
range: float
subPropertyOf: amount
term status: stable
seeXML: Abschlagsbetrag

creationTime
type: DatatypeProperty
comment: Time of the creation of the EDIFACT message
domain: EDIFACT-Structure
range: integer
subPropertyOf: topDataProperty
term status: stable
seeXML: D_0019

hasInvoicePercentagePaymentConditions
type: DatatypeProperty
comment: Percentage used in the whole invoice with payment conditions
domain: InvoiceContent
range: float
subPropertyOf: percentage
term status: stable
seeXML: RechnungsProzentsatzZahlungsbedingungen

hasPenaltyPercentagePaymentConditions
type: DatatypeProperty
comment: Penalty expressed as a percentage with payment conditions
domain: InvoiceContent
range: float
subPropertyOf: percentage
term status: stable
seeXML: StrafProzentsatzZahlungsbedingungen

referenceNumberBusinessContactExtractEANCode
type: DatatypeProperty
comment: Reference number for a business account statement as EAN code
domain: FormalOrganization
range: string
subPropertyOf: noteNumber
term status: stable
seeXML: Referenznummer_zu_einem_Geschaeftskontauszug_EAN_Code

dateContractNumber
type: DatatypeProperty
comment: Date of the reference number of a contract concluded between parties.
domain: InvoiceContent
range: string
subPropertyOf: referenceDate
term status: stable
seeXML: Referenzdatum_Vertragsnummer

dateInvoiceNumber
type: DatatypeProperty
comment: Date of the reference number assigned by the seller to a Commercial Invoice.
domain: InvoiceContent
range: string
subPropertyOf: referenceDate
term status: stable
seeXML: Referenzdatum_Rechnungsnummer

belongsToProcess
type: DatatypeProperty
comment: Indicates to which business process the invoice belongs
domain: E-Invoice
range: string
subPropertyOf: topDataProperty
term status: stable
seeXML: ProcessIdentification

hasInvoiceDate
type: DatatypeProperty
comment: Date when a Commercial Invoice is issued
domain: InvoiceContent
range: string
subPropertyOf: date
term status: stable
seeXML: Rechnungsdatum

internalCustomerNumber
type: DatatypeProperty
comment: Number assigned by a seller, supplier etc. to identify a customer within his enterprise.
domain: FormalOrganization
range: string
subPropertyOf: noteNumber
term status: stable
seeXML: Interne_Kundennummer

withoutCalculationQuantityWithUnit
type: DatatypeProperty
comment: Quantity of goods which are free of charge with unit
domain: EDIFACT Item
range: string
subPropertyOf: quantity
term status: stable
seeXML: Menge_ohne_Berechnung_Einheit

controlSegmentBetweenItemAndTotalPart
type: DatatypeProperty
comment: Detail/summary section separation
domain: EDIFACT-Structure
range: string
term status: stable
seeXML: D_0081

priceCondition
type: DatatypeProperty
comment: Condition of the Price
domain: EDIFACT Item
range: string
subPropertyOf: topDataProperty
term status: stable
seeXML: Preis_Bedingungen

dateFinancialAccountNumberPayee
type: DatatypeProperty
comment: Date of the receiving company account number (ACH transfer), check, draft or wire
domain: InvoiceContent
range: string
subPropertyOf: referenceDate
term status: stable
seeXML: Referenzdatum_Kontonummer_des_Zahlungsempfaenger

WarehouseNumberRole
type: Class
comment: The role of the party that runs the Warehouse
subclass of: AgentRole
term status: stable

priceCurrency
type: DatatypeProperty
comment: The name or symbol of the monetary unit used for pricing purposes
domain: InvoiceContent
range: string
subPropertyOf: currency
term status: stable
seeXML: WaehrungPreisangabe

orderDate
type: DatatypeProperty
comment: Date when an order is issued.
domain: InvoiceContent
range: string
subPropertyOf: date
term status: stable
seeXML: Bestelldatum

hasTermsDiscountDueDate
type: DatatypeProperty
comment: Date by which payment should be made if discount terms are to apply.
domain: InvoiceContent
range: string
subPropertyOf: hasDueDate
term status: stable
seeXML: Faelligkeitsdatum_bei_Skontoabzug

hasRemittedtAmount
type: DatatypeProperty
comment: Amount which was remitted
domain: InvoiceContent
range: float
subPropertyOf: amount
term status: stable
seeXML: Uebermittelter_Betrag

unitPriceBasis
type: DatatypeProperty
comment: The Unit price basis
domain: EDIFACT Item
range: string
subPropertyOf: topDataProperty
term status: stable
seeXML: D_5284

referenceNumberCustomer
type: DatatypeProperty
comment: Reference number assigned by the customer to a transaction.
domain: FormalOrganization
range: string
subPropertyOf: noteNumber
term status: stable
seeXML: Referenzsnummer_des_Kunden

lineItemReferenceNumber
type: DatatypeProperty
comment: Reference number identifying a particular line in a document.
domain: EDIFACT Item
range: string
subPropertyOf: noteNumber
term status: stable
seeXML: Referenznummer_der_Position

hasChargeAllowanceBasis
type: DatatypeProperty
comment: The amount specified is the basis for calculation of charges/allowance.
domain: InvoiceContent
range: float
subPropertyOf: amount
term status: stable
seeXML: Zu_Abschlagsbasis

postalCode
type: DatatypeProperty
comment: Cotains the postal code of a party involved in the invoice
domain: FormalOrganization
range: string
term status: stable
seeXML: D_3251

hasDiscountAmount
type: DatatypeProperty
comment: The amount specified is the discount amount
domain: InvoiceContent
range: float
subPropertyOf: amount
term status: stable
seeXML: Abzug_Rabatt

synatxIdentifier
type: DatatypeProperty
comment: Identification of the used synatx
domain: EDIFACT-Structure
range: string
subPropertyOf: topDataProperty
term status: stable
seeXML: SynatxKennung

valutaDate
type: DatatypeProperty
comment: Document date in the future from which the agreed payment period begins
domain: InvoiceContent
range: string
subPropertyOf: date
term status: stable
seeXML: ValutaDatum

amount
type: DatatypeProperty
comment: Amount of money
domain: InvoiceContent
range: string
subPropertyOf: topDataProperty
term status: stable

widthDimension
type: DatatypeProperty
comment: Numeric value of width
domain: EDIFACT Item
range: string
subPropertyOf: topDataProperty
term status: stable
seeXML: Breitenabmessung

SupplierRole
type: Class
comment: The role of the party which manufactures or otherwise has possession of goods, and consigns or makes them available in trade.
subclass of: AgentRole
term status: stable

identifier
type: DatatypeProperty
comment: identifier of a part in the invoice
domain: E-Invoice
range: string
subPropertyOf: topDataProperty
term status: stable

hasNetpricePerUnit
type: DatatypeProperty
comment: The price stated is the net price per unit including allowances/ charges. Allowances/charges may be stated for information only.
domain: EDIFACT Item
range: float
subPropertyOf: amount
term status: stable
seeXML: Nettopreis_pro_Einheit

hasVATIdentifierDeliveryParty
type: DatatypeProperty
comment: Unique number assigned by the relevant tax authority to identify the delivery party for use in relation to Value Added Tax (VAT).
domain: FormalOrganization
range: string
subPropertyOf: VATIdentifier
term status: stable
seeXML: Umsatzsteuernummer_Lieferanschrift

orderNumberDelivery
type: DatatypeProperty
comment: Reference number assigned by issuer to a delivery order.
domain: InvoiceContent
range: string
subPropertyOf: orderNumber
term status: stable
seeXML: Nummer_Lieferauftrag

dateExportReferenceNumber
type: DatatypeProperty
comment: Date of the reference number given to an export shipment.
domain: InvoiceContent
range: string
subPropertyOf: referenceDate
term status: stable
seeXML: Referenzdatum_Exportreferenznummer

E-Invoice
type: Class
type: AnnotationProperty
comment: The root class of each invoice. Contains all the linked classes with information about the invoice
label: EDIFACT E-Invoice
subclass of: e-invoice
term status: stable

paymentCondition
type: DatatypeProperty
comment: Type of the payment terms
domain: InvoiceContent
range: string
term status: stable
seeEDIFACT: 4279
seeXML: ZahlungsbedingungsArt

universalProductCode
type: DatatypeProperty
comment: Number assigned to a manufacturer's product by the Product Code Council.
domain: EDIFACT Item
range: string
subPropertyOf: noteNumber
term status: stable
seeXML: Universal_Prodcut_Code

originatorReference
type: DatatypeProperty
comment: Reference of the originator
domain: InvoiceContent
range: string
subPropertyOf: identifier
term status: stable
seeXML: Referenz_des_Absenders

hasMeasurement
type: DatatypeProperty
comment: Value of the measured unit.
domain: EDIFACT Item
range: string
subPropertyOf: topDataProperty
term status: stable
seeXML: Masangabe

contactPersonAccounting
type: DatatypeProperty
comment: Department/person responsible for the accounts payable function within a corporation.
domain: FormalOrganization
range: string
subPropertyOf: contactPerson
term status: stable
seeEDIFACT: CTA+AD
seeXML: Ansprechpartner_Buchhaltung

FinalConsigneeRole
type: Class
comment: The role of the party who has been designated on the invoice or packing list as the final recipient of the stated merchandise.
subclass of: AgentRole
term status: stable

dateCustomsTariffNumber
type: DatatypeProperty
comment: Date of the code number of the goods in accordance with the tariff nomenclature system of classification in use where the Customs declaration is made.
domain: InvoiceContent
range: string
subPropertyOf: referenceDate
term status: stable
seeXML: Referenzdatum_Zolltarifnummer

BuyerRole
type: Class
comment: The role of the party to which articles are sold
subclass of: AgentRole
term status: stable

dateDeliveryNoteNumber
type: DatatypeProperty
comment: Date of the reference number assigned by the issuer to a delivery note.
domain: InvoiceContent
range: string
subPropertyOf: referenceDate
term status: stable
seeXML: Referenzdatum_Lieferscheinnummer

internationalArticleNumber
type: DatatypeProperty
comment: Number assigned to a manufacturer's product according to the International Article Numbering Association.
domain: EDIFACT Item
range: string
subPropertyOf: noteNumber
term status: stable
seeXML: International_Article_Number

hasDiscountPercentage
type: DatatypeProperty
comment: Discount expressed as a percentage.
domain: InvoiceContent
range: float
subPropertyOf: percentage
term status: stable
seeXML: AbzugProzentsatz

hasAllowancePercentage
type: DatatypeProperty
comment: Allowance expressed as a percentage.
domain: InvoiceContent
range: float
subPropertyOf: percentage
term status: stable
seeXML: AbschlagProzentsatz

dateDespatchAdviceNumber
type: DatatypeProperty
comment: Date of the reference number assigned by issuing party to a despatch advice.
domain: InvoiceContent
range: string
subPropertyOf: referenceDate
term status: stable
seeXML: Referenzdatum_Nummer_Lieferschein

priceListNumber
type: DatatypeProperty
comment: Reference number assigned to a price list.
domain: InvoiceContent
range: string
subPropertyOf: noteNumber
term status: stable
seeXML: Nummer_der_Preisliste

purchasingInformation
type: DatatypeProperty
comment: Note contains purchasing information.
domain: InvoiceContent
range: string
subPropertyOf: topDataProperty
term status: stable
seeXML: Beschaffungsinformation

hasChargeReason
type: DatatypeProperty
comment: The reason for the charge
domain: InvoiceContent
range: string
subPropertyOf: topDataProperty
term status: stable
seeXML: Zuschlag

quantity
type: DatatypeProperty
comment: display a quantity
domain: EDIFACT Item
range: string
subPropertyOf: topDataProperty
term status: stable

subPropertyOf
type: AnnotationProperty

dateSellersReferenceNumber
type: DatatypeProperty
comment: Date of the reference number assigned to a transaction by the seller
domain: InvoiceContent
range: string
subPropertyOf: referenceDate
term status: stable
seeXML: Referenzdatum_Referenznummer_des_Verkaeufers

hasTotalLineItemAmount
type: DatatypeProperty
comment: The sum of all the line item amounts.
domain: InvoiceDetails
range: float
subPropertyOf: amount
term status: stable
seeXML: Gesamtpositionsbetrag

isInvoiceDetailsOf
type: ObjectProperty
comment: shows to which Invoice the Invoice Details belong
domain: InvoiceDetails
range: E-Invoice
subPropertyOf: topObjectProperty
term status: stable

dateCompanyOrPlaceRegistristrationNumber
type: DatatypeProperty
comment: Date of company registration and place as legally required.
domain: InvoiceContent
range: string
subPropertyOf: referenceDate
term status: stable
seeXML: Referenzdatum_Unternehmes_oder_Ort_Regisstriernummer

dateFiscalNumber
type: DatatypeProperty
comment: Date of Tax payer's number.
domain: InvoiceContent
range: string
subPropertyOf: referenceDate
term status: stable
seeXML: Referenzdatum_Steuernummer

dataExchangeReference
type: DatatypeProperty
comment: the reference of the exchanged data
domain: EDIFACT-Structure
range: string
subPropertyOf: topDataProperty
term status: stable
seeXML: D_0020

dateOrderNumberSupplier
type: DatatypeProperty
comment: Date of the reference number assigned by supplier to a buyer's purchase order.
domain: InvoiceContent
range: string
subPropertyOf: referenceDate
term status: stable
seeXML: Referenzdatum_Auftragsnummer_Lieferant

hasVATfirstValue
type: DatatypeProperty
comment: First VAT value if, for the same rate of VAT, there are 1 to 3 different ways to set this value
domain: InvoiceDetails
range: float
subPropertyOf: amount
term status: stable
seeXML: Umsatzsteuer_erster_Wert

consumerUnitsInTradingUnitQuantity
type: DatatypeProperty
comment: Numbers of consumer units in the traded unit
domain: EDIFACT Item
range: string
subPropertyOf: quantity
term status: stable
seeXML: Anzahl_der_Verbrauchereinheiten_in_einer_Handelseinheit

isProvidedBy
type: ObjectProperty
comment: shows by which E-Invoice an agent role is provided
domain: AgentRole
range: E-Invoice
subPropertyOf: topObjectProperty
term status: stable
inverseOf: providesAgentRole

RecipientOfInvoiceRegulationRole
type: Class
comment: The role of the party to whom payment for a commercial invoice or bill should be remitted.
subclass of: AgentRole
term status: stable

InvoiceeRole
type: Class
comment: The role of the party to whom an invoice is issued
subclass of: AgentRole
term status: stable

receiptGoodsDate
type: DatatypeProperty
comment: Date/time upon which the goods were received by a given party.
domain: InvoiceContent
range: string
subPropertyOf: date
term status: stable
seeXML: Wareneingangsdatum

invoiceNumber
type: DatatypeProperty
comment: Reference number assigned by the seller to a Commercial Invoice.
domain: InvoiceContent
range: string
subPropertyOf: noteNumber
term status: stable
seeXML: Rechnungsnummer

followsStandard
type: ObjectProperty
comment: shows the file standard resources the invoice has
domain: E-Invoice
range: EDIFACT-Structure
subPropertyOf: topObjectProperty
term status: stable
inverseOf: isStandardOf

despatchQuantity
type: DatatypeProperty
comment: Quantity despatched by the seller.
domain: EDIFACT Item
range: string
subPropertyOf: quantity
term status: stable
seeXML: Menge_Sendungen

paymentReference
type: DatatypeProperty
comment: Reference number assigned to a payment.
domain: InvoiceContent
range: string
subPropertyOf: identifier
term status: stable
seeXML: Zahlungsreferenz

hasTaxAmount
type: DatatypeProperty
comment: Tax imposed by government or other official authority related to the weight/volume charge or valuation charge
domain: InvoiceContent
range: float
subPropertyOf: amount
term status: stable
seeXML: Steuerbetrag @de

hasDueDeductionAmount
type: DatatypeProperty
comment: Amount of the discount due
domain: InvoiceContent
range: float
subPropertyOf: amount
term status: stable
seeXML: Faelliger_Abzugsbetrag

hasPhysicalDimension
type: DatatypeProperty
comment: Specified measurement dimensions refer to physical dimensions of a product, material or package
domain: EDIFACT Item
range: string
subPropertyOf: topDataProperty
term status: stable
seeXML: Physische_Abmessung

changeInformation
type: DatatypeProperty
comment: Note contains change information
domain: InvoiceContent
range: string
subPropertyOf: topDataProperty
term status: stable
seeXML: Aenderungsinformationen