Instructional Method
type: NamedIndividual
type: ObjectProperty
comment: A process, used to engender knowledge, attitudes and skills, that the described resource is designed to support.
range: Method of Instruction
description: Instructional Method will typically include ways of presenting instructional materials or conducting instructional activities, patterns of learner-to-learner and learner-to-instructor interactions, and mechanisms by which group and individual levels of learning are measured. Instructional methods include all aspects of the instruction and learning processes from planning and implementation through evaluation and feedback.
Has Version: instructionalMethod-002
issued: 2005-06-13
Date Modified: 2008-01-14

AGIFT Theme
type: ObjectProperty
comment: The AGIFT classification for this dataset
range: Function
sub property of: classifiedAs

hasLevelOfGovernment
type: ObjectProperty
comment: Defines a relation that denotes the Level of Government of an Organisation, typically a Government Agency.
domain: Organisation
range: Level of Government

Date Accepted
type: DatatypeProperty
type: NamedIndividual
type: AnnotationProperty
comment: Date of acceptance of the resource.
range: Literal
sub property of: Date
description: Examples of resources to which a Date Accepted may be relevant are a thesis (accepted by a university department) or an article (accepted by a journal).
Has Version: dateAccepted-002
issued: 2002-07-13
Date Modified: 2008-01-14

Access Rights
type: ObjectProperty
type: AnnotationProperty
type: NamedIndividual
comment: Information about who can access the resource or an indication of its security status.
range: Rights Statement
sub property of: Rights
description: Access Rights may include information regarding access or restrictions based on privacy, security, or other policies.
Has Version: accessRights-002
issued: 2003-02-15
Date Modified: 2008-01-14

Method of Instruction
type: NamedIndividual
type: Class
comment: A process that is used to engender knowledge, attitudes, and skills.
Has Version: MethodOfInstruction-001
issued: 2008-01-14

UDC
type: VocabularyEncodingScheme
type: NamedIndividual
comment: The set of conceptual resources specified by the Universal Decimal Classification.
Has Version: UDC-003
issued: 2000-07-11
Date Modified: 2008-01-14

Publisher
type: AnnotationProperty
comment: An entity responsible for making the resource available.
description: Examples of a Publisher include a person, an organization, or a service. Typically, the name of a Publisher should be used to indicate the entity.
Has Version: publisher-006
issued: 1999-07-02
Date Modified: 2008-01-14
note: A second property with the same name as this property has been declared in the dcterms: namespace (http://purl.org/dc/terms/). See the Introduction to the document "DCMI Metadata Terms" (http://dublincore.org/documents/dcmi-terms/) for an explanation.

LCC
type: VocabularyEncodingScheme
type: NamedIndividual
comment: The set of conceptual resources specified by the Library of Congress Classification.
Has Version: LCC-003
issued: 2000-07-11
Date Modified: 2008-01-14

Bibliographic Citation
type: NamedIndividual
type: AnnotationProperty
type: DatatypeProperty
comment: A bibliographic reference for the resource.
domain: Bibliographic Resource
range: Literal
sub property of: Identifier
description: Recommended practice is to include sufficient bibliographic detail to identify the resource as unambiguously as possible.
Has Version: bibliographicCitation-002
issued: 2003-02-15
Date Modified: 2008-01-14

The AGLS Metadata Terms Namespace providing access to its content by means of an RDF Schema.
Date Created: 2002-04-18
creator: National Archives of Australia
description: The AGLS Metadata Terms Namespace provides URIs for the AGLS Metadata Terms Vocabulary. Vocabulary terms are declared using RDF Schema language to support RDF applications. The AGLS Metadata Terms form a richer vocabulary, which is intended to facilitate discovery of resources. It will be updated according to AGLS Working Group decisions.
language: English
Date Modified: 2010-06-30
publisher: National Archives of Australia
Rights: Copyright Commonwealth of Australia 2007

Coverage
type: AnnotationProperty
comment: The spatial or temporal topic of the resource, the spatial applicability of the resource, or the jurisdiction under which the resource is relevant.
description: Spatial topic and spatial applicability may be a named place or a location specified by its geographic coordinates. Temporal topic may be a named period, date, or date range. A jurisdiction may be a named administrative entity or a geographic place to which the resource applies. Recommended best practice is to use a controlled vocabulary such as the Thesaurus of Geographic Names [TGN]. Where appropriate, named places or time periods can be used in preference to numeric identifiers such as sets of coordinates or date ranges.
Has Version: coverage-006
issued: 1999-07-02
Date Modified: 2008-01-14
note: A second property with the same name as this property has been declared in the dcterms: namespace (http://purl.org/dc/terms/). See the Introduction to the document "DCMI Metadata Terms" (http://dublincore.org/documents/dcmi-terms/) for an explanation.

ISO 3166
type: NamedIndividual
type: Datatype
comment: The set of codes listed in ISO 3166-1 for the representation of names of countries.
Has Version: ISO3166-004
issued: 2000-07-11
Date Modified: 2008-01-14

Function Class
type: Class
comment: A set of function encoding schemes and/or formats
issued: 2007-12-12
Date Modified: 2010-04-13

W3C-DTF
type: NamedIndividual
type: Datatype
comment: The set of dates and times constructed according to the W3C Date and Time Formats Specification.
Has Version: W3CDTF-003
issued: 2000-07-11
Date Modified: 2008-01-14

Rights Statement
type: NamedIndividual
type: Class
comment: A statement about the intellectual property rights (IPR) held in or over a Resource, a legal document giving official permission to do something with a resource, or a statement about access rights.
Has Version: RightsStatement-001
issued: 2008-01-14

Audience
type: NamedIndividual
type: ObjectProperty
comment: A class of entity for whom the resource is intended or useful.
range: Agent Class
Has Version: audience-003
issued: 2001-05-21
Date Modified: 2008-01-14

Service Class
type: Class
comment: A set of service encoding schemes and/or formats
issued: 2007-12-12
Date Modified: 2010-04-13

Rights Holder
type: NamedIndividual
type: ObjectProperty
comment: A person or organization owning or managing rights over the resource.
range: Agent
Has Version: rightsHolder-002
issued: 2004-06-14
Date Modified: 2008-01-14

Linguistic System
type: NamedIndividual
type: Class
comment: A system of signs, symbols, sounds, gestures, or rules used in communication.
description: Examples include written, spoken, sign, and computer languages.
Has Version: LinguisticSystem-001
issued: 2008-01-14

Spatial Thing
type: Class
comment: This is a stub class which allows us to defer which external vocabulary to adopt. Adoption can be at run-time through a owl:equivalentClass axiom in the data - likely to be w3 geo or OGC GeoSPARQL or both, or something else as proposed by SDWWG.
comment: A Spatial Thing describes the spatial characteristics of the resources within a Dataset, i.e. the geographical area where data was collected, a place which is the predominant subject of the Dataset, or a location which is the focus of an activity described in the Dataset.
subclass of: SpatialObject

hasUpdateFrequency
type: ObjectProperty
comment: Describes the anticipated frequency of updates of a Dataset.

License
type: ObjectProperty
type: NamedIndividual
type: AnnotationProperty
comment: A legal document giving official permission to do something with the resource.
range: License Document
sub property of: Rights
Has Version: license-002
issued: 2004-06-14
Date Modified: 2008-01-14

Mediator
type: ObjectProperty
type: NamedIndividual
comment: An entity that mediates access to the resource and for whom the resource is intended or useful.
range: Agent Class
sub property of: Audience
description: In an educational context, a mediator might be a parent, teacher, teaching assistant, or care-giver.
Has Version: mediator-003
issued: 2001-05-21
Date Modified: 2008-01-14

hasLocalGovernmentArea
type: ObjectProperty
comment: Defines a relation that denotes the Local Government representing a Locality (a Spatial Thing).
domain: Locality
range: Local Government

Has Version
type: NamedIndividual
comment: A related resource that is a version, edition, or adaptation of the described resource.
sub property of: Relation
Has Version: hasVersion-003
issued: 2000-07-11
Date Modified: 2008-01-14
note: This term is intended to be used with non-literal values as defined in the DCMI Abstract Model (http://dublincore.org/documents/abstract-model/). As of December 2007, the DCMI Usage Board is seeking a way to express this intention with a formal range declaration.

Availability
type: AnnotationProperty
comment: How the resource can be obtained or accessed, or contact information.
sub property of: availability
issued: 2007-12-19
Date Modified: 2009-02-02
Type: Property

NLM
type: VocabularyEncodingScheme
type: NamedIndividual
comment: The set of conceptual resources specified by the National Library of Medicine Classification.
Has Version: NLM-002
issued: 2005-06-13
Date Modified: 2008-01-14

Agent Class
type: Class
type: NamedIndividual
comment: A group of agents.
subclass of: Class
description: Examples of Agent Class include groups seen as classes, such as students, women, charities, lecturers.
Has Version: AgentClass-003
issued: 2008-01-14
Date Modified: 2012-06-14

AGLS Agent Class
type: Class
comment: A set of agent encoding schemes and/or formats
issued: 2008-05-27
Date Modified: 2010-04-13

Policy
type: NamedIndividual
type: Class
comment: A plan or course of action by an authority, intended to influence and determine decisions, actions, and other matters.
Has Version: Policy-001
issued: 2008-01-14

Date Valid
type: AnnotationProperty
type: DatatypeProperty
type: NamedIndividual
comment: Date (often a range) of validity of a resource.
range: Literal
sub property of: Date
Has Version: valid-003
issued: 2000-07-11
Date Modified: 2008-01-14

AAGLS Agent Scheme
type: Datatype
comment: The set of agents defined by contact details according to Dublin Core Structured Values
issued: 2002-04-18
Date Modified: 2009-02-02

Identifier
type: AnnotationProperty
comment: An unambiguous reference to the resource within a given context.
description: Recommended best practice is to identify the resource by means of a string conforming to a formal identification system.
Has Version: identifier-006
issued: 1999-07-02
Date Modified: 2008-01-14
note: A second property with the same name as this property has been declared in the dcterms: namespace (http://purl.org/dc/terms/). See the Introduction to the document "DCMI Metadata Terms" (http://dublincore.org/documents/dcmi-terms/) for an explanation.

Provenance Statement
type: NamedIndividual
type: Class
comment: A statement of any changes in ownership and custody of a resource since its creation that are significant for its authenticity, integrity, and interpretation.
Has Version: ProvenanceStatement-001
issued: 2008-01-14

Method of Accrual
type: NamedIndividual
type: Class
comment: A method by which resources are added to a collection.
Has Version: MethodOfAccrual-001
issued: 2008-01-14

Requires
type: AnnotationProperty
type: NamedIndividual
comment: A related resource that is required by the described resource to support its function, delivery, or coherence.
sub property of: Relation
Has Version: requires-003
issued: 2000-07-11
Date Modified: 2008-01-14
note: This term is intended to be used with non-literal values as defined in the DCMI Abstract Model (http://dublincore.org/documents/abstract-model/). As of December 2007, the DCMI Usage Board is seeking a way to express this intention with a formal range declaration.

Language
type: AnnotationProperty
comment: A language of the resource.
description: Recommended best practice is to use a controlled vocabulary such as RFC 4646 [RFC4646].
Has Version: language-007
issued: 1999-07-02
Date Modified: 2008-01-14
note: A second property with the same name as this property has been declared in the dcterms: namespace (http://purl.org/dc/terms/). See the Introduction to the document "DCMI Metadata Terms" (http://dublincore.org/documents/dcmi-terms/) for an explanation.

File Size
type: DatatypeProperty
comment: The size of a distribution in bytes.
equivalent property: byteSize

Replaces
type: NamedIndividual
type: AnnotationProperty
comment: A related resource that is supplanted, displaced, or superseded by the described resource.
sub property of: Relation
Has Version: replaces-003
issued: 2000-07-11
Date Modified: 2008-01-14
note: This term is intended to be used with non-literal values as defined in the DCMI Abstract Model (http://dublincore.org/documents/abstract-model/). As of December 2007, the DCMI Usage Board is seeking a way to express this intention with a formal range declaration.

MeSH
type: VocabularyEncodingScheme
type: NamedIndividual
comment: The set of labeled concepts specified by the Medical Subject Headings.
Has Version: MESH-003
issued: 2000-07-11
Date Modified: 2008-01-14

Document Type
type: AnnotationProperty
type: ObjectProperty
comment: The form of the resource where category = 'document'.
sub property of: Type
description: Document is used in its widest sense and includes such things as software, sound files and images.
issued: 2002-04-18
Date Modified: 2007-12-19
Type: Property

hasSpatialExtent
type: ObjectProperty
comment: Spatial extent corresponds to the geographic area within which all items in the dataset fall.
domain: Class
  union of: Dataset
  union of: Locality
range: Spatial Thing

Is Version Of
type: NamedIndividual
type: AnnotationProperty
comment: A related resource of which the described resource is a version, edition, or adaptation.
sub property of: Relation
description: Changes in version imply substantive changes in content rather than differences in format.
Has Version: isVersionOf-003
issued: 2000-07-11
Date Modified: 2008-01-14
note: This term is intended to be used with non-literal values as defined in the DCMI Abstract Model (http://dublincore.org/documents/abstract-model/). As of December 2007, the DCMI Usage Board is seeking a way to express this intention with a formal range declaration.

Audience Education Level
type: NamedIndividual
type: ObjectProperty
comment: A class of entity, defined in terms of progression through an educational or training context, for which the described resource is intended.
range: Agent Class
sub property of: Audience
Has Version: educationLevel-002
issued: 2002-07-13
Date Modified: 2008-01-14

Coverage
type: NamedIndividual
type: ObjectProperty
type: AnnotationProperty
comment: The spatial or temporal topic of the resource, the spatial applicability of the resource, or the jurisdiction under which the resource is relevant.
range: Location, Period, or Jurisdiction
sub property of: Coverage
description: Spatial topic and spatial applicability may be a named place or a location specified by its geographic coordinates. Temporal topic may be a named period, date, or date range. A jurisdiction may be a named administrative entity or a geographic place to which the resource applies. Recommended best practice is to use a controlled vocabulary such as the Thesaurus of Geographic Names [TGN]. Where appropriate, named places or time periods can be used in preference to numeric identifiers such as sets of coordinates or date ranges.
Has Version: coverageT-001
issued: 2008-01-14
Date Modified: 2008-01-14

Period of Time
type: NamedIndividual
type: Class
comment: An interval of time that is named or defined by its start and end dates.
subclass of: Location, Period, or Jurisdiction
Has Version: PeriodOfTime-001
issued: 2008-01-14

DCMI Point
type: NamedIndividual
type: Datatype
comment: The set of points in space defined by their geographic coordinates according to the DCMI Point Encoding Scheme.
Has Version: Point-003
issued: 2000-07-11
Date Modified: 2008-01-14

Standard
type: NamedIndividual
type: Class
comment: A basis for comparison; a reference point against which other things can be evaluated.
Has Version: Standard-001
issued: 2008-01-14

Time Interval
type: Class
comment: Note that this is a subclass of the Interval class from OWL-Time.
comment: A Time Interval describes a time period (interval) during which data was collected or observations were made that are described in the Dataset.
subclass of: Interval

State and Territories Government
type: Class
comment: States and Territories Government are the second tier of Government in the Commonwealth of Australia. The Commonwealth of Australia comprises of six states and various territories some of which enjoy a large degree of self-governance.
subclass of: Level of Government

Identifier
type: DatatypeProperty
type: NamedIndividual
type: AnnotationProperty
comment: An unambiguous reference to the resource within a given context.
range: Literal
sub property of: Identifier
description: Recommended best practice is to identify the resource by means of a string conforming to a formal identification system.
Has Version: identifierT-001
issued: 2008-01-14
Date Modified: 2008-01-14

Date Created
type: NamedIndividual
type: DatatypeProperty
type: AnnotationProperty
comment: Date of creation of the resource.
range: Literal
sub property of: Date
Has Version: created-003
issued: 2000-07-11
Date Modified: 2008-01-14

AssociatedOrganisation
type: Class
comment: An AssociatedOrganisation is an Organisation that is responsible for an Event that changed a Dataset the Organisation is associated with.
subclass of: Association

hasLicense
type: ObjectProperty
comment: A relation that associates a Catalog, Dataset or Distribution to its license document under which it is made available.
sub property of: License

AGLS Availability Scheme
type: Datatype
comment: The set of resource availability or physical access to a resource defined by contact details according to Dublin Core Structured Values
issued: 2002-04-18
Date Modified: 2009-02-02

Provenance
type: ObjectProperty
type: NamedIndividual
comment: A statement of any changes in ownership and custody of the resource since its creation that are significant for its authenticity, integrity, and interpretation.
range: Provenance Statement
description: The statement may include a description of any changes successive custodians made to the resource.
Has Version: provenance-002
issued: 2004-09-20
Date Modified: 2008-01-14

DCMI Metadata Terms - other
type: NamedIndividual
Date Modified: 2012-06-14
publisher: DCMI

Federal Government
type: Class
comment: Federal Government denotes the federal democratic administrative authority of the Commonwealth of Australia.
subclass of: Level of Government

Subject
type: ObjectProperty
comment: The topic of the resource.
description: Typically, the subject will be represented using keywords, key phrases, or classification codes. Recommended best practice is to use a controlled vocabulary.
Has Version: subject-007
issued: 1999-07-02
Date Modified: 2012-06-14
note: A second property with the same name as this property has been declared in the dcterms: namespace (http://purl.org/dc/terms/). See the Introduction to the document "DCMI Metadata Terms" (http://dublincore.org/documents/dcmi-terms/) for an explanation.

Location
type: NamedIndividual
type: Class
comment: A spatial region or named place.
subclass of: Location, Period, or Jurisdiction
Has Version: Location-001
issued: 2008-01-14

classifiedAs
type: ObjectProperty
comment: A relation to define the main category of the dataset. A dataset can have multiple themes.
domain: Dataset
range: Classifier
sub property of: theme

Bibliographic Resource
type: NamedIndividual
type: Class
comment: A book, article, or other documentary resource.
Has Version: BibliographicResource-001
issued: 2008-01-14

Format
type: AnnotationProperty
type: NamedIndividual
comment: The file format, physical medium, or dimensions of the resource.
range: Media Type or Extent
sub property of: Format
description: Examples of dimensions include size and duration. Recommended best practice is to use a controlled vocabulary such as the list of Internet Media Types [MIME].
Has Version: formatT-001
issued: 2008-01-14
Date Modified: 2008-01-14

Level of Government
type: Class
comment: Level of Government is a description that is used to describe the Jurisidiction of an Organisation.

Spatial Coverage
type: ObjectProperty
type: AnnotationProperty
type: NamedIndividual
comment: Spatial characteristics of the resource.
range: Location
sub property of: Coverage
Has Version: spatial-003
issued: 2000-07-11
Date Modified: 2008-01-14

ISO 639-2
type: NamedIndividual
type: Datatype
comment: The three-letter alphabetic codes listed in ISO639-2 for the representation of names of languages.
Has Version: ISO639-2-003
issued: 2000-07-11
Date Modified: 2008-01-14

Physical Medium
type: NamedIndividual
type: Class
comment: A physical material or carrier.
subclass of: Media Type
description: Examples include paper, canvas, or DVD.
Has Version: PhysicalMedium-001
issued: 2008-01-14

Is Format Of
type: AnnotationProperty
type: NamedIndividual
comment: A related resource that is substantially the same as the described resource, but in another format.
sub property of: Relation
Has Version: isFormatOf-003
issued: 2000-07-11
Date Modified: 2008-01-14
note: This term is intended to be used with non-literal values as defined in the DCMI Abstract Model (http://dublincore.org/documents/abstract-model/). As of December 2007, the DCMI Usage Board is seeking a way to express this intention with a formal range declaration.

Alternative Title
type: AnnotationProperty
type: NamedIndividual
type: DatatypeProperty
comment: An alternative name for the resource.
range: Literal
sub property of: Title
description: The distinction between titles and alternative titles is application-specific.
Has Version: alternative-003
issued: 2000-07-11
Date Modified: 2010-10-11

Mandate
type: AnnotationProperty
comment: A specific legal instrument which requires a resource to be created or made available.
sub property of: mandate
issued: 2007-12-19
Date Modified: 2009-02-02
Type: Property

Language
type: AnnotationProperty
type: ObjectProperty
type: NamedIndividual
comment: A language of the resource.
range: Linguistic System
sub property of: Language
description: Recommended best practice is to use a controlled vocabulary such as RFC 4646 [RFC4646].
Has Version: languageT-001
issued: 2008-01-14
Date Modified: 2008-01-14

Relation
type: AnnotationProperty
comment: A related resource.
description: Recommended best practice is to identify the related resource by means of a string conforming to a formal identification system.
Has Version: relation-006
issued: 1999-07-02
Date Modified: 2008-01-14
note: A second property with the same name as this property has been declared in the dcterms: namespace (http://purl.org/dc/terms/). See the Introduction to the document "DCMI Metadata Terms" (http://dublincore.org/documents/dcmi-terms/) for an explanation.

Creator
comment: An entity primarily responsible for making the resource.
description: Examples of a Creator include a person, an organization, or a service. Typically, the name of a Creator should be used to indicate the entity.
Has Version: creator-006
issued: 1999-07-02
Date Modified: 2008-01-14
note: A second property with the same name as this property has been declared in the dcterms: namespace (http://purl.org/dc/terms/). See the Introduction to the document "DCMI Metadata Terms" (http://dublincore.org/documents/dcmi-terms/) for an explanation.

Media Type or Extent
type: NamedIndividual
type: Class
comment: A media type or extent.
Has Version: MediaTypeOrExtent-001
issued: 2008-01-14

Format
type: AnnotationProperty
comment: The file format, physical medium, or dimensions of the resource.
description: Examples of dimensions include size and duration. Recommended best practice is to use a controlled vocabulary such as the list of Internet Media Types [MIME].
Has Version: format-007
issued: 1999-07-02
Date Modified: 2008-01-14
note: A second property with the same name as this property has been declared in the dcterms: namespace (http://purl.org/dc/terms/). See the Introduction to the document "DCMI Metadata Terms" (http://dublincore.org/documents/dcmi-terms/) for an explanation.

Source
type: AnnotationProperty
type: NamedIndividual
comment: A related resource from which the described resource is derived.
sub property of: Source
sub property of: Relation
description: The described resource may be derived from the related resource in whole or in part. Recommended best practice is to identify the related resource by means of a string conforming to a formal identification system.
Has Version: sourceT-001
issued: 2008-01-14
Date Modified: 2008-01-14
note: This term is intended to be used with non-literal values as defined in the DCMI Abstract Model (http://dublincore.org/documents/abstract-model/). As of December 2007, the DCMI Usage Board is seeking a way to express this intention with a formal range declaration.

Date
type: DatatypeProperty
type: NamedIndividual
type: AnnotationProperty
comment: A point or period of time associated with an event in the lifecycle of the resource.
range: Literal
sub property of: Date
description: Date may be used to express temporal information at any level of granularity. Recommended best practice is to use an encoding scheme, such as the W3CDTF profile of ISO 8601 [W3CDTF].
Has Version: dateT-001
issued: 2008-01-14
Date Modified: 2008-01-14

AGLS Audience Vocabulary
type: Class
comment: The set of audience types specified by the AGLS Audience Scheme.
issued: 2002-04-18
Date Modified: 2009-02-02

isMemberOf
type: ObjectProperty
comment: Defines a relation that denotes the beloning of an Agent to an Organisation.
domain: Agent
range: Organisation

Document Class
type: Class
comment: A set of document encoding schemes and/or formats
issued: 2007-12-12
Date Modified: 2009-02-02

Temporal Coverage
type: NamedIndividual
type: AnnotationProperty
type: ObjectProperty
comment: Temporal characteristics of the resource.
range: Period of Time
sub property of: Coverage
Has Version: temporal-003
issued: 2000-07-11
Date Modified: 2008-01-14

Abstract
type: NamedIndividual
type: AnnotationProperty
comment: A summary of the resource.
sub property of: Description
Has Version: abstract-003
issued: 2000-07-11
Date Modified: 2008-01-14

hasDataset
type: ObjectProperty
comment: Defines a Dataset to be part of a Catalog.
equivalent property: dataset
inverse of: inCatalog

Update Date
type: DatatypeProperty
comment: A relation to define when the Dataset was updated, i.e. a minor change that is not reflected in a Dataset Change Event.
range: dateTime
sub property of: Change Event Date

Service Type
type: ObjectProperty
type: AnnotationProperty
comment: The form of the resource where category = 'service'.
sub property of: Type
issued: 2002-04-18
Date Modified: 2007-12-19
Type: Property

Is Part Of
type: AnnotationProperty
type: NamedIndividual
comment: A related resource in which the described resource is physically or logically included.
sub property of: Relation
Has Version: isPartOf-003
issued: 2000-07-11
Date Modified: 2008-01-14
note: This term is intended to be used with non-literal values as defined in the DCMI Abstract Model (http://dublincore.org/documents/abstract-model/). As of December 2007, the DCMI Usage Board is seeking a way to express this intention with a formal range declaration.

RFC 5646
type: NamedIndividual
type: Datatype
comment: The set of tags constructed according to RFC 5646 for the identification of languages.
description: RFC 5646 obsoletes RFC 4646.
Has Version: RFC5646-001
issued: 2010-10-11

Organisation
type: Class
comment: An Organisation is a kind of Agent representing, for example, a business or government, or organisational subunits thereof.
subclass of: Organization
subclass of: Agent

Source
type: AnnotationProperty
comment: A related resource from which the described resource is derived.
description: The described resource may be derived from the related resource in whole or in part. Recommended best practice is to identify the related resource by means of a string conforming to a formal identification system.
Has Version: source-006
issued: 1999-07-02
Date Modified: 2008-01-14
note: A second property with the same name as this property has been declared in the dcterms: namespace (http://purl.org/dc/terms/). See the Introduction to the document "DCMI Metadata Terms" (http://dublincore.org/documents/dcmi-terms/) for an explanation.

Description
comment: An account of the resource.
description: Description may include but is not limited to: an abstract, a table of contents, a graphical representation, or a free-text account of the resource.
Has Version: description-006
issued: 1999-07-02
Date Modified: 2008-01-14
note: A second property with the same name as this property has been declared in the dcterms: namespace (http://purl.org/dc/terms/). See the Introduction to the document "DCMI Metadata Terms" (http://dublincore.org/documents/dcmi-terms/) for an explanation.

Jurisdiction
type: NamedIndividual
type: Class
comment: The extent or range of judicial, law enforcement, or other authority.
subclass of: Location, Period, or Jurisdiction
Has Version: Jurisdiction-001
issued: 2008-01-14

RFC 1766
type: NamedIndividual
type: Datatype
comment: The set of tags, constructed according to RFC 1766, for the identification of languages.
Has Version: RFC1766-003
issued: 2000-07-11
Date Modified: 2008-01-14

License Document
type: NamedIndividual
type: Class
comment: A legal document giving official permission to do something with a Resource.
subclass of: Rights Statement
Has Version: LicenseDocument-001
issued: 2008-01-14

Dataset Maintenance Arrangement
type: Class
comment: Provides information about the maintenance arrangements for the dataset. At a minimum the Agent and start-time for the maintenance responsibility is required.
subclass of: Activity
subclass of: Restriction
  cardinality: 1
  on property: startedAtTime
subclass of: Restriction
  min cardinality: 0
  on property: endedAtTime
subclass of: Restriction
  min cardinality: 1
  on property: wasAssociatedWith

Date Submitted
type: NamedIndividual
type: DatatypeProperty
type: AnnotationProperty
comment: Date of submission of the resource.
range: Literal
sub property of: Date
description: Examples of resources to which a Date Submitted may be relevant are a thesis (submitted to a university department) or an article (submitted to a journal).
Has Version: dateSubmitted-002
issued: 2002-07-13
Date Modified: 2008-01-14

LCSH
type: VocabularyEncodingScheme
type: NamedIndividual
comment: The set of labeled concepts specified by the Library of Congress Subject Headings.
Has Version: LCSH-003
issued: 2000-07-11
Date Modified: 2008-01-14

Jurisdiction Class
type: Class
comment: A set of jurisdiction encoding schemes and/or formats
issued: 2007-12-12
Date Modified: 2009-02-02

hasDownloadURL
type: ObjectProperty
comment: Defines the URLs that contains the Distribution of the Dataset in a given format.
equivalent property: downloadURL

IMT
type: VocabularyEncodingScheme
type: NamedIndividual
comment: The set of media types specified by the Internet Assigned Numbers Authority.
Has Version: IMT-004
issued: 2000-07-11
Date Modified: 2008-01-14

Relation
type: NamedIndividual
type: AnnotationProperty
comment: A related resource.
sub property of: Relation
description: Recommended best practice is to identify the related resource by means of a string conforming to a formal identification system.
Has Version: relationT-001
issued: 2008-01-14
Date Modified: 2008-01-14
note: This term is intended to be used with non-literal values as defined in the DCMI Abstract Model (http://dublincore.org/documents/abstract-model/). As of December 2007, the DCMI Usage Board is seeking a way to express this intention with a formal range declaration.

Availability Class
type: Class
comment: A set of availability encoding schemes and/or formats
issued: 2007-12-12
Date Modified: 2009-02-02

Title
type: DatatypeProperty
type: NamedIndividual
comment: A name given to the resource.
range: Literal
sub property of: Title
Has Version: titleT-002
issued: 2008-01-14
Date Modified: 2010-10-11

Agent
type: Agent Class
type: NamedIndividual
type: Class
comment: A resource that acts or has the power to act.
description: Examples of Agent include person, organization, and software agent.
Has Version: Agent-001
issued: 2008-01-14

DCMI Box
type: NamedIndividual
type: Datatype
comment: The set of regions in space defined by their geographic coordinates according to the DCMI Box Encoding Scheme.
Has Version: Box-003
issued: 2000-07-11
Date Modified: 2008-01-14

Local Government
type: Class
comment: Local Government is the lowest tier of government in the Commonwealth of Australia administered under the states and territories.
subclass of: Level of Government
subclass of: Restriction
  cardinality: 1
  on property: inState

File Format
type: NamedIndividual
type: Class
comment: A digital resource format.
subclass of: Media Type
description: Examples include the formats defined by the list of Internet Media Types.
Has Version: FileFormat-001
issued: 2008-01-14

hasLandingPage
type: ObjectProperty
comment: Defines a relation that associates a Catalog, Dataset or Distribution with its (one) main Web page that can be navigated to in a Web browser to gain access to the dataset, its distributions and/or additional information.
range: Document
sub property of: landingPage

Date Licensed
type: AnnotationProperty
type: DatatypeProperty
comment: Date a license was applied or became effective.
range: Literal
sub property of: Date
issued: 2007-12-12
Date Modified: 2009-02-02
Type: Property

maintenanceArrangement
type: ObjectProperty
comment: Links to a description of a maintenance activity.
domain: Dataset
range: Dataset Maintenance Arrangement
sub property of: wasInfluencedBy

Dataset
type: Class
comment: A Dataset is a collection of resources, published or curated by an agent, and openly available for download in one or more formats.
subclass of: Entity
subclass of: Dataset
subclass of: Restriction
  min cardinality: 1
  on property: AGIFT Theme
subclass of: Restriction
  on property: Update Date
  some values from: Literal
subclass of: Restriction
  on property: Change Event Date
  some values from: Literal
subclass of: Restriction
  on property: License
  some values from: License Document

Function
type: AnnotationProperty
comment: The business function to which the resource relates.
sub property of: function
issued: 2007-12-19
Date Modified: 2007-12-19
Type: Property

Case
type: AnnotationProperty
comment: A specific piece of case law which requires or drives the creation or provision of the resource.
sub property of: Mandate
sub property of: mandate
issued: 2002-04-18
Date Modified: 2009-02-02
Type: Property

Medium
type: NamedIndividual
type: ObjectProperty
type: AnnotationProperty
comment: The material or physical carrier of the resource.
domain: Physical Resource
range: Physical Medium
sub property of: Format
Has Version: medium-003
issued: 2000-07-11
Date Modified: 2008-01-14

Subject
type: NamedIndividual
type: AnnotationProperty
comment: The topic of the resource.
sub property of: Subject
description: Typically, the subject will be represented using keywords, key phrases, or classification codes. Recommended best practice is to use a controlled vocabulary.
Has Version: subjectT-002
issued: 2008-01-14
Date Modified: 2012-06-14
note: This term is intended to be used with non-literal values as defined in the DCMI Abstract Model (http://dublincore.org/documents/abstract-model/). As of December 2007, the DCMI Usage Board is seeking a way to express this intention with a formal range declaration.

Size or Duration
type: NamedIndividual
type: Class
comment: A dimension or extent, or a time taken to play or execute.
subclass of: Media Type or Extent
description: Examples include a number of pages, a specification of length, width, and breadth, or a period in hours, minutes, and seconds.
Has Version: SizeOrDuration-001
issued: 2008-01-14

playsRole
type: ObjectProperty
comment: A relation that defines the Role someone plays in a Dataset Change event defined through an Association entity.
domain: Association
range: Role
sub property of: hadRole
inverse of: roleOf

Type
type: NamedIndividual
type: AnnotationProperty
type: ObjectProperty
comment: The nature or genre of the resource.
range: Class
sub property of: Type
description: Recommended best practice is to use a controlled vocabulary such as the DCMI Type Vocabulary [DCMITYPE]. To describe the file format, physical medium, or dimensions of the resource, use the Format element.
Has Version: typeT-001
issued: 2008-01-14
Date Modified: 2008-01-14

isChangedBy
type: ObjectProperty
comment: Defines a relation that relates a Dataset Change Event to a Dataset. Typically, at least, a Publishing Change Event should be defined that describes when a Dataset is published on the Web.
domain: Dataset
range: Dataset Change Event
sub property of: wasInfluencedBy
inverse of: resultedIn

hasTemporalExtent
type: ObjectProperty
comment: Temporal extent corresponds to the time interval within which all items in the dataset occur.
domain: Dataset
range: Time Interval

Locality
type: Class
comment: Locality is a Spatial Thing corresponding to a place or area, which is denoted by a commonly recognised, or formally designated, name or description.
subclass of: Spatial Thing

Role
type: Class
comment: A Role corresponds to the involvement of an Agent in an Event, e.g. fulfilling a publisher, contributor or custodian Role.
subclass of: Role

downloadURL
comment: Defines a relation between a Dataset and the URL that contains the distribution of the dataset in a given format.

Date Modified
type: DatatypeProperty
type: NamedIndividual
comment: Date on which the resource was changed.
range: Literal
sub property of: Date
Has Version: modified-003
issued: 2000-07-11
Date Modified: 2008-01-14

Australian and New Zealand Standard Classification of Occupations
type: Datatype
comment: The set of occupations specified by the Australian Bureau of Statistics.
issued: 2002-04-18
Date Modified: 2009-02-02

TGN
type: VocabularyEncodingScheme
type: NamedIndividual
comment: The set of places specified by the Getty Thesaurus of Geographic Names.
Has Version: TGN-003
issued: 2000-07-11
Date Modified: 2008-01-14

hasAgent
type: ObjectProperty
comment: Defines a relationship for the Agent responsible for a DatasetChangeEvent through an Association that defines the Organisation that the Agent is associated with for that Event.
range: Agent
sub property of: agent

URI
type: NamedIndividual
type: Datatype
comment: The set of identifiers constructed according to the generic syntax for Uniform Resource Identifiers as specified by the Internet Engineering Task Force.
Has Version: URI-003
issued: 2000-07-11
Date Modified: 2008-01-14

Contributor
comment: An entity responsible for making contributions to the resource.
description: Examples of a Contributor include a person, an organization, or a service. Typically, the name of a Contributor should be used to indicate the entity.
Has Version: contributor-006
issued: 1999-07-02
Date Modified: 2008-01-14
note: A second property with the same name as this property has been declared in the dcterms: namespace (http://purl.org/dc/terms/). See the Introduction to the document "DCMI Metadata Terms" (http://dublincore.org/documents/dcmi-terms/) for an explanation.

Conforms To
type: ObjectProperty
type: AnnotationProperty
type: NamedIndividual
comment: An established standard to which the described resource conforms.
range: Standard
sub property of: Relation
Has Version: conformsTo-003
issued: 2001-05-21
Date Modified: 2008-01-14

Rights
type: AnnotationProperty
type: NamedIndividual
type: ObjectProperty
comment: Information about rights held in and over the resource.
range: Rights Statement
sub property of: Rights
description: Typically, rights information includes a statement about various property rights associated with the resource, including intellectual property rights.
Has Version: rightsT-001
issued: 2008-01-14
Date Modified: 2008-01-14

RFC 3066
type: Datatype
type: NamedIndividual
comment: The set of tags constructed according to RFC 3066 for the identification of languages.
description: RFC 3066 has been obsoleted by RFC 4646.
Has Version: RFC3066-002
issued: 2002-07-13
Date Modified: 2008-01-14

Category
type: ObjectProperty
type: AnnotationProperty
comment: The generic type of the resource being described.
sub property of: Type
description: There are only three valid values for this property, 'service', 'document' or 'agency'.
issued: 2002-04-18
Date Modified: 2009-02-02
Type: Property

isDescribedBy
type: ObjectProperty
comment: Defines a relation that associates a Thing to a Dataset that describes the Dataset in more detail.
domain: Dataset
range: Thing
sub property of: isPrimaryTopicOf

Creator
type: ObjectProperty
type: NamedIndividual
type: AnnotationProperty
comment: An entity primarily responsible for making the resource.
range: Agent
sub property of: Contributor
sub property of: Creator
description: Examples of a Creator include a person, an organization, or a service.
Has Version: creatorT-002
issued: 2008-01-14
Date Modified: 2010-10-11

Classifier
type: Class
comment: A classifier used for Australian Government Data.
subclass of: Concept

hasDistribution
type: ObjectProperty
comment: Defines the available distribution(s) for a Dataset.
domain: Dataset
range: Distribution
sub property of: distribution

Accrual Policy
type: NamedIndividual
type: ObjectProperty
comment: The policy governing the addition of items to a collection.
domain: Collection
range: Policy
Has Version: accrualPolicy-003
issued: 2005-06-13
Date Modified: 2010-10-11

DCMI Period
type: NamedIndividual
type: Datatype
comment: The set of time intervals defined by their limits according to the DCMI Period Encoding Scheme.
Has Version: Period-003
issued: 2000-07-11
Date Modified: 2008-01-14

DDC
type: VocabularyEncodingScheme
type: NamedIndividual
comment: The set of conceptual resources specified by the Dewey Decimal Classification.
Has Version: DDC-003
issued: 2000-07-11
Date Modified: 2008-01-14

Has Part
type: NamedIndividual
type: AnnotationProperty
comment: A related resource that is included either physically or logically in the described resource.
sub property of: Relation
Has Version: hasPart-003
issued: 2000-07-11
Date Modified: 2008-01-14
note: This term is intended to be used with non-literal values as defined in the DCMI Abstract Model (http://dublincore.org/documents/abstract-model/). As of December 2007, the DCMI Usage Board is seeking a way to express this intention with a formal range declaration.

isAssociatedWith
type: ObjectProperty
comment: Defines an association between a Dataset Change Event (e.g. Publishing) and an Association that defines the Agent and/or the Organisation responsible for that Change Event.
domain: Dataset Change Event
range: Association
sub property of: qualifiedAssociation
inverse of: participatesIn

Date
comment: A point or period of time associated with an event in the lifecycle of the resource.
description: Date may be used to express temporal information at any level of granularity. Recommended best practice is to use an encoding scheme, such as the W3CDTF profile of ISO 8601 [W3CDTF].
Has Version: date-006
issued: 1999-07-02
Date Modified: 2008-01-14
note: A second property with the same name as this property has been declared in the dcterms: namespace (http://purl.org/dc/terms/). See the Introduction to the document "DCMI Metadata Terms" (http://dublincore.org/documents/dcmi-terms/) for an explanation.

Dataset Ontology
type: Ontology
comment: The data.gov.au Dataset Ontology is an OWL ontology designed to describe the characteristics of datasets published on data.gov.au. The ontology contains elements which describe the publication, update, origin, governance, spatial and temporal coverage and other contextual information about the dataset. The ontology also covers aspects of organisational custodianship and governance. By using this ontology to describe datasets on data.gov.au publishers increase discoverability and enable the consumption of this information in other applications/systems as Linked Data. It further enables decentralised publishing of catalogs and facilitates federated dataset search across sites, e.g. in datasets that are published by the States. Other publishers of Linked Data may make assertions about data published using this ontology, e.g. they may publish information about the use of the dataset in other applications.
Contributor: d.lowe@bom.gov.au
publisher: Australian Government Linked Data Working Group
Contributor: simon.cox@csiro.au
Contributor: armin.haller@anu.edu.au
Contributor: nicholas.car@ga.gov.au
Date Created: 2015-06-19
License: https://creativecommons.org/licenses/by/4.0/
Date Modified: 2017-09-26
imports: ns
imports: time
imports: prov-o
imports: geosparql
imports: dcat
prior version: government.ttl
version IRI: http://reference.data.gov.au/def/ont/dataset/1.0
version info: 1.0

Accrual Periodicity
type: NamedIndividual
type: ObjectProperty
comment: The frequency with which items are added to a collection.
domain: Collection
range: Frequency
Has Version: accrualPeriodicity-003
issued: 2005-06-13
Date Modified: 2010-10-11

ISO 639-3
type: NamedIndividual
type: Datatype
comment: The set of three-letter codes listed in ISO 639-3 for the representation of names of languages.
Has Version: ISO639-3-001
issued: 2008-01-14

Rights
type: AnnotationProperty
comment: Information about rights held in and over the resource.
description: Typically, rights information includes a statement about various property rights associated with the resource, including intellectual property rights.
Has Version: rights-006
issued: 1999-07-02
Date Modified: 2008-01-14
note: A second property with the same name as this property has been declared in the dcterms: namespace (http://purl.org/dc/terms/). See the Introduction to the document "DCMI Metadata Terms" (http://dublincore.org/documents/dcmi-terms/) for an explanation.

Is Required By
type: NamedIndividual
type: AnnotationProperty
comment: A related resource that requires the described resource to support its function, delivery, or coherence.
sub property of: Relation
Has Version: isRequiredBy-003
issued: 2000-07-11
Date Modified: 2008-01-14
note: This term is intended to be used with non-literal values as defined in the DCMI Abstract Model (http://dublincore.org/documents/abstract-model/). As of December 2007, the DCMI Usage Board is seeking a way to express this intention with a formal range declaration.

Keyword
type: DatatypeProperty
comment: A keyword associated with the Dataset.
equivalent property: keyword

Document
type: Class
subclass of: Entity
equivalent class: Document

Government Agency
type: Class
comment: A Government Agency is a kind of Organisation in the Commonwealth of Australia that is a distinct and recognisable body which has responsibility for carrying out administrative functions.
subclass of: Organisation

hasContact
type: ObjectProperty
comment: Defines an agent who is the contact for inquiries on a Dataset.
equivalent property: contactPoint

Description
type: NamedIndividual
comment: An account of the resource.
sub property of: Description
description: Description may include but is not limited to: an abstract, a table of contents, a graphical representation, or a free-text account of the resource.
Has Version: descriptionT-001
issued: 2008-01-14
Date Modified: 2008-01-14

Has Format
type: NamedIndividual
type: AnnotationProperty
comment: A related resource that is substantially the same as the pre-existing described resource, but in another format.
sub property of: Relation
Has Version: hasFormat-003
issued: 2000-07-11
Date Modified: 2008-01-14
note: This term is intended to be used with non-literal values as defined in the DCMI Abstract Model (http://dublincore.org/documents/abstract-model/). As of December 2007, the DCMI Usage Board is seeking a way to express this intention with a formal range declaration.

Point
type: Class
comment: This is a stub class which allows us to defer which external vocabulary to adopt. Adoption can be at run-time through a owl:equivalentClass axiom - likely to be from WGS84_pos or OGC GeoSPARQL or both, or something else as proposed by the W3C SDWWG.
comment: A Point is a point in space using its geographic coordinates.
subclass of: Geometry

Field of Research
type: Class
comment: The Field of Research defined by the Australian and New Zealand Standard Research Classification (ANZSRC) that best describes the type of methods applied to obtain the data contained within a Dataset.
subclass of: Classifier

Date Available
type: AnnotationProperty
type: NamedIndividual
type: DatatypeProperty
comment: Date (often a range) that the resource became or will become available.
range: Literal
sub property of: Date
Has Version: available-003
issued: 2000-07-11
Date Modified: 2008-01-14

Change Event Date
type: DatatypeProperty
comment: The date a change was made.
range: dateTime
sub property of: Date Accepted

Catalog
type: Class
comment: A Catalog is a curated collection of metadata about datasets.
subclass of: Entity
subclass of: Catalog

RFC 4646
type: NamedIndividual
type: Datatype
comment: The set of tags constructed according to RFC 4646 for the identification of languages.
description: RFC 4646 obsoletes RFC 3066.
Has Version: RFC4646-001
issued: 2008-01-14

Is Replaced By
type: AnnotationProperty
type: NamedIndividual
comment: A related resource that supplants, displaces, or supersedes the described resource.
sub property of: Relation
Has Version: isReplacedBy-003
issued: 2000-07-11
Date Modified: 2008-01-14
note: This term is intended to be used with non-literal values as defined in the DCMI Abstract Model (http://dublincore.org/documents/abstract-model/). As of December 2007, the DCMI Usage Board is seeking a way to express this intention with a formal range declaration.

Media Type
type: NamedIndividual
type: Class
comment: A file format or physical medium.
subclass of: Media Type or Extent
Has Version: MediaType-001
issued: 2008-01-14

Spatial Gazetteer
type: Class
comment: Locality with a name authorised by a government agency
subclass of: Locality

Regulation
type: AnnotationProperty
comment: A specific regulation which requires or drives the creation or provision of the resource.
sub property of: Mandate
sub property of: mandate
issued: 2002-04-18
Date Modified: 2009-02-02
Type: Property

Table Of Contents
type: NamedIndividual
type: AnnotationProperty
comment: A list of subunits of the resource.
sub property of: Description
Has Version: tableOfContents-003
issued: 2000-07-11
Date Modified: 2008-01-14

Dublin Core Metadata Element Set, Version 1.1
Date Modified: 2012-06-14
publisher: DCMI

Title
type: AnnotationProperty
comment: A name given to the resource.
Has Version: title-006
issued: 1999-07-02
Date Modified: 2008-01-14
note: A second property with the same name as this property has been declared in the dcterms: namespace (http://purl.org/dc/terms/). See the Introduction to the document "DCMI Metadata Terms" (http://dublincore.org/documents/dcmi-terms/) for an explanation.

Protective Marking
type: AnnotationProperty
type: ObjectProperty
comment: A protective marking applied to the resource.
sub property of: Rights
issued: 2007-12-12
Date Modified: 2009-02-06
Type: Property

Geocode
type: Datatype
comment: Geographic coordinates expressed as latitude and longitude.
issued: 2008-10-21
Date Modified: 2010-04-13

Is Version Of
type: NamedIndividual
type: AnnotationProperty
comment: A related resource that is a performance, production, derivation, translation or interpretation of the described resource.
sub property of: Relation
issued: 2002-04-18
Date Modified: 2009-02-02
Type: Property

Distribution
type: Class
comment: A Distribution defines the available form of a Dataset, i.e. different formats of the Dataset or different type of endpoints the Dataset can be retrieved from.
subclass of: Entity
subclass of: Distribution

Polygon
type: Class
comment: This is a stub class which allows us to defer which external vocabulary to adopt. Adoption can be at run-time through a owl:equivalentClass axiom in the data - likely to be from WGS84_pos or OGC GeoSPARQL or both, or something else as proposed by the W3C SDWWG.
subclass of: Geometry

Publisher
type: NamedIndividual
type: ObjectProperty
comment: An entity responsible for making the resource available.
range: Agent
sub property of: Publisher
description: Examples of a Publisher include a person, an organization, or a service.
Has Version: publisherT-001
issued: 2008-01-14
Date Modified: 2010-10-11

Type
type: AnnotationProperty
comment: The nature or genre of the resource.
description: Recommended best practice is to use a controlled vocabulary such as the DCMI Type Vocabulary [DCMITYPE]. To describe the file format, physical medium, or dimensions of the resource, use the Format element.
Has Version: type-006
issued: 1999-07-02
Date Modified: 2008-01-14
note: A second property with the same name as this property has been declared in the dcterms: namespace (http://purl.org/dc/terms/). See the Introduction to the document "DCMI Metadata Terms" (http://dublincore.org/documents/dcmi-terms/) for an explanation.

DCMI Type Vocabulary
type: VocabularyEncodingScheme
type: NamedIndividual
comment: The set of classes specified by the DCMI Type Vocabulary, used to categorize the nature or genre of the resource.
Has Version: DCMIType-005
issued: 2000-07-11
Date Modified: 2012-06-14

Aggregation Level
type: AnnotationProperty
type: ObjectProperty
comment: The level of aggregation of the described resource.
domain: Collection
sub property of: Type
description: There are only two values possible for this refinement, either item or collection.
issued: 2002-04-18
Date Modified: 2007-12-19
Type: Property

Extent
type: NamedIndividual
type: ObjectProperty
comment: The size or duration of the resource.
range: Size or Duration
sub property of: Format
Has Version: extent-003
issued: 2000-07-11
Date Modified: 2008-01-14

Dataset Change Event
type: Class
comment: A Dataset Change Event is a description of an event that happens at a given point in time and that results in any type of change to the Dataset.
subclass of: Activity

Location, Period, or Jurisdiction
type: NamedIndividual
type: Class
comment: A location, period of time, or jurisdiction.
Has Version: LocationPeriodOrJurisdiction-001
issued: 2008-01-14

Accrual Method
type: NamedIndividual
type: ObjectProperty
comment: The method by which items are added to a collection.
domain: Collection
range: Method of Accrual
Has Version: accrualMethod-003
issued: 2005-06-13
Date Modified: 2010-10-11

hasPurpose
type: DatatypeProperty
comment: The purpose of a Dataset.
domain: Dataset
range: Literal

References
type: AnnotationProperty
type: NamedIndividual
comment: A related resource that is referenced, cited, or otherwise pointed to by the described resource.
sub property of: Relation
Has Version: references-003
issued: 2000-07-11
Date Modified: 2008-01-14
note: This term is intended to be used with non-literal values as defined in the DCMI Abstract Model (http://dublincore.org/documents/abstract-model/). As of December 2007, the DCMI Usage Board is seeking a way to express this intention with a formal range declaration.

Contributor
type: NamedIndividual
type: AnnotationProperty
type: ObjectProperty
comment: An entity responsible for making contributions to the resource.
range: Agent
sub property of: Contributor
description: Examples of a Contributor include a person, an organization, or a service.
Has Version: contributorT-001
issued: 2008-01-14
Date Modified: 2010-10-11

inState
type: ObjectProperty
comment: Defines the State or Territory a Locality is located in.
domain: Locality
range: State and Territories Government

Physical Resource
type: NamedIndividual
type: Class
comment: A material thing.
Has Version: PhysicalResource-001
issued: 2008-01-14

Date Copyrighted
type: NamedIndividual
type: DatatypeProperty
type: AnnotationProperty
comment: Date of copyright.
range: Literal
sub property of: Date
Has Version: dateCopyrighted-002
issued: 2002-07-13
Date Modified: 2008-01-14

Function
type: Class
comment: The Government Function defined by the Australian Governments' Interactive Functions Thesaurus that best describes the data contained within a Dataset.
subclass of: Classifier
Source: Function Class

Date Issued
type: NamedIndividual
type: DatatypeProperty
comment: Date of formal issuance (e.g., publication) of the resource.
range: Literal
sub property of: Date
Has Version: issued-003
issued: 2000-07-11
Date Modified: 2008-01-14

Government Online Directory
type: Datatype
comment: The set of agents defined by contact details according to X500 syntax.
issued: 2002-04-18
Date Modified: 2009-02-02

Frequency
type: NamedIndividual
type: Class
comment: A rate at which something recurs.
Has Version: Frequency-001
issued: 2008-01-14

Is Referenced By
type: AnnotationProperty
type: NamedIndividual
comment: A related resource that references, cites, or otherwise points to the described resource.
sub property of: Relation
Has Version: isReferencedBy-003
issued: 2000-07-11
Date Modified: 2008-01-14
note: This term is intended to be used with non-literal values as defined in the DCMI Abstract Model (http://dublincore.org/documents/abstract-model/). As of December 2007, the DCMI Usage Board is seeking a way to express this intention with a formal range declaration.

Dataset Publication Event
type: Class
comment: A Dataset Publication Event is a description of an event that happens at a given point in time and that results in the publication of a Dataset on data.gov.au.
subclass of: Dataset Change Event

Act
type: AnnotationProperty
comment: A specific piece of legislation which requires or drives the creation or provision of the resource.
sub property of: Mandate
sub property of: mandate
issued: 2002-04-18
Date Modified: 2009-02-02
Type: Property

Has Version
type: NamedIndividual
type: AnnotationProperty
comment: A related resource of which the described resource is a performance, production, derivation, translation or interpretation.
sub property of: Relation
issued: 2002-04-18
Date Modified: 2009-02-02
Type: Property

publisher
type: ObjectProperty
type: AnnotationProperty
comment: A Publisher plays the Role of uploading the Dataset to data.gov.au.
sub property of: Publisher

Jurisdiction
type: ObjectProperty
type: AnnotationProperty
comment: The name of the political/administrative entity covered by the resource.
domain: Jurisdiction
sub property of: Coverage
description: Jurisdiction is a description of the territory over which a particular government exercises its authority or a particular business transacts its operations, to which the resource content is applicable.
issued: 2002-04-18
Date Modified: 2007-12-19
Type: Property