Dem@Care Lab Ontology for Dementia Assessment
type: Ontology
version info: 1.0
date: 2014-09-02
creator: Georgios Meditskos, Ioannis Kompatsiaris
description: The ontology has been developed in the framework of the Dem@Care project for representing the experimentation protocol towards diagnostic support and assessment of Dementia in a controlled environment. The aim of the protocol is to provide a brief overview of their health status of the participants during consultation (cognition, behaviours and function), and to correlate the system (sensor) data with the data collected using typical dementia care assessment tools. The ontology describes the basic Steps of the experimentation protocol (Directed Activities, Semi-directed Activities and Free Discussion with the Clinician), the Tasks that are involved, as well as the measurement types relevant to each Task. The defined protocol can be reused and further extended, adding new steps, tasks and measured data. Documentation regarding the ontology vocabulary can be found at http://www.demcare.eu/ontologies/demlab.html
preferred namespace prefix: demlab
Rights: This ontology is licensed under Creative Commons CC BY 3.0 It is developed in the framework of the Dem@Care project (http://www.demcare.eu/) and supported by the Information Technologies Institute (http://www.iti.gr) of the Centre for Research and Technology Hellas.
license: http://creativecommons.org/licenses/by/3.0/
version IRI: http://www.demcare.eu/ontologies/demlab.owl/1.0
imports: time
imports: http://xmlns.com/foaf/0.1/
type: NamedIndividual

Abstract
type: AnnotationProperty
issued: 2000-07-11
Date Modified: 2008-01-14
comment: A summary of the resource.
Has Version: abstract-003
sub property of: description
sub property of: Description

Access Rights
type: AnnotationProperty
issued: 2003-02-15
Date Modified: 2008-01-14
description: Access Rights may include information regarding access or restrictions based on privacy, security, or other policies.
comment: Information about who can access the resource or an indication of its security status.
Has Version: accessRights-002
sub property of: rights
type: ObjectProperty
range: Rights Statement
sub property of: Rights

Accrual Method
type: AnnotationProperty
issued: 2005-06-13
Date Modified: 2010-10-11
comment: The method by which items are added to a collection.
Has Version: accrualMethod-003
domain: Collection
type: ObjectProperty
range: Method of Accrual

Accrual Periodicity
type: AnnotationProperty
issued: 2005-06-13
Date Modified: 2010-10-11
comment: The frequency with which items are added to a collection.
Has Version: accrualPeriodicity-003
domain: Collection
type: ObjectProperty
range: Frequency

Accrual Policy
type: AnnotationProperty
issued: 2005-06-13
Date Modified: 2010-10-11
comment: The policy governing the addition of items to a collection.
Has Version: accrualPolicy-003
domain: Collection
type: ObjectProperty
range: Policy

Alternative Title
type: AnnotationProperty
issued: 2000-07-11
Date Modified: 2010-10-11
comment: An alternative name for the resource.
description: The distinction between titles and alternative titles is application-specific.
Has Version: alternative-003
sub property of: title
type: DatatypeProperty
sub property of: Title
range: Literal

Date Available
type: AnnotationProperty
issued: 2000-07-11
Date Modified: 2008-01-14
comment: Date (often a range) that the resource became or will become available.
Has Version: available-003
sub property of: date
type: DatatypeProperty
sub property of: Date
range: Literal

Bibliographic Citation
type: AnnotationProperty
issued: 2003-02-15
Date Modified: 2008-01-14
comment: A bibliographic reference for the resource.
description: Recommended practice is to include sufficient bibliographic detail to identify the resource as unambiguously as possible.
Has Version: bibliographicCitation-002
sub property of: identifier
domain: Bibliographic Resource
type: DatatypeProperty
sub property of: Identifier
range: Literal

Conforms To
type: AnnotationProperty
issued: 2001-05-21
Date Modified: 2008-01-14
comment: An established standard to which the described resource conforms.
Has Version: conformsTo-003
sub property of: relation
sub property of: Relation
type: ObjectProperty
range: Standard

Contributor
type: AnnotationProperty
issued: 2008-01-14
Date Modified: 2010-10-11
comment: An entity responsible for making contributions to the resource.
description: Examples of a Contributor include a person, an organization, or a service.
Has Version: contributorT-001
sub property of: contributor
type: ObjectProperty
range: Agent

Coverage
type: AnnotationProperty
issued: 2008-01-14
Date Modified: 2008-01-14
description: Spatial topic and spatial applicability may be a named place or a location specified by its geographic coordinates. Temporal topic may be a named period, date, or date range. A jurisdiction may be a named administrative entity or a geographic place to which the resource applies. Recommended best practice is to use a controlled vocabulary such as the Thesaurus of Geographic Names [TGN]. Where appropriate, named places or time periods can be used in preference to numeric identifiers such as sets of coordinates or date ranges.
comment: The spatial or temporal topic of the resource, the spatial applicability of the resource, or the jurisdiction under which the resource is relevant.
Has Version: coverageT-001
sub property of: coverage
type: ObjectProperty
range: Location, Period, or Jurisdiction

Date Created
type: AnnotationProperty
issued: 2000-07-11
Date Modified: 2008-01-14
comment: Date of creation of the resource.
Has Version: created-003
sub property of: date
type: DatatypeProperty
sub property of: Date
range: Literal

Creator
type: AnnotationProperty
issued: 2008-01-14
Date Modified: 2010-10-11
comment: An entity primarily responsible for making the resource.
description: Examples of a Creator include a person, an organization, or a service.
Has Version: creatorT-002
sub property of: creator
type: ObjectProperty
range: Agent
sub property of: Contributor

Date
type: AnnotationProperty
issued: 2008-01-14
Date Modified: 2008-01-14
comment: A point or period of time associated with an event in the lifecycle of the resource.
description: Date may be used to express temporal information at any level of granularity. Recommended best practice is to use an encoding scheme, such as the W3CDTF profile of ISO 8601 [W3CDTF].
Has Version: dateT-001
sub property of: date
type: DatatypeProperty
range: Literal

Date Accepted
type: AnnotationProperty
issued: 2002-07-13
Date Modified: 2008-01-14
comment: Date of acceptance of the resource.
description: Examples of resources to which a Date Accepted may be relevant are a thesis (accepted by a university department) or an article (accepted by a journal).
Has Version: dateAccepted-002
sub property of: date
type: DatatypeProperty
sub property of: Date
range: Literal

Date Copyrighted
type: AnnotationProperty
issued: 2002-07-13
Date Modified: 2008-01-14
comment: Date of copyright.
Has Version: dateCopyrighted-002
sub property of: date
type: DatatypeProperty
sub property of: Date
range: Literal

Date Submitted
type: AnnotationProperty
issued: 2002-07-13
Date Modified: 2008-01-14
comment: Date of submission of the resource.
description: Examples of resources to which a Date Submitted may be relevant are a thesis (submitted to a university department) or an article (submitted to a journal).
Has Version: dateSubmitted-002
sub property of: date
type: DatatypeProperty
sub property of: Date
range: Literal

Description
type: AnnotationProperty
issued: 2008-01-14
Date Modified: 2008-01-14
comment: An account of the resource.
description: Description may include but is not limited to: an abstract, a table of contents, a graphical representation, or a free-text account of the resource.
Has Version: descriptionT-001
sub property of: description

Audience Education Level
type: AnnotationProperty
issued: 2002-07-13
Date Modified: 2008-01-14
comment: A class of entity, defined in terms of progression through an educational or training context, for which the described resource is intended.
Has Version: educationLevel-002
type: ObjectProperty
range: Agent Class
sub property of: Audience

Extent
type: AnnotationProperty
issued: 2000-07-11
Date Modified: 2008-01-14
comment: The size or duration of the resource.
Has Version: extent-003
sub property of: format
type: ObjectProperty
range: Size or Duration
sub property of: Format

Format
type: AnnotationProperty
issued: 2008-01-14
Date Modified: 2008-01-14
description: Examples of dimensions include size and duration. Recommended best practice is to use a controlled vocabulary such as the list of Internet Media Types [MIME].
comment: The file format, physical medium, or dimensions of the resource.
Has Version: formatT-001
sub property of: format
type: ObjectProperty
range: Media Type or Extent

Has Format
type: AnnotationProperty
issued: 2000-07-11
Date Modified: 2008-01-14
comment: A related resource that is substantially the same as the pre-existing described resource, but in another format.
note: This term is intended to be used with non-literal values as defined in the DCMI Abstract Model (http://dublincore.org/documents/abstract-model/). As of December 2007, the DCMI Usage Board is seeking a way to express this intention with a formal range declaration.
Has Version: hasFormat-003
sub property of: relation
sub property of: Relation

Has Part
type: AnnotationProperty
issued: 2000-07-11
Date Modified: 2008-01-14
comment: A related resource that is included either physically or logically in the described resource.
note: This term is intended to be used with non-literal values as defined in the DCMI Abstract Model (http://dublincore.org/documents/abstract-model/). As of December 2007, the DCMI Usage Board is seeking a way to express this intention with a formal range declaration.
Has Version: hasPart-003
sub property of: relation
sub property of: Relation

Has Version
type: AnnotationProperty
issued: 2000-07-11
Date Modified: 2008-01-14
comment: A related resource that is a version, edition, or adaptation of the described resource.
note: This term is intended to be used with non-literal values as defined in the DCMI Abstract Model (http://dublincore.org/documents/abstract-model/). As of December 2007, the DCMI Usage Board is seeking a way to express this intention with a formal range declaration.
Has Version: hasVersion-003
sub property of: relation
sub property of: Relation

Identifier
type: AnnotationProperty
issued: 2008-01-14
Date Modified: 2008-01-14
comment: An unambiguous reference to the resource within a given context.
description: Recommended best practice is to identify the resource by means of a string conforming to a formal identification system.
Has Version: identifierT-001
sub property of: identifier
type: DatatypeProperty
range: Literal

Is Format Of
type: AnnotationProperty
issued: 2000-07-11
Date Modified: 2008-01-14
comment: A related resource that is substantially the same as the described resource, but in another format.
note: This term is intended to be used with non-literal values as defined in the DCMI Abstract Model (http://dublincore.org/documents/abstract-model/). As of December 2007, the DCMI Usage Board is seeking a way to express this intention with a formal range declaration.
Has Version: isFormatOf-003
sub property of: relation
sub property of: Relation

Is Part Of
type: AnnotationProperty
issued: 2000-07-11
Date Modified: 2008-01-14
comment: A related resource in which the described resource is physically or logically included.
note: This term is intended to be used with non-literal values as defined in the DCMI Abstract Model (http://dublincore.org/documents/abstract-model/). As of December 2007, the DCMI Usage Board is seeking a way to express this intention with a formal range declaration.
Has Version: isPartOf-003
sub property of: relation
sub property of: Relation

Is Referenced By
type: AnnotationProperty
issued: 2000-07-11
Date Modified: 2008-01-14
comment: A related resource that references, cites, or otherwise points to the described resource.
note: This term is intended to be used with non-literal values as defined in the DCMI Abstract Model (http://dublincore.org/documents/abstract-model/). As of December 2007, the DCMI Usage Board is seeking a way to express this intention with a formal range declaration.
Has Version: isReferencedBy-003
sub property of: relation
sub property of: Relation

Is Replaced By
type: AnnotationProperty
issued: 2000-07-11
Date Modified: 2008-01-14
comment: A related resource that supplants, displaces, or supersedes the described resource.
note: This term is intended to be used with non-literal values as defined in the DCMI Abstract Model (http://dublincore.org/documents/abstract-model/). As of December 2007, the DCMI Usage Board is seeking a way to express this intention with a formal range declaration.
Has Version: isReplacedBy-003
sub property of: relation
sub property of: Relation

Is Required By
type: AnnotationProperty
issued: 2000-07-11
Date Modified: 2008-01-14
comment: A related resource that requires the described resource to support its function, delivery, or coherence.
note: This term is intended to be used with non-literal values as defined in the DCMI Abstract Model (http://dublincore.org/documents/abstract-model/). As of December 2007, the DCMI Usage Board is seeking a way to express this intention with a formal range declaration.
Has Version: isRequiredBy-003
sub property of: relation
sub property of: Relation

Is Version Of
type: AnnotationProperty
issued: 2000-07-11
Date Modified: 2008-01-14
comment: A related resource of which the described resource is a version, edition, or adaptation.
description: Changes in version imply substantive changes in content rather than differences in format.
note: This term is intended to be used with non-literal values as defined in the DCMI Abstract Model (http://dublincore.org/documents/abstract-model/). As of December 2007, the DCMI Usage Board is seeking a way to express this intention with a formal range declaration.
Has Version: isVersionOf-003
sub property of: relation
sub property of: Relation

Date Issued
type: AnnotationProperty
issued: 2000-07-11
Date Modified: 2008-01-14
comment: Date of formal issuance (e.g., publication) of the resource.
Has Version: issued-003
sub property of: date
type: DatatypeProperty
sub property of: Date
range: Literal

Language
type: AnnotationProperty
Date Modified: 2008-01-14
issued: 2008-01-14
comment: A language of the resource.
description: Recommended best practice is to use a controlled vocabulary such as RFC 4646 [RFC4646].
Has Version: languageT-001
sub property of: language
type: ObjectProperty
range: Linguistic System

License
type: AnnotationProperty
issued: 2004-06-14
Date Modified: 2008-01-14
comment: A legal document giving official permission to do something with the resource.
Has Version: license-002
sub property of: rights
type: ObjectProperty
range: License Document
sub property of: Rights

Mediator
type: AnnotationProperty
issued: 2001-05-21
Date Modified: 2008-01-14
comment: An entity that mediates access to the resource and for whom the resource is intended or useful.
description: In an educational context, a mediator might be a parent, teacher, teaching assistant, or care-giver.
Has Version: mediator-003
type: ObjectProperty
range: Agent Class
sub property of: Audience

Medium
type: AnnotationProperty
issued: 2000-07-11
Date Modified: 2008-01-14
comment: The material or physical carrier of the resource.
Has Version: medium-003
sub property of: format
type: ObjectProperty
range: Physical Medium
domain: Physical Resource
sub property of: Format

Date Modified
type: AnnotationProperty
issued: 2000-07-11
Date Modified: 2008-01-14
comment: Date on which the resource was changed.
Has Version: modified-003
sub property of: date
type: DatatypeProperty
sub property of: Date
range: Literal

Publisher
type: AnnotationProperty
issued: 2008-01-14
Date Modified: 2010-10-11
comment: An entity responsible for making the resource available.
description: Examples of a Publisher include a person, an organization, or a service.
Has Version: publisherT-001
sub property of: publisher
type: ObjectProperty
range: Agent

References
type: AnnotationProperty
issued: 2000-07-11
Date Modified: 2008-01-14
comment: A related resource that is referenced, cited, or otherwise pointed to by the described resource.
note: This term is intended to be used with non-literal values as defined in the DCMI Abstract Model (http://dublincore.org/documents/abstract-model/). As of December 2007, the DCMI Usage Board is seeking a way to express this intention with a formal range declaration.
Has Version: references-003
sub property of: relation
sub property of: Relation

Relation
type: AnnotationProperty
Date Modified: 2008-01-14
issued: 2008-01-14
comment: A related resource.
description: Recommended best practice is to identify the related resource by means of a string conforming to a formal identification system.
note: This term is intended to be used with non-literal values as defined in the DCMI Abstract Model (http://dublincore.org/documents/abstract-model/). As of December 2007, the DCMI Usage Board is seeking a way to express this intention with a formal range declaration.
Has Version: relationT-001
sub property of: relation

Replaces
type: AnnotationProperty
issued: 2000-07-11
Date Modified: 2008-01-14
comment: A related resource that is supplanted, displaced, or superseded by the described resource.
note: This term is intended to be used with non-literal values as defined in the DCMI Abstract Model (http://dublincore.org/documents/abstract-model/). As of December 2007, the DCMI Usage Board is seeking a way to express this intention with a formal range declaration.
Has Version: replaces-003
sub property of: relation
sub property of: Relation

Requires
type: AnnotationProperty
issued: 2000-07-11
Date Modified: 2008-01-14
comment: A related resource that is required by the described resource to support its function, delivery, or coherence.
note: This term is intended to be used with non-literal values as defined in the DCMI Abstract Model (http://dublincore.org/documents/abstract-model/). As of December 2007, the DCMI Usage Board is seeking a way to express this intention with a formal range declaration.
Has Version: requires-003
sub property of: relation
sub property of: Relation

Rights
type: AnnotationProperty
issued: 2008-01-14
Date Modified: 2008-01-14
comment: Information about rights held in and over the resource.
description: Typically, rights information includes a statement about various property rights associated with the resource, including intellectual property rights.
Has Version: rightsT-001
sub property of: rights
type: ObjectProperty
range: Rights Statement

Source
type: AnnotationProperty
issued: 2008-01-14
Date Modified: 2008-01-14
comment: A related resource from which the described resource is derived.
description: The described resource may be derived from the related resource in whole or in part. Recommended best practice is to identify the related resource by means of a string conforming to a formal identification system.
note: This term is intended to be used with non-literal values as defined in the DCMI Abstract Model (http://dublincore.org/documents/abstract-model/). As of December 2007, the DCMI Usage Board is seeking a way to express this intention with a formal range declaration.
Has Version: sourceT-001
sub property of: source
sub property of: Relation

Spatial Coverage
type: AnnotationProperty
issued: 2000-07-11
Date Modified: 2008-01-14
comment: Spatial characteristics of the resource.
Has Version: spatial-003
sub property of: coverage
type: ObjectProperty
range: Location
sub property of: Coverage

Subject
type: AnnotationProperty
issued: 2008-01-14
Date Modified: 2012-06-14
comment: The topic of the resource.
note: This term is intended to be used with non-literal values as defined in the DCMI Abstract Model (http://dublincore.org/documents/abstract-model/). As of December 2007, the DCMI Usage Board is seeking a way to express this intention with a formal range declaration.
description: Typically, the subject will be represented using keywords, key phrases, or classification codes. Recommended best practice is to use a controlled vocabulary.
Has Version: subjectT-002
sub property of: subject

Table Of Contents
type: AnnotationProperty
issued: 2000-07-11
Date Modified: 2008-01-14
comment: A list of subunits of the resource.
Has Version: tableOfContents-003
sub property of: description
sub property of: Description

Temporal Coverage
type: AnnotationProperty
issued: 2000-07-11
Date Modified: 2008-01-14
comment: Temporal characteristics of the resource.
Has Version: temporal-003
sub property of: coverage
type: ObjectProperty
range: Period of Time
sub property of: Coverage

Title
type: AnnotationProperty
issued: 2008-01-14
Date Modified: 2010-10-11
comment: A name given to the resource.
Has Version: titleT-002
sub property of: title
type: DatatypeProperty
range: Literal

Type
type: AnnotationProperty
Date Modified: 2008-01-14
issued: 2008-01-14
description: Recommended best practice is to use a controlled vocabulary such as the DCMI Type Vocabulary [DCMITYPE]. To describe the file format, physical medium, or dimensions of the resource, use the Format element.
comment: The nature or genre of the resource.
Has Version: typeT-001
sub property of: type
type: ObjectProperty
range: Class

Date Valid
type: AnnotationProperty
issued: 2000-07-11
Date Modified: 2008-01-14
comment: Date (often a range) of validity of a resource.
Has Version: valid-003
sub property of: date
type: DatatypeProperty
sub property of: Date
range: Literal

DCMI Box
type: Datatype
issued: 2000-07-11
Date Modified: 2008-01-14
comment: The set of regions in space defined by their geographic coordinates according to the DCMI Box Encoding Scheme.
Has Version: Box-003

ISO 3166
type: Datatype
issued: 2000-07-11
Date Modified: 2008-01-14
comment: The set of codes listed in ISO 3166-1 for the representation of names of countries.
Has Version: ISO3166-004

ISO 639-2
type: Datatype
issued: 2000-07-11
Date Modified: 2008-01-14
comment: The three-letter alphabetic codes listed in ISO639-2 for the representation of names of languages.
Has Version: ISO639-2-003

ISO 639-3
type: Datatype
issued: 2008-01-14
comment: The set of three-letter codes listed in ISO 639-3 for the representation of names of languages.
Has Version: ISO639-3-001

DCMI Period
type: Datatype
issued: 2000-07-11
Date Modified: 2008-01-14
comment: The set of time intervals defined by their limits according to the DCMI Period Encoding Scheme.
Has Version: Period-003

DCMI Point
type: Datatype
issued: 2000-07-11
Date Modified: 2008-01-14
comment: The set of points in space defined by their geographic coordinates according to the DCMI Point Encoding Scheme.
Has Version: Point-003

RFC 1766
type: Datatype
issued: 2000-07-11
Date Modified: 2008-01-14
comment: The set of tags, constructed according to RFC 1766, for the identification of languages.
Has Version: RFC1766-003

RFC 3066
type: Datatype
issued: 2002-07-13
Date Modified: 2008-01-14
description: RFC 3066 has been obsoleted by RFC 4646.
comment: The set of tags constructed according to RFC 3066 for the identification of languages.
Has Version: RFC3066-002

RFC 4646
type: Datatype
issued: 2008-01-14
description: RFC 4646 obsoletes RFC 3066.
comment: The set of tags constructed according to RFC 4646 for the identification of languages.
Has Version: RFC4646-001

RFC 5646
type: Datatype
issued: 2010-10-11
description: RFC 5646 obsoletes RFC 4646.
comment: The set of tags constructed according to RFC 5646 for the identification of languages.
Has Version: RFC5646-001

URI
type: Datatype
issued: 2000-07-11
Date Modified: 2008-01-14
comment: The set of identifiers constructed according to the generic syntax for Uniform Resource Identifiers as specified by the Internet Engineering Task Force.
Has Version: URI-003

W3C-DTF
type: Datatype
issued: 2000-07-11
Date Modified: 2008-01-14
comment: The set of dates and times constructed according to the W3C Date and Time Formats Specification.
Has Version: W3CDTF-003

Audience
type: ObjectProperty
issued: 2001-05-21
Date Modified: 2008-01-14
comment: A class of entity for whom the resource is intended or useful.
Has Version: audience-003
range: Agent Class

Instructional Method
type: ObjectProperty
issued: 2005-06-13
Date Modified: 2008-01-14
comment: A process, used to engender knowledge, attitudes and skills, that the described resource is designed to support.
description: Instructional Method will typically include ways of presenting instructional materials or conducting instructional activities, patterns of learner-to-learner and learner-to-instructor interactions, and mechanisms by which group and individual levels of learning are measured. Instructional methods include all aspects of the instruction and learning processes from planning and implementation through evaluation and feedback.
Has Version: instructionalMethod-002
range: Method of Instruction

Provenance
type: ObjectProperty
issued: 2004-09-20
Date Modified: 2008-01-14
comment: A statement of any changes in ownership and custody of the resource since its creation that are significant for its authenticity, integrity, and interpretation.
description: The statement may include a description of any changes successive custodians made to the resource.
Has Version: provenance-002
range: Provenance Statement

Rights Holder
type: ObjectProperty
issued: 2004-06-14
Date Modified: 2008-01-14
comment: A person or organization owning or managing rights over the resource.
Has Version: rightsHolder-002
range: Agent

activityStatus
type: ObjectProperty
comment: The status of a semi-directed activity
range: ActivityStatusType
domain: CognitiveAbilitiesData

areasOfInterestExplored
type: ObjectProperty
comment: Zones of no interest
domain: OrganisationEfficiencyData
range: Zone

areasOfNoInterestExplored
type: ObjectProperty
comment: Zones of interest
domain: OrganisationEfficiencyData
range: Zone

containsAssessment
type: ObjectProperty
comment: A ClinicalRecord contains a ClinicalAssessment
range: ClinicalAssessment
domain: ClinicalRecord

handTrajectory
type: ObjectProperty
comment: Associates an instance of FunctionalAbilitiesData with a hand trajectory type
domain: FunctionalAbilitiesData
range: HandTrajectoryType

hasClinicalDiagnosis
type: ObjectProperty
comment: The value of the DiagnosisAssessment
domain: DiagnosisAssessment
range: DiagnosisType
sub property of: topObjectProperty

hasClinicalRecord
type: ObjectProperty
comment: Each participant is associated with a clinical record
range: ClinicalRecord
domain: Participant

hasParticipant
type: ObjectProperty
comment: The participant of the protocol
range: Participant
domain: Protocol

hasProtocolStep
type: ObjectProperty
comment: Each Protocol consists of one or more ProtocolSteps
domain: Protocol
range: ProtocolStep

involvesTask
type: ObjectProperty
comment: Each ProtocolStep involves one or more Tasks
domain: ProtocolStep
range: Task

measuredData
type: ObjectProperty
see also: Associates a Task with a MeasuredData instance
range: MeasuredData
domain: Task

apathyInventory
type: DatatypeProperty
comment: Apathy Inventory (AI) and diagnostic criteria for apathy
domain: NeuropsychiatricAndMoodAssessment

articulation
type: DatatypeProperty
comment: Measures the articulation control of the participant
domain: VoiceData

compliantInstructionsOrder
type: DatatypeProperty
comment: Whether the participant followed the activity order suggested by the instructions sheet
domain: CognitiveAbilitiesData

distanceWalked
type: DatatypeProperty
comment: Total distance walked
domain: OrganisationEfficiencyData

dsm ivDepressionCriteria
type: DatatypeProperty
comment: DSM-IV Criteria for depression
domain: NeuropsychiatricAndMoodAssessment

dynamicBalance
type: DatatypeProperty
comment: Dynamical balance during the walking (e.g., people trajectory study)
domain: GaitData

fabScore
type: DatatypeProperty
comment: Frontal Assessment Battery score
domain: CognitiveAbilitiesAssessment

freeAndCuedRemindingAssessment
type: DatatypeProperty
comment: The Free and Cued Selective Reminding Test
domain: CognitiveAbilitiesAssessment

hasMMSEScore
type: DatatypeProperty
comment: Mini-Mental State Exam score
domain: CognitiveAbilitiesAssessment

hasUPDRSScore
type: DatatypeProperty
comment: Part III of the Unified Parkinson’s Disease Rating Scale
domain: MotricityAbilitiesAssessment

iadl e
type: DatatypeProperty
comment: Allows the quantification of autonomy
domain: AutonomyAssessment

latency
type: DatatypeProperty
comment: Time of latency between the end of instructions (stimulation) and the beginning of the task
domain: LatencyData

npi
type: DatatypeProperty
comment: Neuropsychiatric Inventory
domain: NeuropsychiatricAndMoodAssessment

pauseRate
type: DatatypeProperty
comment: Pause rate during sentence repetition and mono/dual tasks
domain: VoiceData

repetitions
type: DatatypeProperty
comment: Number of repetitions during semi-directed activities
domain: CognitiveAbilitiesData

shortCognitiveBatteryAssessment
type: DatatypeProperty
comment: Short Cognitive Battery
domain: CognitiveAbilitiesAssessment

speechFluency
type: DatatypeProperty
comment: Speech fluency during sentence repetition and picture description tasks
domain: VoiceData

speechRate
type: DatatypeProperty
comment: Speech fluency during sentence repetition and picture description tasks
domain: VoiceData

stepLength
type: DatatypeProperty
comment: Step length
domain: GaitData

stoppingDisplacement
type: DatatypeProperty
comment: Stopping displacement during walking
domain: GaitData

stressLevel
type: DatatypeProperty
see also: Stress level
domain: StressData

trailMakingTest
type: DatatypeProperty
comment: Trail making test A and B
domain: CognitiveAbilitiesAssessment

verbalReactionSpontaneity
type: DatatypeProperty
comment: Time between the end of assessor’s speech and the beginning of participant’s speech (Discussion Task)
domain: DiscussionInvolvementData

verbalReactionTime
type: DatatypeProperty
comment: Time interval between the end of assessor’s speech and the beginning of participant’s speech (Sentence Repetition Task)
domain: VoiceData

vowelDuration
type: DatatypeProperty
see also: Vowel duration
comment: VoiceData
domain: VoiceData
sub property of: topDataProperty

walkingSpeed
type: DatatypeProperty
comment: Walking speed
domain: GaitData

walkingSpeedInstantaneous
type: DatatypeProperty
comment: Walking speed instantaneous (mono task walking activity/dual task)
domain: GaitData

Agent
type: Class
issued: 2008-01-14
comment: A resource that acts or has the power to act.
description: Examples of Agent include person, organization, and software agent.
Has Version: Agent-001
type: NamedIndividual
type: Agent Class

Agent Class
type: Class
subclass of: Class
issued: 2008-01-14
Date Modified: 2012-06-14
comment: A group of agents.
description: Examples of Agent Class include groups seen as classes, such as students, women, charities, lecturers.
Has Version: AgentClass-003

Bibliographic Resource
type: Class
issued: 2008-01-14
comment: A book, article, or other documentary resource.
Has Version: BibliographicResource-001

File Format
type: Class
subclass of: Media Type
issued: 2008-01-14
comment: A digital resource format.
description: Examples include the formats defined by the list of Internet Media Types.
Has Version: FileFormat-001

Frequency
type: Class
issued: 2008-01-14
comment: A rate at which something recurs.
Has Version: Frequency-001

Jurisdiction
type: Class
subclass of: Location, Period, or Jurisdiction
issued: 2008-01-14
comment: The extent or range of judicial, law enforcement, or other authority.
Has Version: Jurisdiction-001

License Document
type: Class
subclass of: Rights Statement
issued: 2008-01-14
comment: A legal document giving official permission to do something with a Resource.
Has Version: LicenseDocument-001

Linguistic System
type: Class
issued: 2008-01-14
comment: A system of signs, symbols, sounds, gestures, or rules used in communication.
description: Examples include written, spoken, sign, and computer languages.
Has Version: LinguisticSystem-001

Location
type: Class
subclass of: Location, Period, or Jurisdiction
issued: 2008-01-14
comment: A spatial region or named place.
Has Version: Location-001

Location, Period, or Jurisdiction
type: Class
issued: 2008-01-14
comment: A location, period of time, or jurisdiction.
Has Version: LocationPeriodOrJurisdiction-001

Media Type
type: Class
subclass of: Media Type or Extent
issued: 2008-01-14
comment: A file format or physical medium.
Has Version: MediaType-001

Media Type or Extent
type: Class
issued: 2008-01-14
comment: A media type or extent.
Has Version: MediaTypeOrExtent-001

Method of Accrual
type: Class
issued: 2008-01-14
comment: A method by which resources are added to a collection.
Has Version: MethodOfAccrual-001

Method of Instruction
type: Class
issued: 2008-01-14
comment: A process that is used to engender knowledge, attitudes, and skills.
Has Version: MethodOfInstruction-001

Period of Time
type: Class
subclass of: Location, Period, or Jurisdiction
issued: 2008-01-14
comment: An interval of time that is named or defined by its start and end dates.
Has Version: PeriodOfTime-001

Physical Medium
type: Class
subclass of: Media Type
issued: 2008-01-14
comment: A physical material or carrier.
description: Examples include paper, canvas, or DVD.
Has Version: PhysicalMedium-001

Physical Resource
type: Class
issued: 2008-01-14
comment: A material thing.
Has Version: PhysicalResource-001

Policy
type: Class
issued: 2008-01-14
comment: A plan or course of action by an authority, intended to influence and determine decisions, actions, and other matters.
Has Version: Policy-001

Provenance Statement
type: Class
issued: 2008-01-14
comment: A statement of any changes in ownership and custody of a resource since its creation that are significant for its authenticity, integrity, and interpretation.
Has Version: ProvenanceStatement-001

Rights Statement
type: Class
issued: 2008-01-14
comment: A statement about the intellectual property rights (IPR) held in or over a Resource, a legal document giving official permission to do something with a resource, or a statement about access rights.
Has Version: RightsStatement-001

Size or Duration
type: Class
subclass of: Media Type or Extent
issued: 2008-01-14
comment: A dimension or extent, or a time taken to play or execute.
description: Examples include a number of pages, a specification of length, width, and breadth, or a period in hours, minutes, and seconds.
Has Version: SizeOrDuration-001

Standard
type: Class
issued: 2008-01-14
comment: A basis for comparison; a reference point against which other things can be evaluated.
Has Version: Standard-001

AnswerPhoneTask
type: Class
subclass of: SemiDirectedTask
comment: - The phone is scheduled to ring 10 minutes after the entering of the participant inside the room. - During this task, the clinician explains that there is a mistake on the phone bill: the amount was wrong. Consequently, it is expected that the participant corrects his/her phone check and corrects the account balance (tasks normally established before the phone call according to the constraint).

ArticulationControlTask
type: Class
subclass of: DirectedTask
subclass of: Restriction
  on property: measuredData
  all values from: Class
    union of: LatencyData
    union of: StressData
    union of: VoiceData
comment: The participant is asked to pronounce repeatedly a predefined diadochokinetic “Pataka” token as rapid as possible stopping this action upon a sign by the clinician. The clinician will stop the action in 10 sec. This task is used for assessing: - Latency: time of latency between the end of instructions (stimulation) and the beginning of the task - Stress level - Voice: e.g. speech rate, pause rate etc.
subclass of: Restriction
  on property: measuredData
  all values from: Class
    union of: LatencyData
    union of: StressData
    union of: VoiceData

AutonomyAssessment
type: Class
subclass of: ClinicalAssessment
subclass of: Restriction
  on property: iadl e
  cardinality: 1
comment: Autonomy is assessed based on the performance of the participant during the SemiDirectedActivitiesStep. The property iadl_e (Instrumental Activities of Daily Living for Elderly) can be used to quantify autonomy
subclass of: Restriction
  on property: iadl e
  cardinality: 1

CallPsychologistTask
type: Class
subclass of: SemiDirectedTask
comment: - The participant has to call the psychologist. Two phone numbers are proposed to the participant (1 visit card of the hair dressing,+ 1 visit card of the CHUN with phone number of a psychologist). - According the constraint, the participant has to call the psychologist within the 5 first minutes.

ClinicalAssessment
type: Class
comment: Root concept for the five types of clinical assessment

ClinicalRecord
type: Class
subclass of: Restriction
  on property: containsAssessment
  all values from: Class
    union of: AutonomyAssessment
    union of: CognitiveAbilitiesAssessment
    union of: DiagnosisAssessment
    union of: MotricityAbilitiesAssessment
    union of: NeuropsychiatricAndMoodAssessment
subclass of: Restriction
  on property: isClinicalRecordOf
  on class: Participant
  qualified cardinality: 1
comment: A ClinicalRecord contains information about the five types of clinical assessment
subclass of: Restriction
  on property: containsAssessment
  all values from: Class
    union of: AutonomyAssessment
    union of: CognitiveAbilitiesAssessment
    union of: DiagnosisAssessment
    union of: MotricityAbilitiesAssessment
    union of: NeuropsychiatricAndMoodAssessment
subclass of: Restriction
  on property: isClinicalRecordOf
  on class: Participant
  qualified cardinality: 1

CognitiveAbilitiesAssessment
type: Class
subclass of: ClinicalAssessment
subclass of: Restriction
  on property: shortCognitiveBatteryAssessment
  cardinality: 1
subclass of: Restriction
  on property: fabScore
  cardinality: 1
subclass of: Restriction
  on property: hasMMSEScore
  cardinality: 1
subclass of: Restriction
  on property: freeAndCuedRemindingAssessment
  cardinality: 1
subclass of: Restriction
  on property: trailMakingTest
  cardinality: 1
comment: The Cognitive abilities assessment is performed in terms of five scores: - Mini-Mental State Exam (MMSE). - Frontal Assessment Battery (FAB). - Trail making test A and B. - Short Cognitive Battery. - The Free and Cued Selective Reminding Test
subclass of: Restriction
  on property: shortCognitiveBatteryAssessment
  cardinality: 1
subclass of: Restriction
  on property: fabScore
  cardinality: 1
subclass of: Restriction
  on property: hasMMSEScore
  cardinality: 1
subclass of: Restriction
  on property: freeAndCuedRemindingAssessment
  cardinality: 1
subclass of: Restriction
  on property: trailMakingTest
  cardinality: 1

CognitiveAbilitiesData
type: Class
subclass of: MeasuredData
subclass of: Restriction
  on property: compliantInstructionsOrder
  qualified cardinality: 1
  on data range: boolean
subclass of: Restriction
  on property: repetitions
  cardinality: 1
subclass of: Restriction
  on property: activityStatus
  on class: ActivityStatusType
  qualified cardinality: 1
comment: Explore functional abilities for the completion of specific activities
subclass of: Restriction
  on property: compliantInstructionsOrder
  qualified cardinality: 1
  on data range: boolean
subclass of: Restriction
  on property: repetitions
  cardinality: 1
subclass of: Restriction
  on property: activityStatus
  on class: ActivityStatusType
  qualified cardinality: 1

CountingBackwardsTask
type: Class
subclass of: DirectedTask
subclass of: Restriction
  on property: measuredData
  all values from: Class
    union of: LatencyData
    union of: StressData
    union of: VoiceData
comment: (MonoTask) The participant is standing and the clinician asks him/her to count aloud backwards: - From 305 to 285 (to change tens and hundreds) one by one; or - From 20 to 0 if they make counting mistakes after 2 attempts of the previous backwards counting This task is used for assessing: - Latency: time of latency between the end of instructions (stimulation) and the beginning of the task - Stress level - Voice: e.g. speech fluency and articulation
subclass of: Restriction
  on property: measuredData
  all values from: Class
    union of: LatencyData
    union of: StressData
    union of: VoiceData

DiagnosisAssessment
type: Class
subclass of: ClinicalAssessment
subclass of: Restriction
  on property: hasClinicalDiagnosis
  on class: DiagnosisType
  qualified cardinality: 1
comment: Diagnosis established the day of the recording session. Participant is assigned to one of this 3 categories: Healthy Control participants, Alzheimer’s disease at pre-dementia stage, Alzheimer ’s disease at dementia stage
subclass of: Restriction
  on property: hasClinicalDiagnosis
  on class: DiagnosisType
  qualified cardinality: 1

DirectedActivitiesStep
type: Class
subclass of: ProtocolStep
subclass of: Restriction
  on property: involvesTask
  all values from: Class
    union of: ArticulationControlTask
    union of: CountingBackwardsTask
    union of: SentenceRepeatingTask
    union of: Task
    union of: WalkingCountingBackwardsTask
    union of: WalkingTask
comment: This ProtocolStep is conducted by a clinician, who details step by step the different activities to do by the participant. This step involves five Tasks. The tasks Walking, CountingBackwards and WalkingAndCountingBackwards are used for characterizing participants’ gait in mono and dual tasks, and the impact of cognitive activity on gait (e.g., walking speed, step length, stops during the walking exercise done in dual task). The tasks SentenceRepeating and ArticulationControl are vocally-directed tasks: one task consists of repeating a sentence after the clinician (this task is repeated with three sentences), and the other is an articulation control exercise done to evaluate the neuromuscular mechanism of speech production.
subclass of: Restriction
  on property: involvesTask
  all values from: Class
    union of: ArticulationControlTask
    union of: CountingBackwardsTask
    union of: SentenceRepeatingTask
    union of: Task
    union of: WalkingCountingBackwardsTask
    union of: WalkingTask

DirectedExpressionTask
type: Class
subclass of: DirectedDiscussionTask
comment: The clinician asks the same questions than the ones asked on the read article, e.g. What is the topic of the article?

DirectedTask
type: Class
subclass of: Task
comment: Root concept for grouping the Tasks relevant to the DirectedActivitiesStep

DiscussionInvolvementData
type: Class
subclass of: MeasuredData
subclass of: Restriction
  on property: verbalReactionSpontaneity
  cardinality: 1
comment: - Assessment of the impact of cognitive load imposed by the picture description task on speech fluency - Memory and self-appraisal assessment - Verbal fluency and mood (Apathy) assessment
subclass of: Restriction
  on property: verbalReactionSpontaneity
  cardinality: 1

DiscussionTask
type: Class
subclass of: Task
subclass of: Restriction
  on property: measuredData
  all values from: Class
    union of: StressData
    union of: VoiceData
comment: Root concept for grouping the Tasks relevant to the DiscussionWithClinicianStep The relevant tasks are used for assessing: - Stress level - Voice: e.g. speech rate, pause rate etc.
subclass of: Restriction
  on property: measuredData
  all values from: Class
    union of: StressData
    union of: VoiceData

DiscussionWithClinicianStep
type: Class
subclass of: ProtocolStep
subclass of: Restriction
  on property: involvesTask
  all values from: Class
    union of: DirectedExpressionTask
    union of: PictureDescriptionTask
    union of: PictureDiscussionTask
comment: This ProtocolStep involves two Tasks. The first task (DirectedExpressionTask) is a directed discussion during which the clinician assesses the episodic memory of participant through questions related to events and activities of SemiDirectedActivitiesStep. The second task (PictureDescriptionTask) assesses the verbal fluency and mood of participant using a picture that the participant has to describe (with the picture in the eyes) and then to involve a discussion about their interests for the activity represented. This part is done with two different pictures.
subclass of: Restriction
  on property: involvesTask
  all values from: Class
    union of: DirectedExpressionTask
    union of: PictureDescriptionTask
    union of: PictureDiscussionTask

EstablishAccountBalanceTask
type: Class
subclass of: SemiDirectedTask
comment: - Three bills (Electricity/Gaz/Phone) are proposed. The account balance is given. - The participant has to establish the amount balance after having taken into account the three bills.

FindBusLineOnMapTask
type: Class
subclass of: SemiDirectedTask
comment: - A real bus map is showed to the participant with the indication of the current location of the participant. - The participant has to write on a sheet of paper located next to the bus map the bus lines to take for the itinerary (From Hospital to Station train). Two itineraries are accepted.

FunctionalAbilitiesData
type: Class
subclass of: MeasuredData
subclass of: Restriction
  on property: handTrajectory
  on class: HandTrajectoryType
  qualified cardinality: 1
comment: Explore functional abilities for the completion of specific activities
subclass of: Restriction
  on property: handTrajectory
  on class: HandTrajectoryType
  qualified cardinality: 1

GaitData
type: Class
subclass of: MeasuredData
subclass of: Restriction
  on property: stepLength
  cardinality: 1
subclass of: Restriction
  on property: dynamicBalance
  cardinality: 1
subclass of: Restriction
  on property: walkingSpeedInstantaneous
  cardinality: 1
subclass of: Restriction
  on property: walkingSpeed
  cardinality: 1
subclass of: Restriction
  on property: stoppingDisplacement
  qualified cardinality: 1
  on data range: boolean
comment: Gait assessment and impact of a cognitive activity on gait performance
subclass of: Restriction
  on property: stepLength
  cardinality: 1
subclass of: Restriction
  on property: dynamicBalance
  cardinality: 1
subclass of: Restriction
  on property: walkingSpeedInstantaneous
  cardinality: 1
subclass of: Restriction
  on property: walkingSpeed
  cardinality: 1
subclass of: Restriction
  on property: stoppingDisplacement
  qualified cardinality: 1
  on data range: boolean

HealthyControlParticipant
type: Class
equivalent class: Restriction
  on property: hasClinicalRecord
  some values from: Class
    intersection of: ClinicalRecord
    intersection of: Restriction
      on property: containsAssessment
      some values from: Class
        intersection of: DiagnosisAssessment
        intersection of: Restriction
subclass of: Participant
comment: A Healthy Control Participant is defined as the participant whose clinical record contains a healthy clinical diagnosis
equivalent class: Restriction
  on property: hasClinicalRecord
  some values from: Class
    intersection of: ClinicalRecord
    intersection of: Restriction
      on property: containsAssessment
      some values from: Class
        intersection of: DiagnosisAssessment
        intersection of: Restriction

LatencyData
type: Class
subclass of: MeasuredData
subclass of: Restriction
  on property: latency
  cardinality: 1
comment: Explore the time of latency [stimulation, response] during the DirectedActivitiesTask (Explore sensitivity of this measure for assessing the apathy)
subclass of: Restriction
  on property: latency
  cardinality: 1

LeaveRoomTask
type: Class
subclass of: SemiDirectedTask
comment: The participant has to leave the room when he/she feels that all activities are performed and achieved

MeasuredData
type: Class
comment: MeasuredData is the root concept that groups the measurement types that are collected during the Tasks.

MotricityAbilitiesAssessment
type: Class
subclass of: ClinicalAssessment
subclass of: Restriction
  on property: hasUPDRSScore
  qualified cardinality: 1
  on data range: int
comment: Motricity abilities assessment: - Part III of the Unified Parkinson’s Disease Rating Scale (UPDRS) .
subclass of: Restriction
  on property: hasUPDRSScore
  qualified cardinality: 1
  on data range: int

NeuropsychiatricAndMoodAssessment
type: Class
subclass of: ClinicalAssessment
subclass of: Restriction
  on property: apathyInventory
  cardinality: 1
subclass of: Restriction
  on property: npi
  cardinality: 1
subclass of: Restriction
  on property: dsm ivDepressionCriteria
  cardinality: 1
comment: Neuropsychiatric/Mood assessments: - NPI - DSM-IV Criteria for depression - Apathy Inventory (AI) and diagnostic criteria for apathy.
subclass of: Restriction
  on property: apathyInventory
  cardinality: 1
subclass of: Restriction
  on property: npi
  cardinality: 1
subclass of: Restriction
  on property: dsm ivDepressionCriteria
  cardinality: 1

OrganisationEfficiencyData
type: Class
subclass of: MeasuredData
subclass of: Restriction
  on property: areasOfNoInterestExplored
  some values from: Zone
subclass of: Restriction
  on property: areasOfInterestExplored
  some values from: Zone
subclass of: Restriction
  on property: distanceWalked
  cardinality: 1
comment: Explore ability to organize with efficiency the different activities
subclass of: Restriction
  on property: areasOfNoInterestExplored
  some values from: Zone
subclass of: Restriction
  on property: areasOfInterestExplored
  some values from: Zone
subclass of: Restriction
  on property: distanceWalked
  cardinality: 1

Participant
type: Class
subclass of: Person
subclass of: Restriction
  on property: participates
  some values from: Protocol
subclass of: Restriction
  on property: hasClinicalRecord
  on class: ClinicalRecord
  qualified cardinality: 1
subclass of: Restriction
  on property: participates
  some values from: Protocol
subclass of: Restriction
  on property: hasClinicalRecord
  on class: ClinicalRecord
  qualified cardinality: 1

PayBillTask
type: Class
subclass of: SemiDirectedTask
comment: - Three bills (Electricity/Gaz/Phone) are proposed. The participant has to pay the phone bill by check. - The check is well completed if the amount, order (i.e. Phone Company), date and signature are right.

PersonWithDementia
type: Class
equivalent class: Restriction
  on property: hasClinicalRecord
  some values from: Class
    intersection of: ClinicalRecord
    intersection of: Restriction
      on property: containsAssessment
      some values from: Class
        intersection of: DiagnosisAssessment
        intersection of: Restriction
subclass of: Participant
comment: A Person with Dementia is defined as the participant whose clinical record contains a dementia clinical diagnosis
equivalent class: Restriction
  on property: hasClinicalRecord
  some values from: Class
    intersection of: ClinicalRecord
    intersection of: Restriction
      on property: containsAssessment
      some values from: Class
        intersection of: DiagnosisAssessment
        intersection of: Restriction

PersonWithPredementia
type: Class
equivalent class: Restriction
  on property: hasClinicalRecord
  some values from: Class
    intersection of: ClinicalRecord
    intersection of: Restriction
      on property: containsAssessment
      some values from: Class
        intersection of: DiagnosisAssessment
        intersection of: Restriction
subclass of: Participant
comment: A Person with Predementia is defined as the participant whose clinical record contains a predementia clinical diagnosis
equivalent class: Restriction
  on property: hasClinicalRecord
  some values from: Class
    intersection of: ClinicalRecord
    intersection of: Restriction
      on property: containsAssessment
      some values from: Class
        intersection of: DiagnosisAssessment
        intersection of: Restriction

PictureDescriptionTask
type: Class
subclass of: FreeDiscussionTask
comment: The clinician shows to the participant one picture representing daily activity and asks the participants to give a verbal description of the picture in a few sentences

PictureDiscussionTask
type: Class
subclass of: FreeDiscussionTask
comment: The clinician asks if the participant likes doing this activity and why

PrepareDrugBoxTask
type: Class
subclass of: SemiDirectedTask
comment: - 4 types of drugs are proposed to the participant. - The participant has to respect the posology prescribed (2 types of drugs at different moment of the day) and the date (day and moment of the day).

PrepareHotTeaTask
type: Class
subclass of: SemiDirectedTask
comment: - The participant has to switch on the electric kettle. - The participant has to pour the hot water on the glass containing the tea bag.

Protocol
type: Class
subclass of: Restriction
  on property: hasProtocolStep
  some values from: ProtocolStep
subclass of: Restriction
  on property: hasEnd
  on class: Instant
  qualified cardinality: 1
subclass of: Restriction
  on property: hasBeginning
  on class: Instant
  qualified cardinality: 1
subclass of: Restriction
  on property: hasParticipant
  on class: Person
  qualified cardinality: 1
comment: A Protocol instance contains information regarding the participant and the duration of the protocol session. It can be also associated with one or more ProtocolSteps that define the Tasks and the corresponding MeasuredData.
subclass of: Restriction
  on property: hasProtocolStep
  some values from: ProtocolStep
subclass of: Restriction
  on property: hasEnd
  on class: Instant
  qualified cardinality: 1
subclass of: Restriction
  on property: hasBeginning
  on class: Instant
  qualified cardinality: 1
subclass of: Restriction
  on property: hasParticipant
  on class: Person
  qualified cardinality: 1

ProtocolStep
type: Class
subclass of: Restriction
  on property: involvesTask
  some values from: Task
subclass of: Restriction
  on property: hasEnd
  on class: Instant
  qualified cardinality: 1
subclass of: Restriction
  on property: hasBeginning
  on class: Instant
  qualified cardinality: 1
comment: A ProtocolStep defines the Tasks of interest. Three ProtocolStep types are currently defined in Dem@Care: DirectedActivities, SemiDirectedActivities and DiscussionWithTheClinician
subclass of: Restriction
  on property: involvesTask
  some values from: Task
subclass of: Restriction
  on property: hasEnd
  on class: Instant
  qualified cardinality: 1
subclass of: Restriction
  on property: hasBeginning
  on class: Instant
  qualified cardinality: 1

ReadArticleTask
type: Class
subclass of: SemiDirectedTask
comment: Three articles are proposed to the participant (Topics: Collection Cars; Cooking; Sightseeing). The three articles have the same words number and level of difficulty. Below each articles, the 3 following questions are asked - Q1/ What is the topic of the article? - Q2/ What is the percentage of French interested in the … (Collection Car / Cooking / Sightseeing, text adapted to the article topic)? - Q3/ Who is interviewed?

SemiDirectedActivitiesStep
type: Class
subclass of: ProtocolStep
subclass of: Restriction
  on property: involvesTask
  all values from: Class
    union of: AnswerPhoneTask
    union of: CallPsychologistTask
    union of: EstablishAccountBalanceTask
    union of: FindBusLineOnMapTask
    union of: LeaveRoomTask
    union of: PayBillTask
    union of: PrepareDrugBoxTask
    union of: PrepareHotTeaTask
    union of: Task
    union of: TurnOnTVTask
    union of: WaterPlantTask
comment: This ProtocolStep consists of assessing the autonomy of the participant. The participant has to organize himself/herself and correctly perform a list of Instrumental Activities of Daily Living (e.g., managing finance, using phone, preparing tea) within a timeframe of 15minutes. For this step, the participant is alone in the experimental setting and can refer to the instruction sheet of paper with the IADLs to perform at any time.
subclass of: Restriction
  on property: involvesTask
  all values from: Class
    union of: AnswerPhoneTask
    union of: CallPsychologistTask
    union of: EstablishAccountBalanceTask
    union of: FindBusLineOnMapTask
    union of: LeaveRoomTask
    union of: PayBillTask
    union of: PrepareDrugBoxTask
    union of: PrepareHotTeaTask
    union of: Task
    union of: TurnOnTVTask
    union of: WaterPlantTask

SemiDirectedTask
type: Class
subclass of: Task
subclass of: Restriction
  on property: measuredData
  all values from: Class
    union of: CognitiveAbilitiesData
    union of: FunctionalAbilitiesData
    union of: StressData
comment: In this Task the participant has to organize himself/herself and correctly perform a list of Instrumental Activities of Daily Living (e.g., managing finance, using phone, preparing tea) within a timeframe of 15minutes. The relevant tasks are used for assessing: - Cognitive abilities through activity repetitions, missed activities, order of activities - Functional abilities for the completion of specific activities: e.g. hand trajectories - Stress level
subclass of: Restriction
  on property: measuredData
  all values from: Class
    union of: CognitiveAbilitiesData
    union of: FunctionalAbilitiesData
    union of: StressData

SentenceRepeatingTask
type: Class
subclass of: DirectedTask
subclass of: Restriction
  on property: measuredData
  all values from: Class
    union of: LatencyData
    union of: StressData
    union of: VoiceData
comment: - The participant is asked to repeat a short sentence after the assessor. - The assessor reads aloud a sentence. The participant repeats the sentence. The action is done once by sentence. Three sentences must be repeated. This task is used for assessing: - Latency: time of latency between the end of instructions (stimulation) and the beginning of the task - Stress level - Voice: e.g. verbal reaction time
subclass of: Restriction
  on property: measuredData
  all values from: Class
    union of: LatencyData
    union of: StressData
    union of: VoiceData

StressData
type: Class
subclass of: MeasuredData
subclass of: Restriction
  on property: stressLevel
  cardinality: 1
comment: Explore stress level
subclass of: Restriction
  on property: stressLevel
  cardinality: 1

Task
type: Class
subclass of: Restriction
  on property: hasBeginning
  on class: Instant
  qualified cardinality: 1
subclass of: Restriction
  on property: measuredData
  some values from: MeasuredData
subclass of: Restriction
  on property: hasEnd
  on class: Instant
  qualified cardinality: 1
comment: Each Task involves the collection of one or more measurements (MeasuredData instances).
subclass of: Restriction
  on property: hasBeginning
  on class: Instant
  qualified cardinality: 1
subclass of: Restriction
  on property: measuredData
  some values from: MeasuredData
subclass of: Restriction
  on property: hasEnd
  on class: Instant
  qualified cardinality: 1

TurnOnTVTask
type: Class
subclass of: SemiDirectedTask
comment: The TV is turn off. The participant has to take the remote control and turns on the TV

VoiceData
type: Class
subclass of: MeasuredData
subclass of: Restriction
  on property: articulation
  cardinality: 1
subclass of: Restriction
  on property: speechFluency
  cardinality: 1
subclass of: Restriction
  on property: vowelDuration
  cardinality: 1
subclass of: Restriction
  on property: verbalReactionTime
  cardinality: 1
subclass of: Restriction
  on property: pauseRate
  cardinality: 1
subclass of: Restriction
  on property: speechRate
  cardinality: 1
comment: - Vocal biomarkers extraction for cognitive load assessment - Assessment of mutual influence of cognitive activities an motor activities - Assessment of the verbal reaction time and the impact of cognitive load imposed by the sentence recall task on speech fluency - Assessment of the level of the participants’ control over the neuromuscular mechanism of speech production
subclass of: Restriction
  on property: articulation
  cardinality: 1
subclass of: Restriction
  on property: speechFluency
  cardinality: 1
subclass of: Restriction
  on property: vowelDuration
  cardinality: 1
subclass of: Restriction
  on property: verbalReactionTime
  cardinality: 1
subclass of: Restriction
  on property: pauseRate
  cardinality: 1
subclass of: Restriction
  on property: speechRate
  cardinality: 1

WalkingCountingBackwardsTask
type: Class
subclass of: DirectedTask
subclass of: Restriction
  on property: measuredData
  all values from: Class
    union of: GaitData
    union of: LatencyData
    union of: StressData
    union of: VoiceData
comment: (DualTask) The clinician asks the participant to walk and count aloud backwards simultaneously: - From 305 until the end of the walking tasks; or - From 20 to 0 for participants who don’t manage to count backwards from 305 to 285 during the CountingBackwardsTask This task is used for assessing: - Gait: walking speed, step length, etc. - Latency: time of latency between the end of instructions (stimulation) and the beginning of the task - Stress level - Voice: e.g. speech fluency and articulation
subclass of: Restriction
  on property: measuredData
  all values from: Class
    union of: GaitData
    union of: LatencyData
    union of: StressData
    union of: VoiceData

WalkingTask
type: Class
subclass of: DirectedTask
subclass of: Restriction
  on property: measuredData
  some values from: LatencyData
subclass of: Restriction
  on property: measuredData
  some values from: GaitData
subclass of: Restriction
  on property: measuredData
  all values from: Class
    union of: GaitData
    union of: LatencyData
    union of: StressData
comment: (MonoTask) The clinician asks the participant to walk 4 meters across the room, to turn and then to come back (total walking distance: 8m). This task is used for assessing: - Gait: walking speed, step length, etc. - Latency: time of latency between the end of instructions (stimulation) and the beginning of the task - Stress level
subclass of: Restriction
  on property: measuredData
  some values from: LatencyData
subclass of: Restriction
  on property: measuredData
  some values from: GaitData
subclass of: Restriction
  on property: measuredData
  all values from: Class
    union of: GaitData
    union of: LatencyData
    union of: StressData

WaterPlantTask
type: Class
subclass of: SemiDirectedTask
comment: The participant has to take the water can, and water the plant nearby.

Zone
type: Class
comment: Allows the definition of zones (areas) of interest, e.g. phone zone

DCMI Type Vocabulary
type: NamedIndividual
type: VocabularyEncodingScheme
issued: 2000-07-11
Date Modified: 2012-06-14
comment: The set of classes specified by the DCMI Type Vocabulary, used to categorize the nature or genre of the resource.
Has Version: DCMIType-005

DDC
type: NamedIndividual
type: VocabularyEncodingScheme
issued: 2000-07-11
Date Modified: 2008-01-14
comment: The set of conceptual resources specified by the Dewey Decimal Classification.
Has Version: DDC-003

IMT
type: NamedIndividual
type: VocabularyEncodingScheme
issued: 2000-07-11
Date Modified: 2008-01-14
comment: The set of media types specified by the Internet Assigned Numbers Authority.
Has Version: IMT-004

LCC
type: NamedIndividual
type: VocabularyEncodingScheme
issued: 2000-07-11
Date Modified: 2008-01-14
comment: The set of conceptual resources specified by the Library of Congress Classification.
Has Version: LCC-003

LCSH
type: NamedIndividual
type: VocabularyEncodingScheme
issued: 2000-07-11
Date Modified: 2008-01-14
comment: The set of labeled concepts specified by the Library of Congress Subject Headings.
Has Version: LCSH-003

MeSH
type: NamedIndividual
type: VocabularyEncodingScheme
issued: 2000-07-11
Date Modified: 2008-01-14
comment: The set of labeled concepts specified by the Medical Subject Headings.
Has Version: MESH-003

NLM
type: NamedIndividual
type: VocabularyEncodingScheme
issued: 2005-06-13
Date Modified: 2008-01-14
comment: The set of conceptual resources specified by the National Library of Medicine Classification.
Has Version: NLM-002

TGN
type: NamedIndividual
type: VocabularyEncodingScheme
issued: 2000-07-11
Date Modified: 2008-01-14
comment: The set of places specified by the Getty Thesaurus of Geographic Names.
Has Version: TGN-003

UDC
type: NamedIndividual
type: VocabularyEncodingScheme
issued: 2000-07-11
Date Modified: 2008-01-14
comment: The set of conceptual resources specified by the Universal Decimal Classification.
Has Version: UDC-003

DCMI Metadata Terms - other
Date Modified: 2012-06-14
publisher: DCMI