ha dimensioni della foto
type: ObjectProperty
comment: This property relates a digital photograph to its format, intended as the photographic material's standardised size (e.g. negative, positives). @en
comment: Questa proprietà collega una risorsa digitale al formato della risorsa, inteso come la dimensione standardizzata (es.: per i materiali fotografici negativi, positivi, ecc.).
domain: Thing
label: has photo size @en
range: Caratteristica tecnica
sub property of: ha caratteristica tecnica
inverse of: è dimensione della foto
version info: stabile
version info: stable @en

è dimensione della foto
type: ObjectProperty
comment: Questa è la proprietà inversa a "ha dimensioni della foto"
comment: This is the inverse property of "has photo size" @en
domain: Caratteristica tecnica
label: is photo size of @en
range: Thing
sub property of: è caratteristica tecnica di
version info: stable @en
version info: stabile

Memoria occupata
type: Tipo di Misura
type: NamedIndividual
label: Occupied storage space @en
version info: stable @en
version info: stabile

Comunicazione musicale vocale
type: Tipo di modalità comunicativa
type: NamedIndividual
label: Singing communication @en

è descrizione di entità culturale soddisfatta da
type: ObjectProperty
comment: This property relates a technical description of a cultural entity to a situation that satisfies that description. @en
domain: Descrizione tecnica di entità culturale
label: is cultural entity description satisfied by @en
range: Stato tecnico di entità culturale
inverse of: soddisfa descrizione tecnica
version info: stable @en
version info: stabile

Circonferenza fianchi
type: Tipo di Misura
type: NamedIndividual
label: Hip circumference @en
version info: stable @en
version info: stabile

Orientamento
type: Class
comment: This class represents the orientation of an object (i.e. N.W., S.E.), considering the main axis. @en
comment: Questa classe rappresenta l'orientamento di un oggetto (NO, SE, etc.), secondo l'asse principale individuato.
label: Orientation @en
subclass of: Characteristic
subclass of: Restriction
  on property: è orientamento di
  some values from: Thing
version info: stable @en
version info: stabile
iccd norm tag: ICCD Normativa Trasversale: MT/ORT - ICCD Schede CA e MA: MT/ORT

posizione rispetto al bene culturale complesso
type: FunctionalProperty
type: DatatypeProperty
comment: Questa proprietà rappresenta la posizione di un bene rispetto al bene complesso di cui è parte componente.
comment: This property represents a cultural entity's position with respect to a complex entity to which it belongs. @en
domain: CulturalEntity
label: position in complex cultural property @en
range: Literal
version info: stable @en
version info: stabile
iccd norm tag: ICCD Normative OA e RA: OG/OGT/OGTP

è tipo di misura
type: ObjectProperty
comment: Questa è la proprietà inversa di "ha tipo di misura".
comment: This is the inverse property of "has measurement type". @en
domain: Tipo di Misura
label: is measurement type of @en
range: Misura
sub property of: isTypeOf
version info: stabile
version info: stable @en

Accordatura
type: Concetto tecnico
type: NamedIndividual
comment: This individual represents a musical instrument tuning. @en
comment: Questo individuo rappresenta l'accordatura di uno strumento musicale.
label: Tuning @en
version info: stable @en
version info: stabile
iccd norm tag: ICCD Normativa SM 4.00: AA/AAA

Marchio
type: Class
comment: Questa classe rappresenta un marchio, ovvero un segno, figura, simbolo impresso o applicato su qualcosa a scopo di distinzione e riconoscimento.
comment: This class represents a brand, that is a sign, an image, a symbol affixed on an object for identification. @en
label: Brand @en
subclass of: Elemento apposto su bene culturale
version info: stabile
version info: stable @en
iccd norm tag: ICCD Normativa Trasversale 4.00: se DA/ISE/ISED = 'marchio' - ICCD versioni precedenti: DA/STM/STMC = 'marchio' - ICCD Normativa A: LI/LSI/LSIG = 'marchio'

ha stato di conservazione
type: ObjectProperty
comment: This property relates the cultural property with its conservation status. @en
comment: Questa proprietà associa il bene culturale al suo stato di conservazione.
domain: CulturalEntity
label: has conservation status @en
range: Stato di Conservazione
sub property of: hasSituation
inverse of: è stato di conservazione di
version info: stabile
version info: stable @en
iccd norm tag: CO/STC

Programma per la fotografia digitale
type: Concetto tecnico
type: NamedIndividual
comment: This individual represents the visualization, storage and processing program used for a digital photograph. @en
comment: Questo individuo rappresenta il programma di visualizzazione, memorizzazione ed elaborazione utilizzato per la fotografia digitale.
label: Photo program @en
version info: stable @en
version info: stabile
iccd norm tag: ICCD Normativa F: MT/FVC/FVCP

Comunicazione scritta
type: Tipo di modalità comunicativa
type: NamedIndividual
label: Written communication @en

Fascia d'età
type: Class
comment: Questa classe rappresenta la fascia d'età (bambino, ragazzo, adulto anziano) di una persona.
comment: This class represents the age range (child, teenager, adult, old person) of a person. @en
label: Age range @en
subclass of: Characteristic
subclass of: Restriction
  on property: è fascia d'età coinvolta in
  some values from: Modalità comunicativa
version info: stabile
version info: stable @en
iccd norm tag: ICCD Normativa BDI: CU/CUC/CUCE; CU/CUP/CUPE

ha tipo di stato di conservazione
type: ObjectProperty
comment: Questa proprietà associa lo stato di conservazione a uno dei valori del tipo di stato di conservazione.
comment: This property relates a conservation status to one of its type's values. @en
domain: Stato di Conservazione
label: has conservation status type @en
range: Tipo di stato di conservazione
sub property of: hasType
inverse of: è tipo di stato di conservazione
version info: stable @en
version info: stabile
iccd norm tag: CO/STC/STCC

è temperamento di
type: ObjectProperty
comment: This is the inverse property of "has temperament". @en
comment: Questa è la proprietà inversa di "ha temperamento".
domain: Caratteristica tecnica
label: is temperament of @en
range: Thing
sub property of: è caratteristica tecnica di
version info: stable @en
version info: stabile

Colore della fotografia
type: Concetto tecnico
type: NamedIndividual
comment: This individual represents a digital photograph's colour, i.e. black and white or colours. @en
comment: Questo individuo rappresenta il colore della fotografia digitale, ovvero se trattasi di fotografia in bianco/nero o a colori.
label: Photo colour @en
version info: stable @en
version info: stabile
iccd norm tag: ICCD Normativa F: MT/MTX

Filigrana
type: Concetto tecnico
type: NamedIndividual
comment: This individual represents the filigree of an artwork, painting, photography, print. @en
comment: Questo individuo rappresenta la filigrana di un'opera d'arte, un disegno, una fotografia, una stampa.
label: Filigree @en
version info: stable @en
version info: stabile
iccd norm tag: ICCD Normative OA, D, F, S: MT/FIL

Durata temporale
type: Tipo di Misura
type: NamedIndividual
label: Duration @en
version info: stable @en
version info: stabile

ha tipo di caratteri
type: ObjectProperty
comment: This property connects an inscription or emblem, postmark, crest, etc. to the font style which has been adopted (e.g.: italic, bold, gothic etc). @en
comment: Questa proprietà collega un'iscrizione, uno stemma, un timbro, etc., al tipo di caratteri che viene adottato (es.: corsivo, grassetto, caratteri gotici, etc.).
domain: Elemento apposto su bene culturale
label: has font style @en
range: Tipo di caratteri
inverse of: è tipo di caratteri di
version info: stable @en
version info: stabile
iccd norm tag: ICCD Normativa Traversale 4.00: DA/ISE/ISET - Normative di versioni precedenti: DA/ISR/ISRT

Lunghezza
type: Tipo di Misura
type: NamedIndividual
label: Length @en
version info: stable @en
version info: stabile

Denominazione consuetudinaria
type: Tipo di denominazione
type: NamedIndividual
comment: This individual represents the usual designation. @en
comment: Questo individuo rappresenta una denominazione consuetudinaria.
label: Customary designation @en
version info: stable @en
version info: stabile
iccd norm tag: ICCD Normativa Trasversale: OGD/OGDT - Normative A e PG 3: OGA/OGAG.

Denominazione in altra lingua
type: Tipo di denominazione
type: NamedIndividual
comment: This individual represents a designation in other language. @en
comment: Questo individuo rappresenta una denominazione in altra lingua.
label: Other language designation @en
version info: stable @en
version info: stabile
iccd norm tag: ICCD Normativa Trasversale: OGD/OGDT - Normative A, BDM, PG 3: OGA/OGAG.

Misure varie
type: Tipo di Misura
type: NamedIndividual
label: Various misurements @en
version info: stable @en
version info: stabile

Apparato iconografico e decorativo
type: Tipo di apparato iconografico e decorativo
type: NamedIndividual
label: Iconographic and Decorative apparatus @en

Comunicazione musicale strumentale
type: Tipo di modalità comunicativa
type: NamedIndividual
label: Instrumental communication @en

è fascia d'età coinvolta in
type: ObjectProperty
comment: This is the inverse property of "involves age range". @en
comment: Questa è la proprietà inversa di "coinvolge fascia d'età".
domain: Fascia d'età
label: is age range involved in @en
range: Modalità comunicativa
version info: stabile
version info: stable @en

Apparato decorativo
type: Tipo di apparato iconografico e decorativo
type: NamedIndividual
label: Decorative apparatus @en

Contromarca
type: Class
comment: Questa classe rappresenta una contromarca, ovvero una lettera o un altro segno punzonato su una moneta. Una contromarca viene apposta tramite un apposito punzone. La maggior parte delle monete vengono contromarcate per cambiarne il valore in seguito a una riforma monetaria. La contromarca è quindi un segno apposto dall'autorità emittente nel dritto o nel rovescio della moneta in epoca posteriore alla sua emissione, per aumentarne o diminuirne il valore e, in caso di necessità, per rimettere in circolazione monete già ritirate.
comment: This class represent a counterstamp (or countermark), that is a partial or complete over-stamping of a coin, generally affixed in order to change its value or issuing authority. @en
label: Counterstamp @en
subclass of: Elemento apposto su bene culturale
subclass of: Restriction
  all values from: CoinIssuance
  on property: hasCoinIssuance
version info: stabile
version info: stable @en
iccd norm tag: ICCD Normativa NU 4.00: DA/CON

è campione prelevato da
type: ObjectProperty
comment: This is the inverse property of "has sample collected". @en
comment: Questa è la proprietà inversa di "ha campione prelevato".
domain: Campione prelevato
label: is sample collected from @en
range: CulturalEntity
version info: stable @en
version info: stabile

Denominazione originaria
type: Tipo di denominazione
type: NamedIndividual
comment: This individual represents original designation. @en
comment: Questo individuo rappresenta una denominazione originaria.
label: Original designation @en
version info: stable @en
version info: stabile
iccd norm tag: ICCD Normativa Trasversale: OGD/OGDT - Normative A e PG 3: OGA/OGAG.

Iscrizione
type: Class
comment: Questa classe rappresenta un'iscrizione, ovvero qualsiasi scritta o segno grafico volontario, realizzati con qualsiasi tecnica (incisione, pittura, stampa, ecc.)
label: Inscription @en
subclass of: Elemento apposto su bene culturale
version info: stable @en
version info: stabile
iccd norm tag: ICCD Normativa Trasversale 4.00: se DA/ISE/ISED = 'iscrizione' - ICCD versioni precedenti: DA/ISR - ICCD Normativa A: LI/LSI/LSIG = 'iscrizione'

Memoria di massa
type: Concetto tecnico
type: NamedIndividual
comment: This individual represents the mass storage where a digital photograph is stored. @en
comment: Questo individuo rappresenta la memoria di massa nella quale è stata memorizzata una fotografia digitale.
label: Mass storage @en
version info: stable @en
version info: stabile
iccd norm tag: ICCD Normativa F: MT/FVM

Lunghezza totale massima
type: Tipo di Misura
type: NamedIndividual
label: Maximum total length @en
version info: stable @en
version info: stabile

ha filigrana
type: ObjectProperty
comment: Questa proprietà collega un'opera d'arte, un disegno, una fotografia, una stampa alla sua filigrana.
comment: This property relates an artwork, painting, photography, print to its filigree. @en
domain: Thing
label: has filigree @en
range: Caratteristica tecnica
sub property of: ha caratteristica tecnica
inverse of: è filigrana di
version info: stable @en
version info: stabile

Concetto tecnico
type: Class
comment: This class represents a technical concept, a particular type of concept that classifies a technical characteristic of an entity, e.g. cultural property. For instance, "material" is a techincal concept that classifies the technical characteristic "pottery" related to a cultural property. @en
comment: Questa classe rappresenta un concetto tecnico, inteso come tipo particolare di concetto che fornisce una classificazione a una caratteristica tecnica di un'entità, es. un bene culturale. Per esempio, "materia" è un concetto tecnico che può essere utilizzato per classificare la caratteristica tecnica "terracotta" relativa a un bene culturale.
label: Technical concept @en
subclass of: Concept
is native to: technical-characteristic
version info: stabile
version info: stable @en
iccd norm tag: ICCD Normativa Trasversale 4.00: MT/MTC/MTCM; MT/MTC/MTCT - Normativa OA, D, S, MI: MT/FRM - Normativa OA, D, F, S: MT/FIL - Normativa VeAC: MT/MTC/MTCC; MT/MTC/MTCF - Normativa F: MT/FVC/FVCC; MT/FVC/FVCF; MT/FVC/FVCP; MT/FVC/FVCU; MT/FVC/FVCM; MT/FVM; MT/MTX; MT/FVM; MT/FRM;

Leggibilità ridotta
type: Leggibilità
type: NamedIndividual
label: Lowered legibility @en

Denominazione storica
type: Tipo di denominazione
type: NamedIndividual
comment: This individual represents a historical designation. @en
comment: Questo individuo rappresenta una denominazione storica.
label: Historical designation @en
version info: stable @en
version info: stabile
iccd norm tag: ICCD Normativa Trasversale: OGD/OGDT - Normative A e PG 3: OGA/OGAG.

ha valore
type: ObjectProperty
comment: Questa proprietà collega una misura al suo valore.
comment: This property relates a measurement to its value. @en
domain: Misura
label: has value @en
range: Value
inverse of: è valore di
version info: stabile
version info: stable @en

ha tipo di elemento apposto
type: ObjectProperty
comment: Questa proprietà collega un'iscrizione, un emblema, un timbro, uno stemma, etc., al suo tipo (es.: gentilizio, civile, religioso, etc.)
comment: This property relatesan inscription (or an emblem, a mark, etc.) to its type. @en
domain: Elemento apposto su bene culturale
label: has affixed element type @en
range: Tipo di elemento apposto
sub property of: hasType
inverse of: è tipo di elemento apposto
version info: stable @en
version info: stabile
iccd norm tag: ICCD Normativa Trasversale 4.00: DA/ISE/ISEE - Normative di versioni precedenti: DA/STM/STMQ

sono specifiche del bene culturale
type: ObjectProperty
comment: This is the inverse property of "has cultural property specification". @en
comment: Questa è la proprietà inversa di "ha specifiche del bene culturale".
domain: Specifiche del bene culturale
label: is cultural property specification @en
range: Tipo di bene culturale
version info: stabile
version info: stable @en

è stato tecnico di
type: ObjectProperty
comment: Questa proprietà collega uno stato tecnico di un'entità culturale a un'entità culturale. Lo stato è valido fino a determinato momento ed è rappresentato dalle caratteristiche tecniche che il bene culturale ha in quel momento.
comment: This property connects a technical status to a cultural entity. This status is valid until a specific moment and is represented by the technical characteristics that a cultural entity has in that moment. @en
domain: Stato tecnico di entità culturale
label: is technical status of @en
range: Thing
sub property of: isSituationOf
version info: stabile
version info: stable @en

è stato tecnico di entità culturale valido fino a
type: ObjectProperty
comment: Questa proprietà collega uno stato tecnico di un'entità culturale all'intervallo temporale entro il quale è valido, relativamente al momento in cui quelle caratteristiche sono state rilevate.
comment: This property relates a cultural entity technical status to the time interval until which that status is valid, with regard to the moment in which the characteristics are observed. @en
domain: Stato tecnico di entità culturale
label: is cultural entity technical status valid at @en
range: TimeInterval
inverse of: è intervallo di tempo valido per
version info: stabile
version info: stable @en

ha disponibilità materiale
type: ObjectProperty
comment: This class relates the cultural property to its availability, that is wheter the cultural property is available or not (e.g.: theft, destruction) for example for cataloguing activities. @en
comment: Questa proprietà collega il bene culturale alla sua disponibilità materiale, ovvero se il bene è materialmente disponibile, per esempio per attività di catalogazione, o se non è disponibile (es.: furto, distruzione)
domain: CulturalEntity
label: has cultural property availability @en
range: Disponibilità materiale del bene culturale
sub property of: hasCulturalEntityCharacteristic
inverse of: è disponibilità materiale di bene culturale
version info: stabile
version info: stable @en
iccd norm tag: ICCD Normativa Trasversale 4.00: OG/OGR

Elemento apposto su bene culturale
type: Class
comment: This class represents an element (i.e. crest, trademark, postmark, inscription) which is affixed on a cultural property. @en
comment: Questa classe rappresenta un elemento (stemma, marchio, timbro, emblema, logo, iscrizione, etc.) apposto su un bene culturale.
label: Element affixed on cultural property @en
subclass of: Object
subclass of: Restriction
  all values from: Stato tecnico di entità culturale
  on property: ha stato tecnico
subclass of: Restriction
  all values from: Literal
  on property: description
subclass of: Restriction
  all values from: Supporto
  on property: ha supporto
subclass of: Restriction
  all values from: Sistema di scrittura
  on property: ha sistema di scrittura
subclass of: Restriction
  all values from: Agent
  on property: hasAuthor
subclass of: Restriction
  all values from: Scopo funzionale
  on property: ha scopo funzionale
subclass of: Restriction
  all values from: Tipo di caratteri
  on property: ha tipo di caratteri
subclass of: Restriction
  all values from: Literal
  on property: trascrizione
subclass of: Restriction
  on property: è elemento apposto su
  some values from: CulturalEntity
subclass of: Restriction
  all values from: Literal
  on property: traduzione italiana
description: Un esempio d'uso di una delle sottoclassi della classe "Elemento apposto su bene culturale" è il seguente: resource:Inscription/1200865151-inscription-1 a dd:Inscription ; rdfs:label "Iscrizione 1 del bene culturale 1200865151"@en ; dd:hasFontStyle resource:FontStyle/lettere-capitali ; dd:hasTechnicalDetailOccurrence resource:TechnicalDetailOccurrence/1200865151-inscription-1-material-technique-1 ; dd:positionOnCulturalProperty "al centro" ; dd:transcript "PAVLVS VENETVS PAPA SECVNDVS SVIS IMPENSIS FIERI FECIT ANNO CRISTI MCCCLXVII" ; language:hasLanguage resource:Language/latino .
description: An example of usage of one of the subclasses of the class 'Affixed element' is the following: resource:Inscription/1200865151-inscription-1 a dd:Inscription ; rdfs:label "Inscription 1 of cultural property 1200865151"@en ; dd:hasFontStyle resource:FontStyle/lettere-capitali ; dd:hasTechnicalDetailOccurrence resource:TechnicalDetailOccurrence/1200865151-inscription-1-material-technique-1 ; dd:positionOnCulturalProperty "in the middle" ; dd:transcript "PAVLVS VENETVS PAPA SECVNDVS SVIS IMPENSIS FIERI FECIT ANNO CRISTI MCCCLXVII" ; language:hasLanguage resource:Language/latino . @en
version info: stable @en
version info: stabile
iccd norm tag: ICCD Normativa Trasversale 4.00: DA/ISE - ICCD versioni precedenti alla 4.00: DA/ISR; DA/STM - ICCD Normativa A: LI/LSI

è misura in collezione
type: ObjectProperty
comment: Questa proprietà, inversa a "ha misura", collega una misura di un oggetto all'insieme di misure osservate per l'oggetto.
comment: This property connects an object's measure to the observed measures' collection of that object. It is the inverse property of hasMeasurement. @en
domain: Misura
label: is measurement in collection @en
range: Collezione di misure
is native to: object-collection
version info: stabile
version info: stable @en
iccd norm tag: MT/MIS - Normativa VeAC: anche MT/MIM

Analisi del vestimento
type: Concetto tecnico
type: NamedIndividual
comment: This individual represents the techincal definition of textured fabrics of an ancient or contemporary garment, according to the standard provided by C.I.E.T.A., or laces. It can also represent the dinstrinction between plain fabric and textured fabric. @en
comment: Questo individuo rappresenta la definizione tecnica completa dei tessuti, secondo le norme fornite dal C.I.E.T.A., o dei merletti, oppure rappresenta la distinzione fra tessuto unito e tessuto operato.
label: Garment analysis @en
version info: stable @en
version info: stabile
iccd norm tag: ICCD Normativa VeAC: MT/MTC/MTCA

Non più disponibile
type: Disponibilità materiale del bene culturale
type: NamedIndividual
label: No longer available @en

è tipo di denominazione
type: ObjectProperty
comment: Questa è la proprietà inversa di "ha tipo di denominazione".
comment: This is the inverse property of "has designation type". @en
domain: Tipo di denominazione
label: is designation type of @en
range: Denominazione nel tempo
sub property of: isTypeOf
version info: stabile
version info: stable @en

sono note producibili di
type: ObjectProperty
comment: Questa è la proprietà inversa di "ha note producibili".
comment: This is the inverse property of "has available notes". @en
domain: Caratteristica tecnica
label: are available notes of @en
range: Thing
sub property of: è caratteristica tecnica di
inverse of: ha note producibili
version info: stable @en
version info: stabile

è agente cui si riferisce
type: ObjectProperty
comment: This is the inverse property of "refers to agent". @en
comment: Questa è la proprietà inversa a "si riferisce ad agente".
domain: Agent
label: is agent referred to by @en
range: Elemento apposto su bene culturale
inverse of: si riferisce ad agente
version info: stable @en
version info: stabile

ha localizzazione rappresentata
type: ObjectProperty
comment: Questa proprietà rappresenta l'area rappresentata come soggetto di un bene culturale.
comment: This property represent the location as a subject of a cultural entity. @en
domain: CulturalEntity
label: has location as subject @en
range: TimeIndexedTypedLocation
inverse of: è localizzazione rappresentata da
version info: stabile
version info: stable @en
iccd norm tag: se 4.00 LA/TLC o versioni precedenti a 4.00 LA/TCL = "area rappresentata"

numero di partecipanti femminili
type: FunctionalProperty
type: DatatypeProperty
comment: Questa proprietà rappresenta il numero delle persone di sesso femminile che attuano una comunicazione (verbale, musicale vocale, cinesica).
comment: This property represents the number of the male participants to a communication (verbal, singing, kinesic). @en
domain: Modalità comunicativa
label: number of female participants @en
range: integer
version info: stabile
version info: stable @en
iccd norm tag: ICCD Normativa BDI: CU/CUV/CUVF; CU/CUM/CUMF; CU/CUC/CUCF

Peso
type: Tipo di Misura
type: NamedIndividual
label: Weight @en
version info: stable @en
version info: stabile

occorrenze
type: FunctionalProperty
type: DatatypeProperty
comment: Questa proprietà rappresenta le occorrenze di un emblema, marchio, iscrizione, etc., su uno stesso bene culturale, cioè quante volte l'elemento descritto compare sul bene.
comment: This property represents the occurrences of an affixed element on a cultular entity, that is how many times the outlined element appears on the cultual entity. @en
domain: Elemento apposto su bene culturale
label: occurrences @en
range: Literal
version info: stabile
version info: stable @en
iccd norm tag: ICCD Normativa Trasversale 4.00: DA/ISE/ISEQ - Normative di versioni precedenti: DA/STM/STMU

ha colore della foto
type: ObjectProperty
comment: This property relates a digital photograph to its colour, i.e. black and white or colours. @en
comment: Questo individuo collega una fotografia digitale al colore della fotografia digitale, ovvero se trattasi di fotografia in bianco/nero o a colori.
domain: Thing
label: has photo colour @en
range: Caratteristica tecnica
sub property of: ha caratteristica tecnica
inverse of: è colore della foto
version info: stabile
version info: stable @en

Altezza x Larghezza x Spessore
type: Tipo di Misura
type: NamedIndividual
label: Height x Width x Thickness @en
version info: stable @en
version info: stabile

Denominazione nel tempo
type: Class
comment: This class represents a certain cultural property's designation/denomination attested over time. @en
comment: Questa classe rappresenta una denominazione e/o dedicazione attestata nel corso del tempo per il bene in esame. Per la normativa FF, la classe rappresenta nello specifico la denominazione o il titolo del fondo attestati nel corso del tempo per il bene in esame; uno stesso fondo può avere più denominazioni/titoli nel corso del tempo.
label: Designation In Time @en
subclass of: Situation
subclass of: Restriction
  all values from: Literal
  on property: note
subclass of: Restriction
  on property: è denominazione nel tempo di
  some values from: CulturalEntity
subclass of: Restriction
  all values from: Tipo di denominazione
  on property: ha tipo di denominazione
subclass of: Restriction
  on property: name
  some values from: Literal
version info: stable @en
version info: stabile
iccd norm tag: ICCD Normativa Trasversale 4.00: OG/OGD - Normative A, BDM, PG 3: OG/OGA.

è metodo di memorizzazione e profondità del colore di
type: ObjectProperty
comment: Questa è la proprietà inversa di "ha metodo di memorizzazione e profondità del colore".
comment: This is the inverse property of "has storage method or colour depth". @en
domain: Caratteristica tecnica
label: is storage method or colour depth of @en
range: Thing
sub property of: è caratteristica tecnica di
version info: stable @en
version info: stabile

Dato sullo stato di conservazione non disponibile
type: Tipo di stato di conservazione
type: NamedIndividual
label: Data on conservation status unavailable @en
version info: stable @en
version info: stabile

Dedica
type: Class
comment: Questa classe rappresenta una dedica, intesa come iscrizione dell'autore (dedicante) su un bene culturale contenente un testo che ha lo scopo di offrire l'oggetto a una persona o un ente (dedicatario).
label: Dedication @en
subclass of: Iscrizione
subclass of: Restriction
  all values from: Source
  on property: hasSource
subclass of: Restriction
  all values from: Circumstance
  on property: hasCircumstance
version info: stabile
version info: stable @en
iccd norm tag: ICCD Normativa MI 3.00: AU/DDC

Leggibilità
type: Class
comment: Questa classe rappresenta lo stato di leggibilità (totale, buona, discreta, ridotta, assente) di un bene numismatico, relativamente al suo stato di conservazione.
comment: This class represents the legibility status (complete, decent, good, lowered, impossible) of a numinsmatic property. It is related to the property's conservation status. @en
label: Legibility @en
subclass of: CulturalEntityCharacteristic
subclass of: Restriction
  on property: è leggibilità di
  some values from: Stato di Conservazione
version info: stable @en
version info: stabile
iccd norm tag: ICCD Normativa NU: CO/STC/STCL

è tecnica di
type: ObjectProperty
comment: This is the inverse property of "has technique" @en
comment: Questa è la proprietà inversa di "ha materia e tecnica"
domain: Caratteristica tecnica
label: is technique of @en
range: Thing
sub property of: è materia e tecnica di
version info: stabile
version info: stable @en

ha analisi del vestimento
type: ObjectProperty
comment: Questa proprietà collega un vestimento antico o contemporaneo alla definizione tecnica completa dei tessuti, secondo le norme fornite dal C.I.E.T.A., o dei merletti, oppure rappresenta la distinzione fra tessuto unito e tessuto operato.
comment: This property relates an ancient or contemporary garment to the technical definition of textured fabrics, according to the standard provided by C.I.E.T.A., or laces. It can represent the dinstinction between plain fabric and textured fabric. @en
domain: Thing
label: has garment analysis @en
range: Caratteristica tecnica
sub property of: ha caratteristica tecnica
inverse of: è analisi del vestimento
version info: stable @en
version info: stabile

Altezza
type: Tipo di Misura
type: NamedIndividual
label: Height @en
version info: stable @en
version info: stabile

ha dedicatario
type: ObjectProperty
comment: Questa proprietà collega una dedica al dedicatario, cioè alla persona o ente cui è rivolta la dedica.
comment: This property connects a dedication to its dedicaatee, which is the person or institution to whom the dedication is addressed. @en
domain: Dedica
label: has dedicatee @en
range: Agent
inverse of: è dedicatario di
version info: stable @en
version info: stabile
iccd norm tag: ICCD Normativa MI 3.00: AU/DDC/DDCM

ha elemento apposto sul bene
type: ObjectProperty
comment: This property relates a cultural property to an element affixed on it (e.g. inscription, stamp, etc.) @en
comment: Questa proprietà collega un bene culturale a un elemento apposto sul bene (es.: emblema, timbro, iscrizione, etc.)
domain: CulturalEntity
label: has element affixed to cultural property @en
range: Elemento apposto su bene culturale
inverse of: è elemento apposto su
version info: stable @en
version info: stabile
iccd norm tag: ICCD Normativa Trasversale 4.00: DA/ISE - ICCD versioni precedenti alla 4.00: DA/ISR; DA/STM - ICCD Normativa A: LI/LSI - ICCD Normativa MI: AU/DDC

ha tecnica
type: ObjectProperty
comment: This property relates an object to its execution technique. @en
comment: Questa proprietà collega un oggetto alla tecnica di esecuzione dell'oggetto, per esempio un bene culturale.
domain: Thing
label: has technique @en
range: Caratteristica tecnica
sub property of: ha materia e tecnica
inverse of: è tecnica di
version info: stable @en
version info: stabile

ha supporto
type: ObjectProperty
comment: This property connects an inscription, stamp, emblem etc., represented on a cultural entity to the support on which the entity is located. @en
comment: Questa proprietà collega una iscrizione, un timbro, un emblema, etc., rappresentato su un bene culturale al supporto su cui si trova l'elemento.
domain: Elemento apposto su bene culturale
label: has support @en
range: Supporto
inverse of: è supporto di
version info: stable @en
version info: stabile
iccd norm tag: ICCD Normativa Trasversale 4.00: DA/ISE/ISES

è collezione di misure di
type: ObjectProperty
comment: Questa è la proprietà inversa di "ha collezione di misure".
comment: This is the inverse property of "has measurement collection". @en
domain: Collezione di misure
label: is measurement collection of @en
range: Thing
version info: stabile
version info: stable @en

è risoluzione di
type: ObjectProperty
comment: Questa è la proprietà inversa a "ha risoluzione"
comment: This is the inverse property of "has resolution" @en
domain: Caratteristica tecnica
label: is resolution of @en
range: Thing
sub property of: è caratteristica tecnica di
version info: stabile
version info: stable @en

Parzialmente accessibile
type: Accessibilità del bene culturale
type: NamedIndividual
label: Partially accessible @en

è inclusa in stato tecnico
type: ObjectProperty
comment: This property relates a technical characteristic (e.g. marble) to the status of a cultural entity that includes that characteristic. @en
comment: Questa proprietà, inversa a "include caratteristica tecnica", collega una caratteristica tecnica specifica (es.: marmo) allo stato di un'entità culturale che ha quella caratteristica.
domain: Caratteristica tecnica
label: is included in technical status @en
range: Stato tecnico di entità culturale
is native to: technical-characteristic
version info: stabile
version info: stable @en

è caratteristica tecnica di
type: ObjectProperty
comment: This property relates a technical characteristic to an entity. @en
comment: Questa proprietà collega una caratteristica tecnica all'entità che ha quella caratteristica.
domain: Caratteristica tecnica
label: is technical characteristic of @en
range: Thing
version info: stabile
version info: stable @en

Tipo di Misura
type: Class
comment: Questa classe rappresenta il tipo di misura osservata (larghezza, altezza, diametro, etc.)
comment: This class represents the observed measurement type (width, height, diameter, etc). @en
label: Measurement Type @en
subclass of: Type
subclass of: Restriction
  on property: è tipo di misura
  some values from: Misura
version info: stable @en
version info: stabile
iccd norm tag: ICCD Normativa Trasversale: MT/MIS/MISZ; MT/MNR - Per versioni di normativa precedenti alla 4.00: MT/MIS/MISA; MT/MIS/MISD; MT/MIS/MISL; MT/MIS/MISN; MT/MIS/MISG; MT/MIS/MISP; MT/MIS/MISS; MT/MIS/MISR; MT/MIS/MISV - ICCD scheda VeAC: MT/MII/MIIA; MT/MII/MIIL; MT/MII/MIIP; MT/MIS/MISR; MT/MIS/MISD; MT/MIS/MISS; MT/MIS/MISP; MT/MIS/MISV; MT/MIS/MISF; MT/MIS/MISO

Lunghezza esterna / interna
type: Tipo di Misura
type: NamedIndividual
label: External / Internal length @en
version info: stable @en
version info: stabile

è accordatura di
type: ObjectProperty
comment: This is the inverse property of "has tuning". @en
comment: Questa è la proprietà inversa di "ha accordatura".
domain: Caratteristica tecnica
label: is tuning of @en
range: Thing
sub property of: è caratteristica tecnica di
version info: stable @en
version info: stabile

Stato tecnico di entità culturale
type: Class
comment: Questa classe rappresenta lo stato tecnico di un'entità culturale, cioè una situazione in cui un'entità culturale ha associate una serie di caratteristiche tecniche. Lo stato di un'entità ha associata una validità temporale, relativa al momento in cui quelle caratteristiche sono state rilevate. Per esempio, una occorrenza di un dettaglio tecnico è: "bene culturale X realizzato con la materia terracotta e di forma cilindrica".
comment: This class represents the technical status of a cultural entity, that is a situation in which the cultural entity is associated to technical characteristics. The technical status has a temporal validity, related to the moment when the characteristics were observed. For instance, a cultural property techncal status is: "the cultural property X realized with pottery material and cylindrical in shape". @en
label: Technical status of cultural entity @en
subclass of: Situation
subclass of: Restriction
  on property: include caratteristica tecnica
  some values from: Caratteristica tecnica
subclass of: Restriction
  on property: è stato tecnico di
  some values from: CulturalEntity
is native to: technical-characteristic
description: An example of usage of the class 'Cultural entity technical status' is the following: resource:CulturalEntityTechnicalStatus/0900281817-4 a a-dd:CulturalEntityTechnicalStatus ; rdfs:label "Technical status of cultural property 0900281817-4"@en ; a-dd:includesTechnicalCharacteristic resource:TechnicalCharacteristic/centinato, resource:TechnicalCharacteristic/stone-sculpture . resource:TechnicalCharacteristic/stone-sculpture a a-dd:TechnicalCharacteristic ; rdfs:label "stone/ sculpture" ; a-dd:isClassifiedBy a-dd:MaterialOrTechnique . @en
description: Un esempio d'uso della classe "Stato tecnico di entità culturale" è il seguente: resource:CulturalEntityTechnicalStatus/0900281817-4 a a-dd:CulturalEntityTechnicalStatus ; rdfs:label "Stato tecnico del bene culturale 0900281817-4"@it ; a-dd:includesTechnicalCharacteristic resource:TechnicalCharacteristic/centinato, resource:TechnicalCharacteristic/pietra-scultura . resource:TechnicalCharacteristic/pietra-scultura a a-dd:TechnicalCharacteristic ; rdfs:label "pietra/ scultura" ; a-dd:isClassifiedBy a-dd:MaterialOrTechnique .
version info: stable @en
version info: stabile
iccd norm tag: ICCD Normativa Trasversale 4.00: MT/MTC/MTCM; MT/MTC/MTCT - Normativa OA, D, F, S, MI: MT/FRM - Normativa OA, D, F, S: MT/FIL - Normativa VeAC: MT/MTC/MTCC; MT/MTC/MTCF - Normativa F: MT/FVC/FVCC; MT/FVC/FVCF; MT/FVC/FVCP; MT/FVC/FVCU; MT/FVC/FVCM; MT/FVM;

ha risoluzione
type: ObjectProperty
comment: Questa proprietà collega una fotografia alla risoluzione e al valore specifico utilizzati per la memorizzazione di una fotografia digitale.
comment: This property relates a digital resource to theresolution used for storing it. @en
domain: Thing
label: has resolution @en
range: Caratteristica tecnica
sub property of: ha caratteristica tecnica
inverse of: è risoluzione di
version info: stable @en
version info: stabile

Diametro
type: Tipo di Misura
type: NamedIndividual
label: Diameter @en
version info: stable @en
version info: stabile

numero di partecipanti infantili
type: FunctionalProperty
type: DatatypeProperty
comment: Questa proprietà rappresenta il numero dei bambini che attuano una comunicazione (verbale, musicale vocale).
comment: This property represents the number of the child participants to a communication (verbal, singing, kinesic). @en
domain: Modalità comunicativa
label: number of child participants @en
range: integer
version info: stable @en
version info: stabile
iccd norm tag: ICCD Normativa BDI: CU/CUV/CUVI; CU/CUM/CUMI

ha tipo di apparato iconografico e decorativo
type: FunctionalProperty
type: ObjectProperty
comment: Questa proprietà collega un apparato iconografico e decorativo di un bene culturale al tipo di apparato (iconografico, decorativo, iconografico-decorativo).
comment: This property relates a iconographic or decorative apparatus to its type. @en
domain: Apparato iconografico e decorativo
label: has iconographic or decorative apparatus type @en
range: Tipo di apparato iconografico e decorativo
sub property of: hasType
inverse of: è tipo di apparato iconografico e decorativo
version info: stabile
version info: stable @en

ha metodo di memorizzazione e profondità del colore
type: ObjectProperty
comment: Questa proprietà collega una fotografia al metodo e alla profondità di colore con cui è stata memorizzata la fotografia digitale.
comment: This property relates a digital photograph to the method and color depth through which a digital photograph has been stored. @en
domain: Thing
label: has storage method or colour depth @en
range: Caratteristica tecnica
sub property of: ha caratteristica tecnica
inverse of: è metodo di memorizzazione e profondità del colore di
version info: stabile
version info: stable @en

Denominazione gergale
type: Tipo di denominazione
type: NamedIndividual
comment: This individual represents a slang designation. @en
comment: Questo individuo rappresenta una denominazione gergale.
label: Slang designation @en
version info: stable @en
version info: stabile
iccd norm tag: ICCD Normativa Trasversale: OGD/OGDT - Normative A e BDM 3: OGA/OGAG.

è lunghezza vibrante di
type: ObjectProperty
comment: Questa è la proprietà inversa di "ha lunghezza vibrante".
comment: This is the inverse property of "has vibrating lenght". @en
domain: Caratteristica tecnica
label: is vibrating lenght of @en
range: Thing
sub property of: è caratteristica tecnica di
version info: stable @en
version info: stabile

ha definizione del bene culturale
type: ObjectProperty
comment: Questa proprietà collega la tipologia di un bene culturale a una delle sue componenti, cioè la definizione.
comment: This property relates a cultural entity's typology to one of its components, i.e. its definition. @en
domain: Tipo di bene culturale
label: has cultural property definition @en
range: Definizione del bene culturale
inverse of: è definizione di bene culturale
version info: stabile
version info: stable @en
iccd norm tag: OG/OGT/OGTD

Collezione di misure
type: Class
comment: Questa classe rappresenta l'insieme delle misurazioni osservate per un oggetto. Per la normativa F, le misure possono essere relative anche a supporti secondari, custodie, cornici, singoli fotogrammi, ecc. Per la normativa VeAC, le misure possono essere relative all'ingombro per l'immagazzinaggio; alla base (individuano l'oggetto e la conformazione fisica del proprietario e sono fondamentali per l'allestimento museale, per individuare i tipi di supporti necessari per l'esposizione); alle maniche.
comment: This class represents the set of measurments observed for an object. @en
label: Measurement collection @en
subclass of: Collection
subclass of: Restriction
  on property: ha misura
  some values from: Misura
subclass of: Restriction
  on property: è collezione di misure di
  some values from: Thing
is native to: object-collection
description: An example of usage of the class 'Measurement collection' is the following: resource:MeasurementCollection/1200865132-1 a dd:MeasurementCollection ; rdfs:label "Measurements of cultural property 1200865132 7"@en ; dd:hasMeasurement resource:Measurement/1200865132-1-width , resource:Measurement/1200865132-1-height , resource:Measurement/1200865132-1-depth . @en
description: Un esempio d'uso della classe "Collezione di misure" è il seguente: resource:MeasurementCollection/1200865132-1 a dd:MeasurementCollection ; rdfs:label "Misure del bene culturale 1200865132 7"@it ; dd:hasMeasurement resource:Measurement/1200865132-1-width , resource:Measurement/1200865132-1-height , resource:Measurement/1200865132-1-depth .
version info: stable @en
version info: stabile
iccd norm tag: MT/MIS - Normativa VeAC: anche MT/MII e MT/MIM

ha modalità comunicativa
type: ObjectProperty
comment: Questa proprietà collega un bene culturale immateriale a una modalità comunicativa mediante la quale il bene viene veicolato.
comment: This property relates an intangible cultural property to a communication medium. @en
domain: CulturalEntity
label: has communication medium @en
range: Modalità comunicativa
sub property of: hasCulturalEntityCharacteristic
inverse of: è modalità comunicativa
version info: stable @en
version info: stabile
iccd norm tag: ICCD Normativa BDI: CU

ha accessorio
type: ObjectProperty
comment: This property relates a musical good to one of its accessories. In other words, it is an object linkable to a musical object, whether it is functional to the sound production, or if it is the sound's production or conservation medium. @en
comment: Questa proprietà collega un bene musicale a un suo accessorio, ovvero un oggetto collegabile al bene musicale, sia nel caso in cui sia funzionale alla produzione del suono, sia nel caso in cui sia di supporto alla produzione del suono o alla conservazione o alla prassi musicale del bene.
domain: CulturalEntity
label: has accessory @en
range: Accessorio
inverse of: è accessorio di
version info: stable @en
version info: stabile
iccd norm tag: ICCD Normativa SM 4.00: AS/ASS/ASST

ha tipo di misura
type: ObjectProperty
comment: This property relates a measurement to its type. @en
comment: Questa proprietà collega una misura al tipo di misura (altezza, larghezza, diametro, etc.)
domain: Misura
label: has measurement type @en
range: Tipo di Misura
sub property of: hasType
inverse of: è tipo di misura
version info: stabile
version info: stable @en
iccd norm tag: ICCD Normativa Trasversale: MT/MIS/MISZ; MT/MNR - Per versioni di normativa precedenti alla 4.00: MT/MIS/MISA; MT/MIS/MISD; MT/MIS/MISL; MT/MIS/MISN; MT/MIS/MISG; MT/MIS/MISP; MT/MIS/MISS; MT/MIS/MISR; MT/MIS/MISV - ICCD scheda VeAC: MT/MII/MIIA; MT/MII/MIIL; MT/MII/MIIP; MT/MIS/MISR; MT/MIS/MISD; MT/MIS/MISS; MT/MIS/MISP; MT/MIS/MISV; MT/MIS/MISF; MT/MIS/MISO

ha tipo di bene culturale
type: ObjectProperty
comment: This property relates a cultural property to its type. @en
comment: Questa proprietà collega un bene culturale al tipo di bene, per permettere la corretta e precisa individuazione del bene.
domain: CulturalEntity
label: has cultural property type @en
range: Tipo di bene culturale
sub property of: hasType
inverse of: è tipo di bene culturale
version info: stabile
version info: stable @en
iccd norm tag: OG/OGT

ha tipo di campione prelevato
type: ObjectProperty
type: FunctionalProperty
comment: Questa proprietà collega un campione prelevato da un bene archeologico al tipo di campione (es.: intonaco, carbone, etc.)
comment: This property relates a sample collected to its type. @en
domain: Campione prelevato
label: has sample collected type @en
range: Tipo di campione prelevato
sub property of: hasType
inverse of: è tipo di campione prelevato
version info: stabile
version info: stable @en
iccd norm tag: ICCD Normativa MA, CA, SI, SAS: MC/CMN/CMNT

Comunicazione prossemica
type: Tipo di modalità comunicativa
type: NamedIndividual
label: Proxemics communication @en

Materia
type: Concetto tecnico
type: NamedIndividual
comment: This individual represents the material through which an object has been realized, e.g. a cultural entity. @en
comment: Questo individuo rappresenta la materia con cui è realizzato un oggetto, per esempio un bene culturale.
label: Material @en
version info: stable @en
version info: stabile
iccd norm tag: ICCD Normativa Trasversale 4.00: MT/MTC/MTCM; ICCD Normativa VeAC: MT/MTC/MTCF

Tipo di elemento apposto
type: Class
comment: Questa classe rappresenta il tipo (es.: gentilizio, civile, religioso, etc.) di un'iscrizione, un emblema, un timbro, uno stemma, etc.
comment: This class represents the type (i.e. civil, religious) of an inscription, emblem, postmark, crest, etc. @en
label: Affixed element type @en
subclass of: Type
subclass of: Restriction
  on property: è tipo di elemento apposto
  some values from: Elemento apposto su bene culturale
version info: stabile
version info: stable @en
iccd norm tag: ICCD Normativa Trasversale 4.00: DA/ISE/ISEE - Normative di versioni precedenti: DA/STM/STMQ

has volumetric dimensions measurement
type: ObjectProperty
comment: This property connects a collection of observed measures on an object to one of these measures, when the latter is relative to an ancient or contemporary apparel's size. The volumetric dimensions measurements determine the size for storage and can be considered as the object's orthogonal coordinates. @en
comment: Questa proprietà collega un insieme di misure osservate per un oggetto a una dell misure, quando questa sia relativa all'ingombro di un vestimento antico o contemporaneo. Le misure ingombro determinano l'ingombro per l'immagazzinaggio e si possono quindiconsiderare le coordinate ortogonali dell'oggetto.
domain: Collezione di misure
label: ha misura di imgombro
range: Misura
sub property of: ha misura
is native to: object-collection
inverse of: è misura di ingombro di
version info: stabile
version info: stable @en
iccd norm tag: Normativa VeAC: MT/MII

Area
type: Tipo di Misura
type: NamedIndividual
version info: stable @en
version info: stabile

Apparato iconografico
type: Tipo di apparato iconografico e decorativo
type: NamedIndividual
label: Iconographic apparatus @en

Lunghezza vibrante
type: Concetto tecnico
type: NamedIndividual
comment: This individual represents a musical instrument vibrating length, in particular a chordophone. @en
comment: Questo individuo rappresenta la lunghezza vibrante di uno strumento, in particolare di un cordofono.
label: Vibrating lenght @en
version info: stable @en
version info: stabile
iccd norm tag: ICCD Normativa SM 4.00: AA/AAL

è tipo di caratteri di
type: ObjectProperty
comment: Questa è la proprietà inversa a "ha tipo di caratteri".
comment: This is the inverse property of "has font style". @en
domain: Tipo di caratteri
label: is font style of @en
range: Elemento apposto su bene culturale
version info: stable @en
version info: stabile

ha collezione di misure
type: ObjectProperty
comment: Questa proprietà collega un oggetto all'insieme delle misure osservate per quell'oggetto.
comment: This property connects an object to the collection of observed measures on it. @en
domain: Thing
label: has measurement collection @en
range: Collezione di misure
inverse of: è collezione di misure di
version info: stabile
version info: stable @en
iccd norm tag: MT/MIS - Normativa VeAC: anche MT/MII e MT/MIM

Caratteristica tecnica
type: Class
comment: This class represents a characteristic of a cultural property. For example it can represent a cultural property's particular costituent material or the technique with which it was made or its shape or color. Each technical characteristic is classified by a concept (i.e. "clay" is a techical characteristic classified by the technical concept "material" related to a cultural property). For each cultural property typology can be registered some specific technical characteristics. @en
comment: Questa classe rappresenta una caratteristica tecnica relativa a un bene culturale. Per esempio, può rappresentare una particolare materia di cui è composto, la tecnica con cui è stato realizzato, la sua forma, il suo colore. Ogni caratteristica tecnica utilizza è definito da un concetto (es.: "terracotta" è una caratteristica tecnica definita dal concetto "materia", relativamente a un bene culturale). Per ogni tipologia di bene culturale possono essere rilevati e registrate caratteristiche tecnice specifiche.
label: Technical Characteristic @en
subclass of: Characteristic
subclass of: Restriction
  all values from: Stato tecnico di entità culturale
  on property: è inclusa in stato tecnico
subclass of: Restriction
  all values from: Concetto tecnico
  on property: è caratteristica tecnica classificata da
is native to: technical-characteristic
version info: stable @en
version info: stabile
iccd norm tag: ICCD Normativa Trasversale 4.00: MT/MTC/MTCM; MT/MTC/MTCT - Normativa OA, D, F, S, MI: MT/FRM - Normativa OA, D, F, S: MT/FIL - Normativa VeAC: MT/MTC/MTCC; MT/MTC/MTCF - Normativa F: MT/FVC/FVCC; MT/FVC/FVCF; MT/FVC/FVCP; MT/FVC/FVCU; MT/FVC/FVCM; MT/FVM;

è orientamento di
type: ObjectProperty
comment: This is the inverse property of "has orientation". @en
comment: Questa è la proprietà inversa di "ha orientamento".
domain: Orientamento
label: is orientation of @en
range: Thing
version info: stable @en
version info: stabile

è caratteristica tecnica classificata da
type: ObjectProperty
comment: Questa proprietà collega una caratteristica tecnica di un'entità - come un bene culturale - a un concetto tecnico, che la classifica.
comment: This property connects an entity's techincal characteristic to a technical concept, which classifies that characteristic. @en
domain: Caratteristica tecnica
label: is technical characteristic classified by @en
range: Concetto tecnico
sub property of: hasConcept
is native to: technical-characteristic
version info: stabile
version info: stable @en

Accessibile
type: Accessibilità del bene culturale
type: NamedIndividual
label: Accessible @en

Tipo di stato di conservazione
type: Class
label: Conservation Status Type @en
subclass of: Type
subclass of: Restriction
  on property: è tipo di stato di conservazione
  some values from: Stato di Conservazione
version info: stable @en
version info: stabile
iccd norm tag: CO/STC/STCC

Larghezza
type: Tipo di Misura
type: NamedIndividual
label: Width @en
version info: stable @en
version info: stabile

Capacità
type: Tipo di Misura
type: NamedIndividual
label: Capacity @en
version info: stable @en
version info: stabile

Misura
type: Class
comment: Questa classe rappresenta una misura osservata per un oggetto. Le misure sono relative alle dimensioni del bene in esame. Per la normativa F, le misure possono essere relative anche a supporti secondari, custodie, cornici, singoli fotogrammi, ecc. Per la normativa VeAC, le misure possono essere relative all'ingombro per l'immagazzinaggio; alla base (individuano l'oggetto e la conformazione fisica del proprietario e sono fondamentali per l'allestimento museale, per individuare i tipi di supporti necessari per l'esposizione); alle maniche.
comment: This class represents a measurement of an object. Measurements realte to the cultural property's dimensions. @en
label: Measurement @en
subclass of: Situation
subclass of: Restriction
  on property: ha valore
  some values from: Value
subclass of: Restriction
  on property: ha tipo di misura
  some values from: Tipo di Misura
subclass of: Restriction
  on property: è misura in collezione
  some values from: Collezione di misure
description: Un esempio d'uso della classe "Misura" è il seguente: resource:Measurement/0500212021-1-height a dd:Measurement ; rdfs:label "Misura del bene culturale 0500212021: 795mm."@it ; dd:hasMeasurementType dd:Height ; dd:hasValue resource:Value/0500212021-1-height-795 .
description: An example of usage of the class 'Measurement' is the following: resource:Measurement/0500212021-1-height a dd:Measurement ; rdfs:label "Measurement of cultural property 0500212021: 795mm."@en ; dd:hasMeasurementType dd:Height ; dd:hasValue resource:Value/0500212021-1-height-795 . @en
version info: stable @en
version info: stabile
iccd norm tag: MT/MIS

è tipo di campione prelevato
type: ObjectProperty
comment: This is the inverse property of "has sample collected type". @en
comment: Questa è la proprietà inversa di "ha tipo di campione prelevato".
domain: Tipo di campione prelevato
label: is sample collected type of @en
range: Campione prelevato
sub property of: isTypeOf
version info: stable @en
version info: stabile

Leggibilità totale
type: Leggibilità
type: NamedIndividual
label: Complete legibility @en

ha materia
type: ObjectProperty
comment: This property relates an object to its material. @en
comment: Questa proprietà collega un oggetto (per esempio un bene culturale) alla materia con cui è realizzato.
domain: Thing
label: has material @en
range: Caratteristica tecnica
sub property of: ha materia e tecnica
inverse of: è materia di
version info: stable @en
version info: stabile

è scopo funzionale di
type: ObjectProperty
comment: This is the inverse property of "has functional purpose". @en
comment: Questa è la proprietà inversa di "ha scopo funzionale".
domain: Scopo funzionale
label: is functional purpose of @en
range: Thing
sub property of: isCharacteristicOf
version info: stable @en
version info: stabile

Tipo di bene culturale
type: Class
comment: Questa classe rappresenta il tipo di bene culturale, cioè il termine o la locuzione che individua il bene che si sta catalogando ed eventuali ulteriori specifiche sulla definizione del bene.
comment: This class represents a cultural property's type, that is the term or expression which specifies the cultural propery that is being catalogued and additional information on the cultural property's definition. @en
label: Cultural property Type @en
subclass of: Type
subclass of: Restriction
  on property: è tipo di bene culturale
  some values from: CulturalEntity
subclass of: Restriction
  all values from: Specifiche del bene culturale
  on property: ha specifiche del bene culturale
subclass of: Restriction
  on property: ha definizione del bene culturale
  some values from: Definizione del bene culturale
version info: stable @en
version info: stabile
iccd norm tag: OG/OGT

Inaccessibile
type: Accessibilità del bene culturale
type: NamedIndividual
label: Inaccessible @en

Descrizione tecnica di entità culturale
type: Class
comment: This class represents the technical description of a cultural entity, which uses all the technical concepts classifying the technical characteristics that a cultural entity can have. This class is a particular type of the class Description, which is the class for socially constructed objects (i.e. texts, values, categories, relations, contexts) used to describe other objects in a structured manner. @en
comment: Questa classe rappresenta la descrizione tecnica di un'entità culturale, la quale utilizza tutti i concetti tecnici che possono classificare caratteristiche tecniche possedute da un'entità culturale. Questa classe è un tipo particolare di Description, la classe degli oggetti costruiti socialmente (testi, valori, categorie, relazioni, contesti), usati per descrivere qualcos'altro in modo strutturato.
label: Cultural entity technical description @en
subclass of: Description
subclass of: Restriction
  all values from: Concetto tecnico
  on property: usa concetto tecnico
subclass of: Restriction
  all values from: Stato tecnico di entità culturale
  on property: è descrizione di entità culturale soddisfatta da
version info: stabile
version info: stable @en

Formato di compressione/estensione file
type: Concetto tecnico
type: NamedIndividual
comment: This individual represents the format used to write a digital resource on a data medium. @en
comment: Questo individuo rappresenta il formato utilizzato per la scrittura di una risorsa digitale su supporto informatico.
label: File Format @en
version info: stable @en
version info: stabile
iccd norm tag: ICCD Normativa F: MT/FVC/FVCF

è elemento apposto su
type: ObjectProperty
comment: This is the inverse property of "has affixed element". @en
comment: Questa è la proprietà inversa a "ha elemento affisso".
domain: Elemento apposto su bene culturale
label: is element affixed on @en
range: CulturalEntity
version info: stabile
version info: stable @en

Dimensioni in pixel
type: Concetto tecnico
type: NamedIndividual
comment: This individual represents a digital photograph size in pixels. @en
comment: Questo individuo rappresenta le dimensioni, in pixel, di una fotografia digitale.
label: Pixel dimension @en
version info: stable @en
version info: stabile
iccd norm tag: ICCD Normativa F: MT/FVC/FVCM

ha lunghezza vibrante
type: ObjectProperty
comment: This property relates a musical instrument to its vibrating length, in particular a chordophone. @en
comment: Questa proprietà collega un uno strumento alla lunghezza vibrante dello strumento, in particolare di un cordofono.
domain: Thing
label: has vibrating lenght @en
range: Caratteristica tecnica
sub property of: ha caratteristica tecnica
inverse of: è lunghezza vibrante di
version info: stabile
version info: stable @en

Corista
type: Concetto tecnico
type: NamedIndividual
comment: This individual represents the identified diapason (note, temperature and eventually humidity during the detection). @en
comment: Questo individuo rappresenta il corista rilevato (nota, temperatura ed eventualmente umidità ambientale al momento della rilevazione).
label: Diapason @en
version info: stable @en
version info: stabile
iccd norm tag: ICCD Normativa SM 4.00: AA/AAC

Tipo di apparato iconografico e decorativo
type: Class
comment: Questa classe rappresenta il tipo (iconografico, decorativo, iconografico-decorativo) di apparato iconografico e decorativo di un bene culturale.
comment: This class represents the iconographic or decorative apparatus' type (iconographic, decorative, iconographic-decorative) of a cultual property. @en
label: Iconographic Or Decorative Apparatus Type @en
subclass of: Type
subclass of: Restriction
  on property: è tipo di apparato iconografico e decorativo
  some values from: Apparato iconografico e decorativo
version info: stable @en
version info: stabile
iccd norm tag: ICCD Normativa Trasversale 4.00: DA/AID/AIDO

usa concetto tecnico
type: ObjectProperty
comment: Questa proprietà collega una descrizione tecnica di un bene culturale a uno dei concetti usati in quella descrizione.
comment: This property relates a technical description of a cultural property to one of the concepts used in that description. @en
domain: Descrizione tecnica di entità culturale
label: uses technical concept @en
range: Concetto tecnico
version info: stable @en
version info: stabile

si riferisce ad agente
type: ObjectProperty
comment: This property connects a crest, emblem, postmark etc., located on a cultural entity to the agent (e.g. family, factory, cave, silversmith) to which it refers. @en
comment: Questa proprietà collega un uno stemma, un emblema, un timbro, etc., presente su un bene culturale, all'agente (la famiglia, la fabbrica, la cava, l'argentiere, etc.) a cui si riferisce l'elemento.
domain: Elemento apposto su bene culturale
label: refers to agent @en
range: Agent
version info: stabile
version info: stable @en
iccd norm tag: ICCD Normativa Trasversale 4.00: DA/ISE/ISES - Normative di versioni precedenti: DA/STM/STMI

Modalità comunicativa
type: Class
comment: Questa classe rappresenta la modalità comunicativa di un oggetto, definita dal tipo di modalità (es.: verbale, scritta, strumentale), la modalità esecutiva, il numero di voci e strumenti coinvolti, etc.
comment: This class represents the communication medium of an object, defined by the communication medium type (e.g.: verbal, written, instrumental), the implementation method, the number of voices or instruments involved, etc. @en
label: Communication medium @en
subclass of: CulturalEntityCharacteristic
subclass of: Restriction
  all values from: integer
  on property: numero di partecipanti infantili
subclass of: Restriction
  all values from: integer
  on property: numero di partecipanti femminili
subclass of: Restriction
  on property: ha tipo di modalità comunicativa
  some values from: Tipo di modalità comunicativa
subclass of: Restriction
  all values from: Modalità esecutiva
  on property: ha modalità esecutiva
subclass of: Restriction
  all values from: integer
  on property: numero di partecipanti maschili
subclass of: Restriction
  on property: è modalità comunicativa
  some values from: CulturalEntity
subclass of: Restriction
  all values from: Fascia d'età
  on property: coinvolge fascia d'età
version info: stable @en
version info: stabile
iccd norm tag: ICCD Normativa BDI: CU

Lunghezza totale parte posteriore
type: Tipo di Misura
type: NamedIndividual
label: Back total length @en
version info: stable @en
version info: stabile

Comunicazione cinesica
type: Tipo di modalità comunicativa
type: NamedIndividual
label: Kinesic communication @en

Formato
type: Concetto tecnico
type: NamedIndividual
comment: This individual represents an object's shape. It is used for bidimensional objects, e.g. octagonal or round shape. @en
comment: Questo individuo rappresenta la forma di un oggetto, per oggetti bidimensionali (es.: ottagonale, tondo)
label: Shape @en
version info: stable @en
version info: stabile
iccd norm tag: ICCD Normative OA, D, S, MI: MT/FRM

Tipo di modalità comunicativa
type: Class
comment: Questa classe rappresenta il tipo di modalità comunicativa.
comment: This class represents the type of communication medium. @en
label: Communication medium type @en
subclass of: Type
subclass of: Restriction
  on property: è tipo di modalità comunicativa
  some values from: Modalità comunicativa
version info: stabile
version info: stable @en
iccd norm tag: ICCD Normativa BDI: CU

Tipo di campione prelevato
type: Class
comment: This class represents the sample type collected from an archaeologiacal property (i.e. coal, pottery, grout) @en
comment: Questa classe rappresenta il tipo di campione prelevato da un bene archeologico (es.: carbone, ceramica, intonaco, etc.)
label: Sample collected type @en
subclass of: Type
subclass of: Restriction
  on property: è tipo di campione prelevato
  some values from: Campione prelevato
version info: stabile
version info: stable @en
iccd norm tag: ICCD Normativa MA, CA, SI, SAS: MC/CMN/CMNT

Motivo decorativo
type: Class
comment: This class represents the ornamental motif (anthropomorphous, zoomorphic, geometric) represented by a cultural property's iconographic and decorative apparatus. @en
comment: Questa classe rappresenta il motivo decorativo (antropomorfo, zoomorfo, geometrico) rappresentato da un apparato iconografico e decorativo di un bene culturale.
label: Ornamental Motif @en
subclass of: Concept
subclass of: Restriction
  on property: è motivo decorativo di
  some values from: Apparato iconografico e decorativo
version info: stabile
version info: stable @en

ha apparato iconografico e decorativo
type: ObjectProperty
comment: Questa proprietà collega un bene culturale al suo apparato iconografico e/o decorativo, inteso come l'insieme, che può essere più o meno complesso, delle rappresentazioni iconografiche e/o delle decorazioni presenti sul bene.
comment: This property relates a cultural enitity to its iconographic or decorative apparatus. @en
domain: CulturalEntity
label: has iconographic or decorative apparatus @en
range: Apparato iconografico e decorativo
sub property of: hasDescription
inverse of: è apparato iconografico e decorativo di
version info: stable @en
version info: stabile
iccd norm tag: ICCD Normativa Trasversale 4.00: DA/AID - ICCD Normative PST e BDM: DA/APF

ha corista
type: ObjectProperty
comment: Questa proprietà collega uno strumento musical al corista rilevato (nota, temperatura ed eventualmente umidità ambientale al momento della rilevazione).
comment: This property relates a musical instrument to the identified diapason (note, temperature and eventually humidity during the detection). @en
domain: Thing
label: has diapason @en
range: Caratteristica tecnica
sub property of: ha caratteristica tecnica
inverse of: è corista di
version info: stable @en
version info: stabile

Lunghezza totale parte anteriore
type: Tipo di Misura
type: NamedIndividual
label: Front total length @en
version info: stable @en
version info: stabile

è tipo di stato di conservazione
type: ObjectProperty
comment: This is the inverse property of "has conservation status type". @en
comment: Questa è la proprietà inversa di "ha tipo di stato di conservazione".
domain: Tipo di stato di conservazione
label: is conservation status type of @en
range: Stato di Conservazione
sub property of: isTypeOf
version info: stabile
version info: stable @en

Tipo di denominazione
type: Class
comment: Questa classe rappresenta il tipo di denominazione o dedicazione o, per la normativa FF, titolo, del bene (altra lingua, attribuita, attuale, dialettale, etc.)
comment: This class represents a cultural property's denomination or dedication type, or its title (i.e. other language, current, attributed, dialectal). @en
label: Designation Type @en
subclass of: Type
subclass of: Restriction
  on property: è tipo di denominazione
  some values from: Denominazione nel tempo
version info: stabile
version info: stable @en
iccd norm tag: ICCD Normativa Trasversale 4.00: OG/OGD/OGDT - Normative A, BDM, PG 3: OGA/OGAG.

ha dimensioni in pixel
type: ObjectProperty
comment: Questa proprietà collega un'immagine digitale (es.: fotografia) alle dimensioni, in pixel, dell'immagine.
comment: This property relates a digital resource to its size in pixels. @en
domain: Thing
label: has pixel dimension @en
range: Caratteristica tecnica
sub property of: ha caratteristica tecnica
inverse of: è dimensione in pixel di
version info: stable @en
version info: stabile

ha misura
type: ObjectProperty
comment: Questa proprietà collega un insieme di misure osservate per un oggetto a una delle misure.
comment: This property connects a set of observed measures on an object to one of those measures. @en
domain: Collezione di misure
label: has measurement @en
range: Misura
is native to: object-collection
inverse of: è misura in collezione
version info: stabile
version info: stable @en
iccd norm tag: MT/MIS - Normativa VeAC: anche MT/MIM

Leggibilità decente
type: Leggibilità
type: NamedIndividual
label: Decent Legibility @en

Specifiche del bene culturale
type: Class
comment: Questa classe rappresenta specifiche morfologiche o funzionali, utili a completare la definizione del bene per una sua più puntuale individuazione.
comment: This class represents the morphological or functional specification, which are useful to define a cultural property for a more precise individuation. @en
label: Cultural Property Specification @en
subclass of: Description
subclass of: Restriction
  on property: sono specifiche del bene culturale
  some values from: Tipo di bene culturale
version info: stable @en
version info: stabile
iccd norm tag: OG/OGT/OGTT

ha specifiche del bene culturale
type: ObjectProperty
comment: This property relates a cultural entity's typology to its components, i.e. morphological and functional specifications. @en
comment: Questa proprietà collega la tipologia di un bene culturale a una delle sue componenti, cioè alle specifiche morfologiche e funzionali.
domain: Tipo di bene culturale
label: has cultural property specification @en
range: Specifiche del bene culturale
inverse of: sono specifiche del bene culturale
version info: stabile
version info: stable @en
iccd norm tag: OG/OGT/OGTT

è valore di
type: ObjectProperty
comment: Questa è la proprietà inversa di "ha valore".
comment: This is the inverse property of "has value". @en
domain: Value
label: is value of @en
range: Misura
version info: stable @en
version info: stabile

ha motivo decorativo
type: ObjectProperty
comment: Questa proprietà collega l'apparato iconografico e decorativo di un bene culturale al motivo decorativo (antropomorfo, zoomorfo, geometrico) rappresentato.
comment: This property connects a cultural entity's iconographic or decorative apparatus to its ornamental motif (anthropomorphic, zoomorphic, geometric). @en
domain: Apparato iconografico e decorativo
label: has ornamental motif @en
range: Motivo decorativo
inverse of: è motivo decorativo di

Circonferenza
type: Tipo di Misura
type: NamedIndividual
label: Circumference @en
version info: stable @en
version info: stabile

Profondità / Altezza
type: Tipo di Misura
type: NamedIndividual
label: Depth / Height @en
version info: stable @en
version info: stabile

Metodo di memorizzazione e profondità di colore
type: Concetto tecnico
type: NamedIndividual
comment: This individual represents the method and color depth through which a digital photograph has been stored. @en
comment: Questo individuo rappresenta il metodo e la profondità di colore con cui è stata memorizzata la fotografia digitale.
label: Storage method and colour depth @en
version info: stable @en
version info: stabile
iccd norm tag: ICCD Normativa F: MT/FVC/FVCC

Timbro
type: Class
comment: Questa classe rappresenta il segno impresso con un timbro, ovvero uno strumento di gomma o di metallo per imprimere segni a inchiostro oppure a secco.
label: Stamp @en
subclass of: Elemento apposto su bene culturale
version info: stable @en
version info: stabile
iccd norm tag: ICCD Normativa Trasversale 4.00: se DA/ISE/ISED = 'timbro' - ICCD versioni precedenti: DA/STM/STMC = 'timbro' - ICCD Normativa A: LI/LSI/LSIG = 'timbro'

è analisi del vestimento
type: ObjectProperty
comment: Questa è la proprietà inversa di "ha analisi del vestimento".
comment: This is the inverse property of "has garment analysis". @en
domain: Caratteristica tecnica
label: is garment analysis of @en
range: Thing
sub property of: è caratteristica tecnica di
version info: stabile
version info: stable @en

ha tipo di denominazione
type: ObjectProperty
comment: This property relates a cultural entity designation to its type. @en
domain: Denominazione nel tempo
label: has designation type @en
range: Tipo di denominazione
sub property of: hasType
inverse of: è tipo di denominazione
version info: stabile
version info: Questa proprietà collega una denominazione o dedicazione o, per la normativa FF, titolo nel tempo al tipo di denominazione del bene (altra lingua, attribuita, attuale, dialettale, etc.)
version info: stable @en
iccd norm tag: ICCD Normativa Trasversale 4.00: OG/OGD/OGDT

coinvolge fascia d'età
type: ObjectProperty
comment: Questa proprietà collega una modalità comunicativa (prossemica, cinesica) alla fascia d'età delle persone che attuano la comunicazione.
comment: This property relates a communication medium (proxemics, kinesic) to the age range of the participants to the communication. @en
domain: Modalità comunicativa
label: involves age range @en
range: Fascia d'età
inverse of: è fascia d'età coinvolta in
version info: stable @en
version info: stabile
iccd norm tag: ICCD Normativa BDI: CU/CUC/CUCE; CU/CUP/CUPE

è sistema di scrittura di
type: ObjectProperty
comment: Questa è la proprietà inversa di "ha sistema di scrittura".
comment: This is the inverse property of "has writing system". @en
domain: Sistema di scrittura
label: is writing system of @en
range: Elemento apposto su bene culturale
version info: stable @en
version info: stabile

è apparato iconografico e decorativo di
type: ObjectProperty
comment: This is the inverse property of "has iconographic or decorative apparatus". @en
comment: Questa è la proprietà inversa di "ha apparato iconografico e decorativo".
domain: Apparato iconografico e decorativo
label: is iconographic or decorative apparatus of @en
range: CulturalEntity
version info: stabile
version info: stable @en

è estensione di
type: ObjectProperty
comment: This is the inverse property of "has extension". @en
comment: Questa è la proprietà inversa di "ha estensione".
domain: Caratteristica tecnica
label: is extension of @en
range: Thing
sub property of: è caratteristica tecnica di
version info: stable @en
version info: stabile

traduzione italiana
type: DatatypeProperty
comment: Questa proprietà rappresenta la traduzione italiana della trascrizione di un testo contenuto in un'iscrizione, un'emblema, etc.
comment: This property represents the italian translation of a text transcription contained in an inscription, emblem etc. @en
domain: Elemento apposto su bene culturale
label: italian translation @en
range: Literal
version info: stabile
version info: stable @en
iccd norm tag: ICCD Normativa Trasversale 4.00: DA/ISE/ISEB

è tipo di modalità comunicativa
type: ObjectProperty
comment: Questa è la proprietà inversa di "ha tipo di modalità comunicativa".
comment: This is the inverse property of "has communication medium type". @en
domain: Tipo di modalità comunicativa
label: is communication medium type of @en
range: Modalità comunicativa
sub property of: isTypeOf
version info: stable @en
version info: stabile

Potenza
type: Tipo di Misura
type: NamedIndividual
label: Power @en
version info: stable @en
version info: stabile

è supporto di
type: ObjectProperty
comment: This property connects a support (e.g. "paper label") to an element (stamp, embelem, inscription, mark) which has been represented on it. It is the inverse property of hasSupport. @en
comment: Questa proprietà, inversa di "ha supporto", collega un supporto (es.: "etichetta di carta") all'elemento (timbro, emblema, iscrizione, marchio) che vi viene rappresentato.
domain: Supporto
label: is support of @en
range: Elemento apposto su bene culturale
version info: stable @en
version info: stabile
iccd norm tag: ICCD Normativa Trasversale 4.00: DA/ISE/ISES

Note produbicili
type: Concetto tecnico
type: NamedIndividual
comment: This individual represents playable notes by a musical instrument, from low to high. @en
comment: Questo individuo rappresenta le note producibili da uno strumento musicale, dal grave all'acuto.
label: Available notes @en
version info: stable @en
version info: stabile
iccd norm tag: ICCD Normativa SM 4.00: AA/AAN

ha materia e tecnica
type: ObjectProperty
comment: This property relates an object to the material or technique through which an object has been realized, e.g. a cultural entity. In ICCD standards for cataloguing cultural entities, this label is necessary when material and technique are registered in the same field. @en
comment: Questa proprietà collega un oggetto alla materia e/o la tecnica con cui è realizzato l'oggetto, per esempio un bene culturale. Nel dominio delle normative ICCD per la catalogazione dei beni culturali, si rende necessaria nei casi in cui materia e tecnica sono registrate nello stesso campo, nella forma "materia/ tecnica".
domain: Thing
label: has material or technique @en
range: Caratteristica tecnica
sub property of: ha caratteristica tecnica
inverse of: è materia e tecnica di
version info: stable @en
version info: stabile

ha livello di qualità
type: ObjectProperty
comment: This property relates a digital resource to its quality level, e.g. high-resolution, low-resolution, preview. @en
comment: Questa proprietà collega una risorsa digitale al livello di qualità della risorsa (es.: alta risoluzione, bassa risoluzione, preview)
domain: Thing
label: has quality level @en
range: Caratteristica tecnica
sub property of: ha caratteristica tecnica
inverse of: è livello di qualità di
version info: stable @en
version info: stabile

classifica caratteristica tecnica
type: ObjectProperty
comment: Questa proprietà, inversa a "è caratteristica classificata da", collega un concetto tecnico a una caratteristica tecnica di un'entità - come un bene culturale.
comment: This property connects a techical concept to an entity's technical characteristic. It is the inverse property of isCharacteristicClassifiedBy. @en
domain: Concetto tecnico
label: classifies technical characteristic @en
range: Caratteristica tecnica
sub property of: isConceptOf
is native to: technical-characteristic
inverse of: è caratteristica tecnica classificata da
version info: stable @en
version info: stabile

è livello di qualità di
type: ObjectProperty
comment: Questa è la proprietà inversa di "ha livello di qualità"
comment: This is the inverse property of "has quality level" @en
domain: Caratteristica tecnica
label: is quality level of @en
range: Thing
sub property of: è caratteristica tecnica di
version info: stabile
version info: stable @en

ha scopo funzionale
type: ObjectProperty
comment: Questa proprietà collega un oggetto (es bene culturale, apparato iconografico/decorativo o elemento apposto su un bene culturale come un'iscrizione) al suo scopo funzionale (decorativo, religioso, simbolico, magico-offensivo, etc.), inteso come funzione che deve svolgere.
comment: This property realtes an object (e.g. cultural entity, iconographic/decorative apparatus, affixed element like an inscription) to its functional purpose, intended as the function the object has to perform (decorative, religious, symbolic, magic-offensive etc.). @en
domain: Thing
label: has functional purpose @en
range: Scopo funzionale
sub property of: hasCharacteristic
inverse of: è scopo funzionale di
version info: stable @en
version info: stabile
iccd norm tag: ICCD Normativa Trasversale: DA/ISE/ISEC - Normative di versioni precedenti: DA/ISR/ISRC; DA/APF/APFF

è materia di
type: ObjectProperty
comment: This is the inverse property of "has material" @en
comment: Questa è la proprietà inversa di "ha materia e tecnica"
domain: Caratteristica tecnica
label: is material of @en
range: Thing
sub property of: è materia e tecnica di
version info: stable @en
version info: stabile

Estensione
type: Concetto tecnico
type: NamedIndividual
comment: This individual represents a musical instrument's musical extension. @en
comment: Questo individuo rappresenta l'estensione musicale di uno strumento musicale.
label: Extension @en
version info: stable @en
version info: stabile
iccd norm tag: ICCD Normativa SM 4.00: AA/AAE

soddisfa descrizione tecnica
type: ObjectProperty
comment: This property relates a technical status (intended as a situaiton) of a cultural entity to the technical description satisfied by that situation. @en
domain: Stato tecnico di entità culturale
label: satisfies technical description @en
range: Descrizione tecnica di entità culturale
version info: stable @en
version info: stabile

è dedicatario di
type: ObjectProperty
comment: This is the inverse property of "has dedicatee". @en
comment: Questa è la proprietà inversa a "ha dedicatario".
domain: Agent
label: is dedicatee of @en
range: Dedica
version info: stabile
version info: stable @en

Apparato iconografico e decorativo
type: Class
comment: This class represents the iconographic or decorative apparaturs of a cultural property. It is intended as the more or less complex set of iconographic or decorative representations on the cultural property. @en
comment: Questa classe rappresenta l'apparato iconografico e/o decorativo di un bene culturale, inteso come l'insieme, che può essere più o meno complesso, delle rappresentazioni iconografiche e/o delle decorazioni presenti sul bene.
label: Iconographic or Decorative Apparatus @en
subclass of: Description
subclass of: Restriction
  on property: ha tipo di apparato iconografico e decorativo
  some values from: Tipo di apparato iconografico e decorativo
subclass of: Restriction
  all values from: Scopo funzionale
  on property: ha scopo funzionale
subclass of: Restriction
  on property: è apparato iconografico e decorativo di
  some values from: CulturalEntity
subclass of: Restriction
  all values from: Motivo decorativo
  on property: ha motivo decorativo
version info: stabile
version info: stable @en
iccd norm tag: ICCD Normativa Trasversale 4.00: DA/AID - ICCD Normative PST e BDM: DA/APF

Area coperta
type: Tipo di Misura
type: NamedIndividual
label: Covered area @en
version info: stable @en
version info: stabile

morfologia di reperto antropologico
type: DatatypeProperty
type: FunctionalProperty
comment: Questa proprietà rappresenta la morfologia di un reperto antropologico (es.: morfologia naturale; morfologia alterata intra-vitam per cause naturali e/o per intervento antropico; morfologia/ struttura alterata post-mortem per cause naturali).
comment: This property represents the morphology of an anthropological material. @en
domain: CulturalEntity
label: anthropological material morphology @en
range: Literal
version info: stable @en
version info: stabile
iccd norm tag: ICCD Normativa AT 3.01: OG/OGT/OGTM

ha designazione nel tempo
type: ObjectProperty
comment: This property connects a cultural entity to its denomination and/or dedication, or title (for FF legislation) over time. @en
comment: Questa proprietà associa un bene culturale alla sua denominazione e/o dedicazione o, per la normativa FF, titolo, nel corso del tempo.
domain: CulturalEntity
label: has designation in time @en
range: Denominazione nel tempo
sub property of: hasSituation
inverse of: è denominazione nel tempo di
version info: stable @en
version info: stabile
iccd norm tag: ICCD Normativa Trasversale 4.00: OG/OGD

Perimetro
type: Tipo di Misura
type: NamedIndividual
label: Perimeter @en
version info: stable @en
version info: stabile

è stato di conservazione di
type: ObjectProperty
comment: Questa proprietà collega uno stato di conservazione al bene culturale che si trova in quello stato.
comment: This property relates a conservation status of a cultural property to that cultural property. @en
domain: Stato di Conservazione
label: is conservation status of @en
range: CulturalEntity
sub property of: isSituationOf
version info: stabile
version info: stable @en

Colore del vestimento
type: Concetto tecnico
type: NamedIndividual
comment: This individual represents the dominant color of a ancient and contemporary garment, usually it is base fabric's color, or the interlaced decoration's color. @en
comment: Questo individuo rappresenta il colore dominante, di solito quello del fondo del tessuto, o quello risultante dall'intreccio, di un vestimento antico o contemporaneoi.
label: Garment colour @en
version info: stable @en
version info: stabile
iccd norm tag: ICCD Normativa VeAC: MT/MTC/MTCC

è tipo di bene culturale
type: ObjectProperty
comment: This is the inverse property of "has cultural property type". @en
comment: Questa è la proprietà inversa di "ha tipo di bene culturale".
domain: CulturalEntity
label: is cultural property type of @en
range: Tipo di bene culturale
sub property of: isTypeOf
version info: stabile
version info: stable @en

Denominazione attuale
type: Tipo di denominazione
type: NamedIndividual
comment: This individual represents the current designation. @en
comment: Questo individuo rappresenta la denominazione attuale.
label: Current designation @en
version info: stable @en
version info: stabile
iccd norm tag: ICCD Normativa Trasversale: OGD/OGDT - Normativa A 3: OGA/OGAG.

ha colore del vestimento
type: ObjectProperty
comment: This property relates an ancient and contemporary garment to its dominant color, usually it is base fabric's color, or the interlaced decoration's color. @en
comment: Questa proprietà collega un vestimento antico o contemporaneo al colore dominante, di solito quello del fondo del tessuto, o quello risultante dall'intreccio.
domain: Thing
label: has garment colour @en
range: Caratteristica tecnica
sub property of: ha caratteristica tecnica
inverse of: è colore del vestimento
version info: stable @en
version info: stabile

Definizione del bene culturale
type: Class
comment: This class represents the definition of a cultural property. It is the term or expression which identifies the property that is being catalogued. @en
comment: Questa classe rappresenta la definizione di un bene culturale, cioè il termine o la locuzione che individua il bene che si sta catalogando.
label: Cultural Property Definition @en
subclass of: Description
subclass of: Restriction
  on property: è definizione di bene culturale
  some values from: Tipo di bene culturale
version info: stabile
version info: stable @en
iccd norm tag: OG/OGT/OGTD

è accessibilità di bene culturale
type: ObjectProperty
comment: Questa è la proprietà inversa di "ha accessibilità".
comment: This is the inverse property of "has cultural property accessibility". @en
domain: Accessibilità del bene culturale
label: is cultural property accessibility of @en
range: CulturalEntity
sub property of: isCulturalEntityCharacteristicOf
version info: stable @en
version info: stabile

Larghezza dorso
type: Tipo di Misura
type: NamedIndividual
label: Back Width @en
version info: stable @en
version info: stabile

ha note producibili
type: ObjectProperty
comment: Questa proprietà collega uno strumento musicale, dal grave all'acuto, alle note producibili dallo strumento.
comment: This property relates a musical instrument to the playable notes by it, from low to high. @en
domain: Thing
label: has available notes @en
range: Caratteristica tecnica
sub property of: ha caratteristica tecnica
version info: stabile
version info: stable @en

è localizzazione rappresentata da
type: ObjectProperty
comment: This is the inverse property of "has location subject". @en
comment: Questa è la proprietà inversa di "ha localizzazione rappresentata".
domain: TimeIndexedTypedLocation
label: is location subject of @en
range: CulturalEntity
version info: stable @en
version info: stabile

Circonferenza petto
type: Tipo di Misura
type: NamedIndividual
label: Chest Circumference @en
version info: stable @en
version info: stabile

numero di partecipanti maschili
type: DatatypeProperty
type: FunctionalProperty
comment: Questa proprietà rappresenta il numero delle persone di sesso maschile che attuano una comunicazione (verbale, musicale vocale, cinesica)
comment: This property represents the number of the male participants to a communication (verbal, singing, kinesic). @en
domain: Modalità comunicativa
label: number of male participants @en
range: integer
version info: stabile
version info: stable @en
iccd norm tag: ICCD Normativa BDI: CU/CUV/CUVM; CU/CUM/CUMM; CU/CUC/CUCM

Capacità di memoria
type: Tipo di Misura
type: NamedIndividual
label: Storage capacity @en
version info: stable @en
version info: stabile

modalità di conservazione
type: DatatypeProperty
comment: Questa proprietà rappresenta informazioni sulle condizioni ambientali e microclimatiche in cui si trova il bene al momento della catalogazione ed eventuali indicazioni per una sua corretta conservazione.
comment: This property represents informations about the storage conditions of a cultural property. @en
domain: CulturalEntity
label: storage conditions @en
range: Literal
version info: stabile
version info: stable @en
iccd norm tag: CO/STD

è denominazione nel tempo di
type: ObjectProperty
comment: Questa è la proprietà inversa di "ha designazione nel tempo".
comment: This is the inverse property of "has designation in time". @en
domain: Denominazione nel tempo
label: is designation in time of @en
range: CulturalEntity
sub property of: isSituationOf
version info: stable @en
version info: stabile

è intervallo di tempo valido per
type: ObjectProperty
comment: Questa proprietà collega un intervallo temporale entro il quale è valido uno stato tecnico di un'entità culturale allo stato tecnico stesso, relativamente al momento in cui quelle caratteristiche sono state rilevate.
comment: This property relates the time interval, at which a cultural entity technical status is valid, to that technical status, with regard to the moment in which the characteristics are observed. @en
domain: TimeInterval
label: is time interval valid for @en
range: Stato tecnico di entità culturale
version info: stable @en
version info: stabile

Materia o tecnica
type: Concetto tecnico
type: NamedIndividual
comment: This individual represents the material or technique through which an object has been realized, e.g. a cultural entity. In ICCD standard for cataloguing cultural entities, this label is necessary when material and techinque are registered in the same field. @en
comment: Questo individuo rappresenta la materia e/o la tecnica con cui è realizzato un oggetto, per esempio un bene culturale. Nel dominio delle normative ICCD per la catalogazione dei beni culturali, si rende necessario nei casi in cui materia e tecnica sono registrate nello stesso campo, nella forma "materia/ tecnica".
label: Material or Technique @en
version info: stable @en
version info: stabile
iccd norm tag: MT/MTC (come campo semplice)

è modalità esecutiva di
type: ObjectProperty
comment: This is the inverse property of "has implementation method". @en
comment: Questa è la proprietà inversa di "ha modalità esecutiva".
domain: Modalità esecutiva
label: is implementation method of @en
range: Modalità comunicativa
version info: stabile
version info: stable @en

Dimensioni della foto (Formato)
type: Concetto tecnico
type: NamedIndividual
comment: This individual represents a digital photograph format, intended as the photogrphic material's standardised size (e.g. negative, positives). @en
comment: Questo individuo rappresenta il formato di una fotografia digitale, inteso come la dimensione standardizzata dei materiali fotografici (negativi, positivi, ecc.).
label: Photo size @en
version info: stable @en
version info: stabile
iccd norm tag: ICCD Normativa F: MT/FRM

ha caratteristica tecnica
type: ObjectProperty
comment: This property relates an entity to a technical characteristic (e.g. material, technique, colour, quality level). @en
comment: Questa proprietà collega un'entità a una caratteristica tecnica (es.: materia, tecnica, colore, livello di qualità, formato).
domain: Thing
label: has technical characteristic @en
range: Caratteristica tecnica
inverse of: è caratteristica tecnica di
property chain axiom: ha stato tecnico
property chain axiom: include caratteristica tecnica
version info: stable @en
version info: stabile

è materia e tecnica di
type: ObjectProperty
comment: This is the inverse property of "has material or technique" @en
comment: Questa è la proprietà inversa di "ha materia e tecnica"
domain: Caratteristica tecnica
label: is material or technique of @en
range: Thing
sub property of: è caratteristica tecnica di
version info: stable @en
version info: stabile

ha temperamento
type: ObjectProperty
comment: Questa proprietà collega uno strumento al temperamento adottato, soprattutto in caso di oggetto in condizioni originali, o dopo un restauro, dello strumento musicale. Per gli idiofoni a tasti fissi (come xilofoni, litofoni, metallofoni) rappresenta la successione degli intervalli.
comment: This property relates a musical instrument to the adopted temperament, especially in relation to an object in its original conditions, or after its restoration. For idiophones with fixed keys (e.g. xylophone, litophone, metallophone) the temperament represents the succession of intervals. @en
domain: Thing
label: has temperament @en
range: Caratteristica tecnica
sub property of: ha caratteristica tecnica
inverse of: è temperamento di
version info: stabile
version info: stable @en

è memoria di massa di
type: ObjectProperty
comment: This is the inverse property of "has mass storage". @en
comment: Questa è la proprietà inversa di "ha memoria di massa".
domain: Caratteristica tecnica
label: is mass storage of @en
range: Thing
sub property of: è caratteristica tecnica di
version info: stable @en
version info: stabile

è forma di
type: ObjectProperty
comment: This is the inverse property of "has shape" @en
comment: Questa è la proprietà inversa di "ha forma"
domain: Caratteristica tecnica
label: is shape of @en
range: Thing
sub property of: è caratteristica tecnica di
version info: stabile
version info: stable @en

è motivo decorativo di
type: ObjectProperty
comment: This is the inverse property of "has ornamental motif". @en
comment: Questa è la proprietà inversa di "ha motivo decorativo".
domain: Motivo decorativo
label: is ornamental motif of @en
range: Apparato iconografico e decorativo
version info: stable @en
version info: stabile

è tipo di apparato iconografico e decorativo
type: ObjectProperty
comment: Questa è la proprietà inversa di "ha tipo di apparato iconografico e decorativo".
comment: This is the inverse property of "has iconographic or decorative apparatus type". @en
domain: Tipo di apparato iconografico e decorativo
label: is iconographic or decorative apparatus type of @en
range: Apparato iconografico e decorativo
sub property of: isTypeOf
version info: stable @en
version info: stabile

Altezza x Lunghezza
type: Tipo di Misura
type: NamedIndividual
label: Height x Length @en
version info: stable @en
version info: stabile

trascrizione
type: FunctionalProperty
type: DatatypeProperty
comment: This property connects an inscription, emblem etc., to the text's transcription, using scientifically accepted integrations. @en
comment: Questa proprietà collega un'iscrizione, un emblema, etc., alla trascrizione del testo, utilizzando scioglimenti e integrazioni scientificamente accettati.
domain: Elemento apposto su bene culturale
label: transcript @en
range: Literal
version info: stable @en
version info: stabile
iccd norm tag: ICCD Normativa Trasversale 4.00: DA/ISE/ISEI - Normative di versioni precedenti: DA/ISR/ISRI

Disponibile
type: Disponibilità materiale del bene culturale
type: NamedIndividual
label: Available @en

Legenda della moneta
type: Class
comment: Questa classe rappresenta l'insieme di lettere e parole presenti sul dritto o sul rovescio di un bene numismatico, che, unito alla raffigurazione, fa parte dell'impronta della moneta.
comment: This class represents the lettering and wording on the reverse or the obverse of a numismatic property. @en
label: Coin legend @en
subclass of: Iscrizione
version info: stabile
version info: stable @en
iccd norm tag: ICCD Normativa NU 4.00: DA/DES/DELS; DA/DES/DESN; DA/DES/DESF; DA/DES/DESG; DA/DES/DESR; DA/DES/DEST.

è concetto tecnico usato in
type: ObjectProperty
comment: This property relates a technical concept (e.g. material) used in the technical description of a cultural property. @en
comment: Questa proprietà collega un concetto tecnico (es.: materia) usato nella descrizione tecnica di un bene culturale.
domain: Concetto tecnico
label: is technical concept used in @en
range: Descrizione tecnica di entità culturale
inverse of: usa concetto tecnico
version info: stabile
version info: stable @en

Logo
type: Class
comment: Questa classe rappresenta un logo, ovvero, in ambito commerciale e pubblicitario, scritta e/o simbolo grafico che identifica un prodotto, un'azienda, ecc.
subclass of: Elemento apposto su bene culturale
version info: stable @en
version info: stabile
iccd norm tag: ICCD Normativa Trasversale 4.00: se DA/ISE/ISED = 'logo' - ICCD versioni precedenti: DA/STM/STMC = 'logo' - ICCD Normativa A: LI/LSI/LSIG = 'logo'

è leggibilità di
type: ObjectProperty
comment: Questa è la proprietà inversa di "ha leggibilità".
comment: This is the inverse property of "has legibility". @en
domain: Leggibilità
label: is legibility of @en
range: Stato di Conservazione
sub property of: isCharacteristicOf
version info: stable @en
version info: stabile

Emblema
type: Class
comment: Questa classe rappresenta un emblema, ovvero una figura o un'immagine simbolica, talvolta accompagnata da un testo scritto (motto, testo in versi, ecc.)
label: Emblem @en
subclass of: Elemento apposto su bene culturale
version info: stable @en
version info: stabile
iccd norm tag: ICCD Normativa Trasversale 4.00: se DA/ISE/ISED = 'emblema' - ICCD versioni precedenti: DA/STM/STMC = 'emblema' - ICCD Normativa A: LI/LSI/LSIG = 'emblema'

Comunicazione verbale
type: Tipo di modalità comunicativa
type: NamedIndividual
label: Verbal communication @en

Tipo di caratteri
type: Class
comment: This class represents the font style used in a text (i.e. italic, bold, gothic) @en
comment: Questa classe rappresenta il tipo di caratteri utilizzato in un testo (es.: corsivo, grassetto, caratteri gotici, etc.)
label: Font style @en
subclass of: Characteristic
subclass of: Restriction
  on property: è tipo di caratteri di
  some values from: Elemento apposto su bene culturale
version info: stable @en
version info: stabile
iccd norm tag: ICCD Normativa Traversale 4.00: DA/ISE/ISET - Normative di versioni precedenti: DA/ISR/ISRT

Volume
type: Tipo di Misura
type: NamedIndividual
version info: stable @en
version info: stabile

Sistema di scrittura
type: Class
comment: Questa classe rappresenta il sistema di scrittura/alfabeto adottati in una iscrizione, un timbro, uno stemma, etc.
comment: This class represents the writing system or alphabet of an inscription, postmark, crest etc. @en
label: Writing system @en
subclass of: System
subclass of: Restriction
  on property: è sistema di scrittura di
  some values from: Elemento apposto su bene culturale
version info: stable @en
version info: stabile
iccd norm tag: ICCD Normativa Trasversale 4.00: DA/ISE/ISEF

Raffigurazione su moneta
type: Class
comment: This class represents the design on the reverse or the obverse of a numismatic property, as the graphical part of what is represented on a side of a coin, together with the legend (lettering and wording). @en
comment: Questa classe rappresenta la raffigurazione presente sul dritto o sul rovescio di un bene numismatico, intesa come l'insieme degli elementi grafici, che, uniti a una legenda (lettere e parole), fa parte dell'impronta della moneta.
label: Coin design @en
subclass of: Elemento apposto su bene culturale
disjoint with: Legenda della moneta
version info: stabile
version info: stable @en
iccd norm tag: ICCD Normativa NU 4.00: DA/DES/DESA; DA/DES/DESM

ha programma per foto
type: ObjectProperty
comment: Questa proprietà collega una fotografia digitale al programma di visualizzazione, memorizzazione ed elaborazione utilizzato per la fotografia digitale.
comment: This property relates a digital photograph to the visualization, storage and processing program used for the digital photograph. @en
domain: Thing
label: has photo program @en
range: Caratteristica tecnica
sub property of: ha caratteristica tecnica
inverse of: è programma per foto di
version info: stabile
version info: stable @en

ha sistema di scrittura
type: ObjectProperty
comment: This property connects an inscription, stamp, crest etc., to the adopted writing system or alphabet. @en
comment: Questa proprietà collega una iscrizione, un timbro, uno stemma, etc., al sistema di scrittura/alfabeto adottati.
domain: Elemento apposto su bene culturale
label: has writing system @en
range: Sistema di scrittura
inverse of: è sistema di scrittura di
version info: stabile
version info: stable @en
iccd norm tag: ICCD Normativa Trasversale 4.00: DA/ISE/ISEF

Disponibilità materiale del bene culturale
type: Class
comment: Questa classe rappresenta la disponibilità materiale di un bene culturale, ovvero se il bene è materialmente disponibile, per esempio per attività di catalogazione, o se non è disponibile (es.: furto, distruzione)
comment: This class represents the availability of a cultural property, wheter the cultural property is available or not (e.g.: theft, destruction) for example for cataloguing activities. @en
label: Cultural Property Availability @en
subclass of: CulturalEntityCharacteristic
subclass of: Restriction
  on property: è disponibilità materiale di bene culturale
  some values from: CulturalEntity
version info: stabile
version info: stable @en
iccd norm tag: ICCD Normativa Trasversale 4.00: OG/OGR

Ontologia della Descrizione Denotativa (ArCo network)
type: Ontology
comment: Questo modulo, detto della descrizione denotativa (denotazione è inteso come l'atto di indicare una cosa attraverso segni esteriori), modella le caratteristiche di un bene culturale, individuabili e/o individuate durante il processo di catalogazione e misurabili in accordo con un sistema di riferimento. Esempi includono misure es. lunghezza, materia es. argilla, tecniche es. fusione, stato di conservazione es. buono, discreto, cattivo. In questo modulo si riusano come template i seguenti Ontology Design Patterns: - http://www.ontologydesignpatterns.org/cp/owl/collectionentity.owl - http://www.ontologydesignpatterns.org/cp/owl/classification.owl - http://www.ontologydesignpatterns.org/cp/owl/descriptionandsituation.owl - http://www.ontologydesignpatterns.org/cp/owl/situation.owl
comment: The Denotative Description module encodes the characteristics of a cultural property, as detectable and/or detected during the cataloguing process and measurable according to a reference system. Examples include measurements e.g. length, constituting materials e.g. clay, employed techniques e.g. melting, conservation status e.g. good, decent, bad. In this module are used as template the following Ontology Design Patterns: - http://www.ontologydesignpatterns.org/cp/owl/collectionentity.owl - http://www.ontologydesignpatterns.org/cp/owl/classification.owl - http://www.ontologydesignpatterns.org/cp/owl/descriptionandsituation.owl - http://www.ontologydesignpatterns.org/cp/owl/situation.owl @en
label: Denotative Description Ontology (ArCo network) @en
reuses pattern as template: collectionentity.owl
creator: Valentina Presutti (ISTC-CNR, STLab)
creator: Chiara Veninata (MiBAC, ICCD)
creator: Aldo Gangemi (ISTC-CNR, STLab)
creator: Valentina Carriero (ISTC-CNR, STLab)
creator: Andrea Nuzzolese (ISTC-CNR, STLab)
creator: Marialetizia Mancinelli (MiBAC, ICCD)
creator: Ludovica Marinucci (ISTC-CNR, STLab)
description: The Denotative Description module encodes the characteristics of a cultural property, as detectable and/or detected during the cataloguing process and measurable according to a reference system. Examples include measurements e.g. length, constituting materials e.g. clay, employed techniques e.g. melting, conservation status e.g. good, decent, bad. @en
description: Questo modulo, detto della descrizione denotativa (denotazione è inteso come l'atto di indicare una cosa attraverso segni esteriori), modella le caratteristiche di un bene culturale, individuabili e/o individuate durante il processo di catalogazione e misurabili in accordo con un sistema di riferimento. Esempi includono misure es. lunghezza, materia es. argilla, tecniche es. fusione, stato di conservazione es. buono, discreto, cattivo.
language: ITA
language: ENG
issued: 2018-03-07
license: A31 CCBYSA40
license: https://creativecommons.org/licenses/by-sa/4.0/
modified: 2019-06-01
reuses pattern as template: situation.owl
reuses pattern as template: classification.owl
reuses pattern as template: descriptionandsituation.owl
imports: location
imports: context-description
imports: core
version info: Versione 1.0
version info: Version 1.0 @en

ha tipo di modalità comunicativa
type: ObjectProperty
comment: This property relates a communication medium to its type (e.g.: verbal, singing, etc.) @en
comment: Questa proprietà collega una modalità comunicativa di un oggetto al tipo di modalità comunicativa (verbale, strumentale, etc.)
domain: Modalità comunicativa
label: has communication medium type @en
range: Tipo di modalità comunicativa
sub property of: hasType
inverse of: è tipo di modalità comunicativa
version info: stable @en
version info: stabile
iccd norm tag: ICCD Normativa BDI: CU

è programma per foto di
type: ObjectProperty
comment: This is the inverse property of "has photo program". @en
comment: Questa è la proprietà inversa di "ha programma per foto".
domain: Caratteristica tecnica
label: is photo program of @en
range: Thing
sub property of: è caratteristica tecnica di
version info: stable @en
version info: stabile

è disponibilità materiale di bene culturale
type: ObjectProperty
comment: This is the inverse property of "has cultural property availability". @en
comment: Questa è la proprietà inversa di "ha disponibilità materiale".
domain: Disponibilità materiale del bene culturale
label: is cultural property availability of @en
range: CulturalEntity
sub property of: isCulturalEntityCharacteristicOf
version info: stable @en
version info: stabile

Circonferenza vita
type: Tipo di Misura
type: NamedIndividual
label: Waist Circumference @en
version info: stable @en
version info: stabile

ha formato di estensione/compressione del file
type: ObjectProperty
comment: Questa proprietà collega una risorsa digitale su supporto informatico al formato utilizzato per la scrittura della risorsa.
comment: This property relates a digital resource to the format used to write it on a data medium. @en
domain: Thing
label: has file format @en
range: Caratteristica tecnica
sub property of: ha caratteristica tecnica
inverse of: è formato di estensione/compressione del file di
version info: stable @en
version info: stabile

Lapide
type: Class
comment: Questa classe rappresenta una lapide, intesa come una lastra di pietra o marmo recante iscrizioni, figure, simboli, a scopo commemorativo, celebrativo, ecc.
label: Historical Plaque @en
subclass of: Elemento apposto su bene culturale
version info: stable @en
version info: stabile
iccd norm tag: ICCD Normativa A: LI/LSI/LSIG = 'lapide'

è colore della foto
type: ObjectProperty
comment: Questa è la proprietà inversa a "ha colore della foto"
comment: This is the inverse property of "has photo colour" @en
domain: Caratteristica tecnica
label: is photo colour of @en
range: Thing
sub property of: è caratteristica tecnica di
version info: stabile
version info: stable @en

è dimensione in pixel di
type: ObjectProperty
comment: Questa è la proprietà inversa di "ha dimensioni in pixel"
comment: This is the inverse property of "has pixel dimension" @en
domain: Caratteristica tecnica
label: is pixel dimension of @en
range: Thing
sub property of: è caratteristica tecnica di
version info: stabile
version info: stable @en

è tipo di elemento apposto
type: ObjectProperty
comment: Questa è la proprietà inversa di "ha tipo di elemento apposto".
comment: This is the inverse property of "has affixed element type". @en
domain: Tipo di elemento apposto
label: is affixed element type of @en
range: Elemento apposto su bene culturale
sub property of: isTypeOf
version info: stable @en
version info: stabile

Denominazione dialettale
type: Tipo di denominazione
type: NamedIndividual
comment: This individual represents the dialect designation. @en
comment: Questo individuo rappresenta una denominazione dialettale.
label: Dialectal designation @en
version info: stable @en
version info: stabile
iccd norm tag: ICCD Normativa Trasversale: OGD/OGDT - Normative A e BDM 3: OGA/OGAG.

Temperamento
type: Concetto tecnico
type: NamedIndividual
comment: This individual represents a musical instrument adopted temperament, especially in relation to an object in its original conditions, or after its restoration. For idiophones with fixed keys (e.g. xylophone, litophone, metallophone) the temperament represents the succession of intervals. @en
comment: Questo individuo rappresenta il temperamento adottato, soprattutto in caso di oggetto in condizioni originali, o dopo un restauro, di uno strumento musicale. Per gli idiofoni a tasti fissi (come xilofoni, litofoni, metallofoni) rappresenta la successione degli intervalli.
label: Temperament @en
version info: stable @en
version info: stabile
iccd norm tag: ICCD Normativa SM 4.00: AA/AAP

Denominazione idiomatica
type: Tipo di denominazione
type: NamedIndividual
comment: This individual represents an idiomatic designation. @en
comment: Questo individuo rappresenta una denominazione idiomatica.
label: Idiomatic designation @en
version info: stable @en
version info: stabile
iccd norm tag: ICCD Normativa Trasversale: OGD/OGDT - Normative A e PG 3: OGA/OGAG.

Buona leggibilità
type: Leggibilità
type: NamedIndividual
label: Good legibility @en

Supporto
type: Class
comment: Questa classe rappresenta il supporto sul quale può trovarsi un elemento, per esempio un'iscrizione, un emblema, un timbro, etc., rappresentati su un bene culturale (es. "etichetta di carta").
comment: This class represents the support on which an element can be located, for instance an inscription, emblem, postmark represented on a cultural property (i.e. "paper label"). @en
label: Support @en
subclass of: Object
subclass of: Restriction
  on property: è supporto di
  some values from: Elemento apposto su bene culturale
version info: stabile
version info: stable @en
iccd norm tag: ICCD Normativa Trasversale 4.00: DA/ISE/ISES

ha modalità esecutiva
type: ObjectProperty
comment: This property relates a verbal or singing or instrumental communication medium to its implementation method (e.g.: polyphonic) associated to it. @en
comment: Questa proprietà collega una modalità comunicativa verbale o musicale vocale o musicale strumentale alla modalità esecutiva associata (es.: polifonica).
domain: Modalità comunicativa
label: has implementation method @en
range: Modalità esecutiva
inverse of: è modalità esecutiva di
version info: stabile
version info: stable @en
iccd norm tag: ICCD Normativa BDI: CU/CUM/CUMD; CU/CUS/CUSD

è corista di
type: ObjectProperty
comment: This is the inverse property of "has diapason". @en
comment: Questa è la proprietà inversa di "ha corista".
domain: Caratteristica tecnica
label: is diapason of @en
range: Thing
sub property of: è caratteristica tecnica di
version info: stable @en
version info: stabile

include caratteristica tecnica
type: ObjectProperty
comment: This property connects a technical status, with respect to a specific entity (as a cultural entity) to one of the technical characteristics related to that status. @en
comment: Questa proprietà collega lo stato tecnico di un'entità culturale a una delle caratteristiche tecniche dell'entità relativamente a quello stato.
domain: Stato tecnico di entità culturale
label: includes technical characteristic @en
range: Caratteristica tecnica
is native to: technical-characteristic
inverse of: è inclusa in stato tecnico
version info: stable @en
version info: stabile

Stemma
type: Class
comment: Questa classe rappresenta uno stemma, ovvero un insieme di figure e simboli che, in araldica, vengono rappresentati secondo determinate regole per contrassegnare persone o enti.
label: Coat of arms @en
subclass of: Elemento apposto su bene culturale
version info: stable @en
version info: stabile
iccd norm tag: ICCD Normativa Trasversale 4.00: se DA/ISE/ISED = 'stemma' - ICCD versioni precedenti: DA/STM/STMC = 'stemma' - ICCD Normativa A: LI/LSI/LSIG = 'stemma'

Livello di qualità
type: Concetto tecnico
type: NamedIndividual
comment: This individual represents a digital resource's quality level, e.g. high-resolution, low-resolution, preview. @en
comment: Questo individuo rappresenta il livello di qualità di una risorsa digitale (es.: alta risoluzione, bassa risoluzione, preview)
label: Quality level @en

Stato di conservazione cattivo
type: Tipo di stato di conservazione
type: NamedIndividual
label: Bad conservation status @en
version info: stable @en
version info: stabile

Stato di conservazione discreto
type: Tipo di stato di conservazione
type: NamedIndividual
label: Decent conservation status @en
version info: stable @en
version info: stabile

ha leggibilità
type: ObjectProperty
comment: Questa proprietà collega lo stato di conservazione di un bene numismatico al suo stato di leggibilità.
comment: This property relates a numismatic entity's conservation status to its legibility status. @en
domain: Stato di Conservazione
label: has legibility @en
range: Leggibilità
sub property of: hasCharacteristic
inverse of: è leggibilità di
version info: stable @en
version info: stabile
iccd norm tag: ICCD Normativa NU: CO/STC/STCL

UndetectedMeasurements
type: Tipo di Misura
type: NamedIndividual
version info: stable @en
version info: stabile
version info: Undetected Measurements @en
version info: Misure non rilevate

Risoluzione
type: Concetto tecnico
type: NamedIndividual
comment: This individual represents the specific value and resolution used for storing a digital photograph. @en
comment: Questo individuo rappresenta la risoluzione e il valore specifico utilizzati per la memorizzazione di una fotografia digitale.
label: Resolution @en
version info: stable @en
version info: stabile
iccd norm tag: ICCD Normativa F: MT/FVC/FVCU

è formato di estensione/compressione del file di
type: ObjectProperty
comment: This is the inverse property of "has file format" @en
comment: Questa è la proprietà inversa a "ha formato di estensione/compressione del file"
domain: Caratteristica tecnica
label: is file format of @en
range: Thing
sub property of: è caratteristica tecnica di
version info: stable @en
version info: stabile

Denominazione locale
type: Tipo di denominazione
type: NamedIndividual
comment: This individual represents an local designation. @en
comment: Questo individuo rappresenta una denominazione locale.
label: Local designation @en
version info: stable @en
version info: stabile
iccd norm tag: ICCD Normativa Trasversale: OGD/OGDT - Normative A e BDM 3: OGA/OGAG.

ha accordatura
type: ObjectProperty
comment: Questa proprietà collega uno strumento all'accordatura dello strumento musicale.
comment: This property relates a musical instrument to its tuning. @en
domain: Thing
label: has tuning @en
range: Caratteristica tecnica
sub property of: ha caratteristica tecnica
inverse of: è accordatura di
version info: stabile
version info: stable @en

è misura di ingombro di
type: ObjectProperty
comment: This is the inverse property of "has volumetric dimensions measurement". @en
comment: Questa è la proprietà inversa di "ha misura di ingombro".
domain: Misura
label: is volumetric dimensions measurement in @en
range: Collezione di misure
sub property of: è misura in collezione
version info: stabile
version info: stable @en

è colore del vestimento
type: ObjectProperty
comment: This is the inverse property of "has garment colour". @en
comment: Questa è la proprietà inversa di "ha colore del vestimento".
domain: Caratteristica tecnica
label: is garment colour of @en
range: Thing
sub property of: è caratteristica tecnica di
version info: stabile
version info: stable @en

posizione su bene culturale
type: DatatypeProperty
comment: Questa proprietà rappresenta la posizione di un oggetto (es.: elementi come stemmi, emblemi, timbri, etc., oppure i soggetti rappresentati) rispetto all'intero bene o a una sua specifica parte.
comment: This property represents a cultural entity's postion (e.g. elements like crests, emblems, stamps or the depicted subjects), with respect to the whole entity or to its specific part. @en
domain: Thing
label: position on cultural property @en
range: Literal
version info: stabile
version info: stable @en
iccd norm tag: ICCD Normativa Trasversale 4.00: DA/ISE/ISEP - Normative di versioni precedenti: DA/STM/STMP; DA/ISR/ISRP - Normativa A: LI/LSI/LSIU - Normativa PST: OG/SGT/SGTP - ICCD Normative MA, CA, SI, SAS: MC/CMN/CMNP

Modalità esecutiva
type: Class
comment: Questa classe rappresenta la modalità esecutiva (es.: alternanza, polifonia) associata a una modalità comunicativa (verbale, musicale vocale, musicale strumentale).
comment: This class represents the implementation method (e.g.: polyphonic) associated to a verbale or singing or instrumental communication medium. @en
label: Implementation method @en
subclass of: Method
subclass of: Restriction
  on property: è modalità esecutiva di
  some values from: Modalità comunicativa
version info: stabile
version info: stable @en
iccd norm tag: ICCD Normativa BDI: CU/CUM/CUMD; CU/CUS/CUSD

ha forma
type: ObjectProperty
comment: This property relates an object to its shape. It is used for bidimensional objects, e.g. octagonal or round shape. @en
comment: Questa proprietà collega un oggetto al formato dell'oggetto, per oggetti bidimensionali (es.: ottagonale, tondo)
domain: Thing
label: has shape @en
range: Caratteristica tecnica
sub property of: ha caratteristica tecnica
inverse of: è forma di
version info: stabile
version info: stable @en

Stato di conservazione mediocre
type: Tipo di stato di conservazione
type: NamedIndividual
label: Mediocre conservation status @en
version info: stable @en
version info: stabile

Stato di conservazione buono
type: Tipo di stato di conservazione
type: NamedIndividual
label: Good conservation status @en
version info: stable @en
version info: stabile

Denominazione attribuita
type: Tipo di denominazione
type: NamedIndividual
comment: This individual represents an attributed denomination. @en
comment: Questo individuo rappresenta una denominazione attribuita.
label: Assigned designation @en
version info: stable @en
version info: stabile
iccd norm tag: ICCD Normativa Trasversale: OGD/OGDT - Normative A, BDM, PG 3: OGA/OGAG.

data di creazione
type: DatatypeProperty
type: FunctionalProperty
comment: This property represents the date of construction of a musical instrument's accessory. @en
comment: Questa proprietà rappresenta la data di costruzione di un accessorio di uno strumento musicale.
domain: Accessorio
label: creation date @en
range: Literal
version info: stable @en
version info: stabile
iccd norm tag: ICCD Normativa SM 4.00: AS/ASS/ASSD

ha orientamento
type: ObjectProperty
comment: Questa proprietà collega un oggetto al suo orientamento, secondo l'asse principale individuato.
comment: This property connects an object to its orientation, considering its major axis. @en
domain: Thing
label: has orientation @en
range: Orientamento
inverse of: è orientamento di
version info: stabile
version info: stable @en
iccd norm tag: ICCD Normativa Trasversale: MT/ORT - ICCD Schede CA e MA: MT/ORT

Tecnica
type: Concetto tecnico
type: NamedIndividual
comment: This individual represents an object's execution technique. @en
comment: Questo individuo rappresenta la tecnica di esecuzione di un oggetto, per esempio un bene culturale.
label: Technique @en
version info: stable @en
version info: stabile
iccd norm tag: ICCD Normativa Trasversale 4.00: MT/MTC/MTCT

Scopo funzionale
type: Class
comment: This class represents the functional purpose (i.e. decorative, religious, symbolic, magic-offensive) of an object (i.e. culural property or iconographic/decorative apparatus or affixed element on a cultural property like an inscription). The functional purpose is intended as the function that an object has to perform. @en
comment: Questa classe rappresenta lo scopo funzionale (decorativo, religioso, simbolico, magico-offensivo, etc.), inteso come funzione che deve svolgere, di un oggetto (es bene culturale, apparato iconografico/decorativo o elemento apposto su un bene culturale come un'iscrizione).
label: Functional purpose @en
subclass of: CulturalEntityCharacteristic
subclass of: Restriction
  on property: è scopo funzionale di
  some values from: Thing
version info: stabile
version info: stable @en
iccd norm tag: ICCD Normativa Trasversale: DA/ISE/ISEC - Normative di versioni precedenti: DA/ISR/ISRC; DA/APF/APFF - Normative MA e CA: OG/OGT/OGTF

Larghezza massima / minima
type: Tipo di Misura
type: NamedIndividual
label: Maximum / minimum width @en
version info: stable @en
version info: stabile

Campione prelevato
type: Class
comment: This class represents a sample collected from an archeological property. @en
comment: Questa classe rappresenta un campione prelevato da un bene archeologico.
label: Sample collected @en
subclass of: Collection
subclass of: Restriction
  on property: è campione prelevato da
  some values from: CulturalEntity
subclass of: Restriction
  all values from: Literal
  on property: identificativo del campione prelevato
subclass of: Restriction
  all values from: Literal
  on property: posizione su bene culturale
subclass of: Restriction
  all values from: Tipo di campione prelevato
  on property: ha tipo di campione prelevato
version info: stable @en
version info: stabile
iccd norm tag: ICCD Normativa MA, CA, SI, SAS: MC/CMN

ha estensione
type: ObjectProperty
comment: Questa proprietà collega uno strumento musicale alla sua estensione musicale.
comment: This property relates a musical instrument to its extension. @en
domain: Thing
label: has extension @en
range: Caratteristica tecnica
sub property of: ha caratteristica tecnica
inverse of: è estensione di
version info: stable @en
version info: stabile

Ingombro
type: Tipo di Misura
type: NamedIndividual
label: Volumetric dimensions @en
version info: stable @en
version info: stabile

è filigrana di
type: ObjectProperty
comment: This is the inverse property of "has filigree". @en
comment: Questa è la proprietà inversa di "ha filigrana".
domain: Caratteristica tecnica
label: is filigree of @en
range: Thing
sub property of: è caratteristica tecnica di
version info: stable @en
version info: stabile

identificativo del campione prelevato
type: FunctionalProperty
type: DatatypeProperty
comment: Questa proprietà rappresenta il numero che identifica il campione.
comment: This property represents the seample collected identifier. @en
domain: Campione prelevato
label: sample collected identifier @en
range: Literal
sub property of: identifier
version info: stabile
version info: stable @en
iccd norm tag: ICCD Normativa MA, CA, SI, SAS: MC/CMN

Altezza x Lunghezza x Larghezza
type: Tipo di Misura
type: NamedIndividual
label: Height x Length x Width @en
version info: stable @en
version info: stabile

Profondità
type: Tipo di Misura
type: NamedIndividual
label: Depth @en
version info: stable @en
version info: stabile

è definizione di bene culturale
type: ObjectProperty
comment: This is the inverse property of "has cultural property definition". @en
comment: Questa è la proprietà inversa di "ha definizione di bene culturale".
domain: Definizione del bene culturale
label: is cultural property definition of @en
range: Tipo di bene culturale
version info: stabile
version info: stable @en

Accessibilità del bene culturale
type: Class
comment: Questa classe rappresenta l'accessibilità di un bene culturale, ovvero la possibilità di accedere al bene, in tutto o in parte, per esempio per effettuare un esame diretto finalizzato alla catalogazione (es.: un bene immobile posto in un luogo recintato non accessibile, un bene mobile che non si può osservare da vicino perché posto troppo in alto su una parete; un bene totalmente accessibile, etc.).
comment: This class represents the cultural property accessibility, that is the possibility to reach or enter that cultural property, for example for cataloguing activities (e.g.: an immovable cultural property located in a walled area, a movable cultural property located on the top shelf, a totally accessible cultural property, etc.) @en
label: Cultural property accessibility @en
subclass of: CulturalEntityCharacteristic
subclass of: Restriction
  on property: è accessibilità di bene culturale
  some values from: CulturalEntity
version info: stable @en
version info: stabile
iccd norm tag: ICCD Normativa Trasversale 4.00: LC/ACB

Leggibilità assente
type: Leggibilità
type: NamedIndividual
label: Impossible legibility @en

ha accessibilità
type: ObjectProperty
comment: Questa proprietà collega il bene culturale alla sua accessibilità, ovvero la possibilità di accedere al bene, in tutto o in parte, per esempio per effettuare un esame diretto finalizzato alla catalogazione (es.: un bene immobile posto in un luogo recintato non accessibile, un bene mobile che non si può osservare da vicino perché posto troppo in alto su una parete; un bene totalmente accessibile, etc.).
comment: This property relates the cultural property to its accessibility, that is the possibility to reach or enter that cultural property, for example for cataloguing activities (e.g.: an immovable cultural property located in a walled area, a movable cultural property located on the top shelf, a totally accessible cultural property, etc.) @en
domain: CulturalEntity
label: has cultural property accessibility @en
range: Accessibilità del bene culturale
sub property of: hasCulturalEntityCharacteristic
inverse of: è accessibilità di bene culturale
version info: stable @en
version info: stabile
iccd norm tag: ICCD Normativa Trasversale 4.00: LC/ACB

ha campione prelevato
type: ObjectProperty
comment: Questa proprietà collega un bene archeologico a un campione prelevato da esso.
comment: This property connects a archaeological entity to a sample collected from it. @en
domain: CulturalEntity
label: has sample collected @en
range: Campione prelevato
inverse of: è campione prelevato da
version info: stable @en
version info: stabile
iccd norm tag: ICCD Normativa MA, CA, SI, SAS: MC/CMN

Spessore
type: Tipo di Misura
type: NamedIndividual
label: Thickness @en
version info: stable @en
version info: stabile

Larghezza totale massima
type: Tipo di Misura
type: NamedIndividual
label: Maximum total width @en
version info: stable @en
version info: stabile

proposte di interventi
type: DatatypeProperty
comment: Questa proprietà rappresenta eventuali proposte per interventi conservativi, dopo aver valutato le condizioni del bene al momento della sua catalogazione.
comment: This property represents potential proposals for conservative interventions after evaluating the cultual entity's conditions at time of its cataloguing. @en
domain: CulturalEntity
label: proposed intervention @en
range: Literal
version info: stable @en
version info: stabile
iccd norm tag: CO/STP

ha memoria di massa
type: ObjectProperty
comment: Questa proprietà collega una risorsa digitale alla memoria di massa nella quale è stata memorizzata la fotografia digitale.
comment: This property relates a digital photograph to the mass storage where a digital photograph is stored. @en
domain: Thing
label: has mass storage @en
range: Caratteristica tecnica
sub property of: ha caratteristica tecnica
inverse of: è memoria di massa di
version info: stabile
version info: stable @en

è modalità comunicativa
type: ObjectProperty
comment: This is the inverse property of "has communication medium". @en
comment: Questa è la proprietà inversa di "ha modalità comunicativa".
domain: Modalità comunicativa
label: is communication medium of @en
range: CulturalEntity
sub property of: isCulturalEntityCharacteristicOf
version info: stabile
version info: stable @en

validità
type: DatatypeProperty
comment: Questa proprietà rappresenta la validità, intesa come livello di accuratezza, di una misura osservata per un oggetto.
comment: This property represents the validity, intended as accurancy level, of an observed measure for an object. @en
domain: Collezione di misure
label: validity @en
range: Literal
version info: stabile
version info: stable @en

Accessorio
type: Class
comment: This class represents an accessory of a musical property, both if it is functional to the sound production, or if it is the sound's production or conservation medium. @en
comment: Questa classe rappresenta un accessorio di un bene musicale, ovvero un oggetto collegabile al bene musicale, sia nel caso in cui sia funzionale alla produzione del suono, sia nel caso in cui sia di supporto alla produzione del suono o alla conservazione o alla prassi musicale del bene.
label: Accessory @en
subclass of: Object
subclass of: Restriction
  on property: è accessorio di
  some values from: CulturalEntity
subclass of: Restriction
  all values from: Literal
  on property: data di creazione
version info: stable @en
version info: stabile
iccd norm tag: ICCD Normativa SM 4.00: AS/ASS/ASST

Circonferenza orlo
type: Tipo di Misura
type: NamedIndividual
label: Edge circumference @en
version info: stable @en
version info: stabile

Stato di Conservazione
type: Class
comment: Questa classe rappresenta lo stato di conservazione di un bene culturale.
comment: This class represents the conservation status of the cultural property. @en
label: Conservation Status @en
subclass of: Situation
subclass of: Restriction
  all values from: Leggibilità
  on property: ha leggibilità
subclass of: Restriction
  all values from: Tipo di stato di conservazione
  on property: ha tipo di stato di conservazione
subclass of: Restriction
  on property: è stato di conservazione di
  some values from: CulturalEntity
description: Un esempio d'uso della classe "Stato di conservazione" è il seguente: resource:ConservationStatus/0900750201-conservation-status-1 a a-dd:ConservationStatus ; rdfs:label "Stato di conservazione 1 del bene: 0900750201"@it ; core:specifications "Macchie in corrispondenza della fodera, lungo lo scollo." ; a-dd:hasConservationStatusType a-dd:GoodConservationStatus ; tiapit:time "2014" .
description: An example of usage of the class 'Conservation status' is the following: resource:ConservationStatus/0900750201-conservation-status-1 a dd:ConservationStatus ; rdfs:label "Conservation status 1 of cultural property: 0900750201"@en ; core:specifications "Stains at the lining, along the neckline." ; dd:hasConservationStatusType dd:GoodConservationStatus ; tiapit:time "2014" . @en
version info: stable @en
version info: stabile
iccd norm tag: CO/STC

ha stato tecnico
type: ObjectProperty
comment: This property connects a cultural entity to its technical status, valid until a specific moment, that is represented by the technical characteristics that a cultural entity has in that moment. @en
comment: Questa proprietà collega un'entità culturale al suo stato tecnico, valido fino a determinato momento, che è rappresentato dalle caratteristiche tecniche che il bene culturale ha in quel momento.
domain: Thing
label: has technical status @en
range: Stato tecnico di entità culturale
sub property of: hasSituation
inverse of: è stato tecnico di
version info: stabile
version info: stable @en
iccd norm tag: ICCD Normativa Trasversale 4.00: MT/MTC/MTCM; MT/MTC/MTCT - Normativa OA, D, F, S, MI: MT/FRM - Normativa OA, D, F, S: MT/FIL - Normativa VeAC: MT/MTC/MTCC; MT/MTC/MTCF - Normativa F: MT/FVC/FVCC; MT/FVC/FVCF; MT/FVC/FVCP; MT/FVC/FVCU; MT/FVC/FVCM; MT/FVM;

è accessorio di
type: ObjectProperty
comment: This is the inverse property of "has accessory". @en
comment: Questa è la proprietà inversa di "ha accessorio".
domain: Accessorio
label: is accessory of @en
range: CulturalEntity
version info: stable @en
version info: stabile