acronimo normativa ICCD
type: AnnotationProperty
comment: This property annotates the field or the fields of the ICCD regulation to which a specific class or property refers. @en
comment: Questa proprietà permette di annotare il campo o i campi della normativa ICCD corrispondenti a una determinata classe o proprietà dell'ontologia.
label: ICCD norm tag @en
version info: stable @en
version info: stabile

Modulo sull'Unità Stratigrafica
type: Tipo di modulo di approfondimento
type: NamedIndividual
label: Stratigraphic Unit form @en

Scheda Etnologia
type: Class
comment: This class represents the catalogue record describing Ethnology. @en
comment: Questa classe rappresenta la scheda catalografica che descrive etnologia. Nell'ambito delle normative ICCD, è una scheda considerata obsoleta.
label: Ethnology catalogue record @en
subclass of: Scheda di catalogo
version info: stable @en
version info: stabile

Scheda Beni naturalistici-Petrologia
type: Class
comment: This class represents the catalogue record describing Natural heritage - petrology. @en
comment: Questa classe rappresenta la scheda catalografica che descrive beni naturalistici-Petrologia.
label: Natural heritage - petrology catalogue record @en
subclass of: Scheda di catalogo
version info: stable @en
version info: stabile

Ontologia del Catalogo (ArCo network)
type: Ontology
comment: The Catalogue module allows the description of concepts related to the Italian General Catalogue of Cultural Heritage (ICCD-MiBAC), and in particular catalogue records, that is XML files recording all data gathered by a cataloguer on a particular cultural property. In this module are used as template the following Ontology Design Patterns: - http://www.ontologydesignpatterns.org/cp/owl/classification.owl - http://www.ontologydesignpatterns.org/cp/owl/sequence.owl @en
comment: Questo modulo modella le informazioni relative al Catalogo Generale dei Beni Culturali (ICCD-MiBAC) e alle schede di catalogo che descrivono un bene culturale. In questo modulo sono riusati come template i seguenti Ontology Design Patterns: - http://www.ontologydesignpatterns.org/cp/owl/classification.owl - http://www.ontologydesignpatterns.org/cp/owl/sequence.owl
label: Catalogue Ontology (ArCo network) @en
reuses pattern as template: sequence.owl
reuses pattern as template: classification.owl
creator: Andrea Nuzzolese (ISTC-CNR, STLab)
creator: Valentina Carriero (ISTC-CNR, STLab)
creator: Maria Letizia Mancinelli (MiBACT, ICCD)
creator: Chiara Veninata (MiBACT, ICCD)
creator: Aldo Gangemi (ISTC-CNR, STLab)
creator: Ludovica Marinucci (ISTC-CNR, STLab)
creator: Valentina Presutti (ISTC-CNR, STLab)
description: The Catalogue module allows the description of concepts related to the Italian General Catalogue of Cultural Heritage (ICCD-MiBAC), and in particular catalogue records, that is XML files recording all data gathered by a cataloguer on a particular cultural property. @en
description: Questo modulo modella le informazioni relative al Catalogo Generale dei Beni Culturali (ICCD-MiBAC) e alle schede di catalogo che descrivono un bene culturale.
language: ITA
language: ENG
issued: 2018-03-07
license: A31 CCBYSA40
license: https://creativecommons.org/licenses/by-sa/4.0/
modified: 2019-06-01
imports: core
version info: Version 1.0 @en
version info: Versione 1.0

è collegato a modulo di approfondimento
type: ObjectProperty
comment: Questa proprietà collega un bene culturale a un modulo di approfondimento in relazione con il bene in esame.
comment: This property relates a cultural property to an additional form. @en
domain: CulturalEntity
label: is related to additional form @en
range: Modulo di approfondimento
version info: stable @en
version info: stabile
acronimo normativa ICCD: ICCD Normativa Trasversale 4.00: DA/APP

è referente verifica scientifica di aggiornamento di
type: ObjectProperty
comment: Questa è la proprietà inversa a "ha referente verifica scientifica di aggiornamento".
comment: This is the inverse property of "has update scientific revisor". @en
domain: Agent
label: is update scientific revisor of @en
range: Versione della scheda
sub property of: è agente coinvolto nella catalogazione di
version info: stabile
version info: stable @en

Versione della scheda
type: Class
comment: This class represents a version (after creation, editing, updating) of a catalogue record on a cultural property. @en
comment: Rappresenta una versione (relativa a operazioni di redazione, aggiornamento, revisione) di una scheda di catalogo, cioè un modello descrittivo che raccoglie in modo organizzato le informazioni sui beni.
label: Catalogue record version @en
subclass of: Object
subclass of: Restriction
  all values from: Scheda di catalogo
  on property: è versione di
subclass of: Restriction
  all values from: Agent
  on property: ha agente coinvolto nella catalogazione
subclass of: Restriction
  all values from: TimeIndexedRole
  on property: ha ruolo nel tempo
subclass of: Restriction
  all values from: Versione della scheda
  on property: è la versione precedente di
subclass of: Restriction
  all values from: Versione della scheda
  on property: ha la versione precedente
subclass of: Restriction
  all values from: Versione della scheda
  on property: ha versione precedente
subclass of: Restriction
  all values from: Versione della scheda
  on property: è versione precedente di
subclass of: Restriction
  all values from: TimeInterval
  on property: compilato al tempo
version info: stabile
version info: stable @en
acronimo normativa ICCD: CM/CMP; CM/RVM; CM/AGG

Scheda Reperti antropologici
type: Class
comment: This class represents the catalogue record describing Anthropological materials. @en
comment: Questa classe rappresenta la scheda catalografica che descrive reperti antropologici.
label: Anthropological materials catalogue record @en
subclass of: Scheda di catalogo
version info: stable @en
version info: stabile

ha operatore di trascrizione per informatizzazione
type: ObjectProperty
comment: Questa proprietà rappresenta la relazione che collega una versione, relativa a trascrizione per informatizzazione, di una scheda di catalogo al relativo operatore. La relazione tra il ruolo e l'ente che lo riveste è espressa nel nome della proprietà, che quindi ne fornisce una rappresentazione semplificata, con ridotta espressività. Nell'ontologia questa relazione è modellata anche, in maniera più espressiva, dalla classe TimeIndexedRole, che permette di collegare l'ente, il suo ruolo e la sua corrispondente estensione temporale.
domain: Versione della scheda
label: has digital transcription operator @en
range: Agent
sub property of: ha agente coinvolto nella catalogazione
inverse of: è operatore di trascrizione per informatizzazione di
version info: stabile
version info: stable @en
acronimo normativa ICCD: CM/RVM/RVMN

è la versione precedente di
type: ObjectProperty
type: FunctionalProperty
comment: Property used to associate a catalogue record version to its immediate next version. @en
comment: Questa proprietà associa una versione di una scheda alla sua versione immediatamente successiva.
domain: Versione della scheda
label: is immediate previous version of @en
range: Versione della scheda
sub property of: è versione precedente di
is native to: catalogue-record-sequence
version info: stabile
version info: stable @en

descrive
type: ObjectProperty
comment: This property was created as a generic property for specific subproperties, and represents the relationship between an entity that describes another entity. @en
comment: Questa proprietà è stata creata come proprietà generica di sottoproprietà specifiche, e rappresenta la relazione tra un'entità che descrive un'altra entità.
domain: Thing
label: describes @en
range: Thing
inverse of: è descritto da
version info: stable @en
version info: stabile

Scheda su bene culturale
type: Class
comment: This class represents a record describing a cultural property for purposes other than cataloguing cultural heritage. @en
comment: Questa classe rappresenta una scheda che analizza il bene in esame per finalità diverse da quella specifica della catalogazione del patrimonio culturale.
label: Catalogue property record @en
subclass of: Object
subclass of: Restriction
  on property: identificativo di scheda su bene culturale
  some values from: Literal
subclass of: Restriction
  all values from: Literal
  on property: progetto di riferimento
subclass of: Restriction
  on property: descrive
  some values from: CulturalEntity
version info: stabile
version info: stable @en
acronimo normativa ICCD: ICCD Normativa Trasversale 4.00: AC/ACS

Scheda di catalogo
type: Class
comment: Rappresenta una scheda di catalogo, cioè un modello descrittivo che raccoglie in modo organizzato le informazioni sui beni, e che può avere più versioni (in seguito ad aggiornamenti e revisioni).
comment: This class represents a catalogue record, that is a descriptive model collecting and organising information on a cultural property, and which can have more than one version (after editing and updating). @en
label: Catalogue record @en
subclass of: Object
subclass of: Restriction
  all values from: Literal
  on property: identificativo di sistema
subclass of: Restriction
  all values from: Literal
  on property: identificativo della scheda di catalogo
subclass of: Restriction
  on property: ha profilo di accesso
  some values from: Profilo di accesso
subclass of: Restriction
  all values from: Versione della scheda
  on property: ha versione
subclass of: Restriction
  all values from: CulturalEntity
  on property: descrive
description: An example of usage of the class 'Catalogue Record' is the following: resource:CatalogueRecordS/0500212038 a cat:CatalogueRecordS ; rdfs:label "Catalogue record n: 0500212038"@en ; cat:catalogueRecordIdentifier "0500212038" ; cat:describesCulturalProperty resource:HistoricOrArtisticProperty/0500212038 ; cat:hasAccessProfile resource:AccessProfile/0500212038-1 ; cat:hasCatalogueRecordVersion resource:CatalogueRecordVersion/0500212038-rvm , resource:CatalogueRecordVersion/0500212038-agg-1 , resource:CatalogueRecordVersion/0500212038-compilation ; cat:hasCataloguingLevel cat:C ; cat:systemRecordCode "ICCD8403091" ; core:note> "Number of negative by "Museco Civico": MCBas G/ DLXXXIX/ 3775" . @en
description: Un esempio di utilizzo della classe "Scheda di Catalogo" è il seguente: resource:CatalogueRecordS/0500212038 a cat:CatalogueRecordS ; rdfs:label "Scheda catalografica n: 0500212038"@it ; cat:catalogueRecordIdentifier "0500212038" ; cat:describesCulturalProperty resource:HistoricOrArtisticProperty/0500212038 ; cat:hasAccessProfile resource:AccessProfile/0500212038-1 ; cat:hasCatalogueRecordVersion resource:CatalogueRecordVersion/0500212038-rvm , resource:CatalogueRecordVersion/0500212038-agg-1 , resource:CatalogueRecordVersion/0500212038-compilation ; cat:hasCataloguingLevel cat:C ; cat:systemRecordCode "ICCD8403091" ; core:note "Numero di negativo del Museo Civico: MCBas G/ DLXXXIX/ 3775" .
version info: stable @en
version info: stabile

Scheda Opere/oggetti d'arte
type: Class
comment: This class represents the catalogue record describing Artworks. @en
comment: Questa classe rappresenta la scheda catalografica che descrive opere/oggetti d'arte.
label: Artworks catalogue record @en
subclass of: Scheda di catalogo
version info: stable @en
version info: stabile

identificativo di scheda su bene culturale
type: DatatypeProperty
comment: Questa proprietà permette di associare l'identificativo a una scheda in cui si analizza un bene culturale per finalità diverse da quella specificazione della catalogazione del patrimonio culturale.
comment: This property is used to associate the identifier to a catalogue record that analyze the cultural property for reasons other than cataloguing the cultural heritage. @en
domain: Scheda su bene culturale
label: cultural property record identifier @en
range: Literal
sub property of: identifier
version info: stabile
version info: stable @en
acronimo normativa ICCD: ICCD Normativa Trasversale 4.00: AC/ACS/ACSC

Livello medio di riservatezza
type: Livello di riservatezza
type: NamedIndividual
label: Medium privacy @en

Scheda Vestimenti antichi/contemporanei
type: Class
comment: This class represents the catalogue record describing Historic and contemporary garments. @en
comment: Questa classe rappresenta la scheda catalografica che descrive vestimenti antichi/contemporanei.
label: Historic and contemporary garments catalogue record @en
subclass of: Scheda di catalogo
version info: stable @en
version info: stabile

è versione precedente di
type: ObjectProperty
type: TransitiveProperty
comment: Questa proprietà associa una versione di una scheda a una sua versione successiva.
comment: Property used to associate a catalogue record version one of its next version. @en
domain: Versione della scheda
label: is previous version of @en
range: Versione della scheda
sub property of: precedes
is native to: catalogue-record-sequence
version info: stabile
version info: stable @en

ha tipo di modulo di approfondimento
type: ObjectProperty
comment: This property relates an additional form to its type (Stratigraphic Unit, Epigraphy, Wall Typology). @en
comment: Questa proprietà collega un modulo di approfondimento al tipo di modulo (Unità Stratigrafica, Tipo Murario, Epigrafia).
domain: Modulo di approfondimento
label: has additional form type @en
range: Tipo di modulo di approfondimento
sub property of: hasType
inverse of: è tipo di modulo di approfondimento di
version info: stable @en
version info: stabile
acronimo normativa ICCD: ICCD Normativa Trasversale 4.00: DA/APP/APPT

Modulo sull'epigrafia
type: Tipo di modulo di approfondimento
type: NamedIndividual
label: Epigraphy form @en

ha agente responsabile della scheda su bene culturale
type: ObjectProperty
comment: Questa proprietà collega una scheda in cui si analizza un bene culturale per finalità diverse da quella della catalogazione del patrimonio all'Ente o al soggetto che ha prodotto la scheda o che gestisce la banca dati di cui la scheda fa parte.
comment: This property relates a cultural property record to the agency or the person that created that record or manages the database where the record is. @en
domain: Scheda su bene culturale
label: has cultural property record responsible agent @en
range: Agent
sub property of: hasRelatedAgent
inverse of: è ente responsabile della scheda su bene culturale
version info: stable @en
version info: stabile
acronimo normativa ICCD: ICCD Normativa Trasversale 4.00: AC/ACS/ACSE

è versione di
type: ObjectProperty
comment: Property, inverse of "has catalogue record version", used to associate a catalogue record version (e.g. after update) to the catalogue record. @en
comment: Proprietà, inversa di "ha versione", che permette di collegare una versione (corrispondente a un particolare stato dovuto a operazioni di redazione, aggiornamento, revisione) di una scheda di catalogo alla scheda di catalogo intesa come oggetto informativo che descrive un bene culturale.
domain: Versione della scheda
label: is catalogue record version of @en
range: Scheda di catalogo
version info: stable @en
version info: stabile

codice ICCD soppresso
type: DatatypeProperty
comment: This property represents the ICCD's identifier deleted for many reasons, used to search for obsolete catalogue records. @en
comment: Questa proprietà rappresenta un codice ICCD eventualmente soppresso per motivi di diversa natura, utile per poter ricercare e consultare le schede pregresse nell'Archivio storico gestito dall'Istituto o da altri Enti.
domain: Scheda di catalogo
label: deleted ICCD identifier @en
range: Literal
sub property of: identifier
version info: stable @en
version info: stabile
acronimo normativa ICCD: ICCD Normativa Trasversale 4.00: RV/RSP; versioni precedenti: RV/RVE/RVES

è motivazione di riservatezza di
type: ObjectProperty
comment: This is the inverse property of "has privacy reason". @en
comment: Questa è la proprietà inversa di "ha motivazione di riservatezza".
domain: Motivo di riservatezza
label: is privacy reason of @en
range: Profilo di accesso
sub property of: isDescriptionOf
version info: stable @en
version info: stabile

è funzionario responsabile di
type: ObjectProperty
comment: This is the inverse property of "has official in charge". @en
comment: Questa è la proprietà inversa a "ha funzionario responsabile".
domain: Agent
label: is official in charge of @en
range: Versione della scheda
sub property of: è agente coinvolto nella catalogazione di
version info: stable @en
version info: stabile

è tipo di modulo di approfondimento di
type: ObjectProperty
comment: Questa è la proprietà inversa di "ha tipo di modulo di approfondimento".
comment: This is the inverse property of "has additional form type". @en
domain: Tipo di modulo di approfondimento
label: is additional form type of @en
range: Modulo di approfondimento
sub property of: isTypeOf
version info: stable @en
version info: stabile

Scheda Parchi/giardini
type: Class
comment: This class represents the catalogue record describing Parks / Gardens. @en
comment: Questa classe rappresenta la scheda catalografica che descrive parchi/giardini.
label: Parks/Gardens catalogue record @en
subclass of: Scheda di catalogo
version info: stable @en
version info: stabile

Livello alto di riservatezza
type: Livello di riservatezza
type: NamedIndividual
label: Maximum privacy @en

compilato al tempo
type: ObjectProperty
comment: Property used to associate a catalogue record version with the time interval in which it was edited. @en
comment: Proprietà che associa una versione di una scheda di catalogo all'intervallo temporale in cui è stata compilata.
domain: Versione della scheda
label: edited at time @en
range: TimeInterval
inverse of: tempo di compilazione di
version info: stable @en
version info: stabile
acronimo normativa ICCD: CM/CMP/CMPD; CM/RVM/RVMD; CM/AGG/AGGD

è ente responsabile della scheda su bene culturale
type: ObjectProperty
comment: Questa proprietà, inversa a "ha agente responsabile di scheda su bene culturale", collega l'Ente o il soggetto che ha prodotto la scheda o che gestisce la banca dati di cui la scheda fa parte alla scheda stessa.
comment: This property, inverse of "has cultural property record responsible agent", relates the agency or the person that created the record or manages the database where the record is to the record itself. @en
domain: Agent
label: is responsible agent of cultural property record @en
range: Scheda su bene culturale
version info: stabile
version info: stable @en
acronimo normativa ICCD: ICCD Normativa Trasversale 4.00: AC/ACS/ACSE

ha responsabile di ricerca e redazione di aggiornamento
type: ObjectProperty
comment: Questa proprietà rappresenta la relazione che collega una versione aggiornata di una scheda di catalogo al relativo responsabile ricerca e redazione. La relazione tra il ruolo e l'ente che lo riveste è espressa nel nome della proprietà, che quindi ne fornisce una rappresentazione semplificata, con ridotta espressività. Nell'ontologia questa relazione è modellata anche, in maniera più espressiva, dalla classe TimeIndexedRole, che permette di collegare l'ente, il suo ruolo e la sua corrispondente estensione temporale.
domain: Versione della scheda
label: has update responsible research and compilation @en
range: Agent
sub property of: ha agente coinvolto nella catalogazione
inverse of: è responsabile di ricerca e redazione di aggiornamento di
version info: stabile
version info: stable @en
acronimo normativa ICCD: CM/AGG/AGGN

identificativo del modulo di approfondimento
type: DatatypeProperty
type: FunctionalProperty
comment: This property represents the additional form identifier. @en
comment: Questa proprietà permette di associare un identificativo a un modulo di approfondimento.
domain: Modulo di approfondimento
label: additional form identifier @en
range: Literal
sub property of: identifier
version info: stabile
version info: stable @en
acronimo normativa ICCD: ICCD Normativa Trasversale 4.00: DA/APP/APPC

è profilo di accesso di
type: ObjectProperty
comment: Questa è la proprietà inversa di "ha profilo di accesso".
comment: This is the inverse property of "has access profile". @en
domain: Profilo di accesso
label: is access profile of @en
range: Scheda di catalogo
sub property of: isCharacteristicOf
version info: stable @en
version info: stabile

ha livello di riservatezza
type: ObjectProperty
comment: Questa proprietà collega il profilo di accesso di una scheda catalografica al livello di riservatezza dei dati contenutevi (basso livello di riservatezza, alto livello di riservatezza, medio livello di riservatezza).
domain: Profilo di accesso
label: has privacy level @en
range: Livello di riservatezza
sub property of: hasCharacteristic
inverse of: è livello di riservatezza di
version info: stabile
version info: stable @en
acronimo normativa ICCD: ICCD Normativa Trasversale 4.00: AD/ADS

ha responsabile ricerca e redazione
type: ObjectProperty
comment: Questa proprietà rappresenta la relazione che collega la prima versione di una scheda di catalogo al relativo responsabile ricerca e redazione. La relazione tra il ruolo e l'ente che lo riveste è espressa nel nome della proprietà, che quindi ne fornisce una rappresentazione semplificata, con ridotta espressività. Nell'ontologia questa relazione è modellata anche, in maniera più espressiva, dalla classe TimeIndexedRole, che permette di collegare l'ente, il suo ruolo e la sua corrispondente estensione temporale.
domain: Versione della scheda
label: has responsible research and compilation @en
range: Agent
sub property of: ha agente coinvolto nella catalogazione
inverse of: è responsabile ricerca e redazione di
version info: stable @en
version info: stabile
acronimo normativa ICCD: CM/CMP/CMPN

Scheda Stampe
type: Class
comment: This class represents the catalogue record describing Prints. @en
comment: Questa classe rappresenta la scheda catalografica che descrive stampe.
label: Prints catalogue record @en
subclass of: Scheda di catalogo
version info: stable @en
version info: stabile

è descritto da
type: ObjectProperty
comment: Questa proprietà, inversa di "descrive", permette di associare un bene culturale alla scheda di catalogo che lo descrive.
comment: This property, inverse of "describes", is used to associate a cultural property with the catalogue record that describes it. @en
domain: CulturalEntity
label: is described by @en
range: Scheda di catalogo
sub property of: è descritto da
version info: stable @en
version info: stabile

Livello catalogazione
type: Class
comment: Questa classe rappresenta il livello catalogazione, cioè la sigla che individua il grado di approfondimento dell'indagine condotta sul bene in esame (I corrisponde al livello di inventario, P al livello di precatalogo, C al livello di catalogo)
comment: This class represents the cataloguing level, defining the level of detail of the survey carried out on the cultural property (Minimum, Medium, Detailed) @en
label: Cataloguing level @en
subclass of: Characteristic
subclass of: Restriction
  on property: è livello di catalogazione di
  some values from: Scheda di catalogo
equivalent class: Class
  one of: Livello di Catalogo
  one of: Livello di Inventario
  one of: Livello di Precatalogo
version info: stable @en
version info: stabile
acronimo normativa ICCD: CD/LIR

ha funzionario responsabile
type: ObjectProperty
comment: Questa proprietà rappresenta la relazione che collega la prima versione di una scheda di catalogo al relativo funzionario responsabile. La relazione tra il ruolo e l'ente che lo riveste è espressa nel nome della proprietà, che quindi ne fornisce una rappresentazione semplificata, con ridotta espressività. Nell'ontologia questa relazione è modellata anche, in maniera più espressiva, dalla classe TimeIndexedRole, che permette di collegare l'ente, il suo ruolo e la sua corrispondente estensione temporale.
domain: Versione della scheda
label: has official in charge @en
range: Agent
sub property of: ha agente coinvolto nella catalogazione
inverse of: è funzionario responsabile di
version info: stable @en
version info: stabile
acronimo normativa ICCD: CM/FUR

Scheda Beni naturalistici-Botanica
type: Class
comment: This class represents the catalogue record describing Natural heritage - botany. @en
comment: Questa classe rappresenta la scheda catalografica che descrive beni naturalistici-Botanica.
label: Natural heritage - botany catalogue record @en
subclass of: Scheda di catalogo
version info: stable @en
version info: stabile

ha funzionario responsabile di aggiornamento
type: ObjectProperty
comment: Questa proprietà rappresenta la relazione che collega una versione aggiornata di una scheda di catalogo al relativo funzionario responsabile. La relazione tra il ruolo e l'ente che lo riveste è espressa nel nome della proprietà, che quindi ne fornisce una rappresentazione semplificata, con ridotta espressività. Nell'ontologia questa relazione è modellata anche, in maniera più espressiva, dalla classe TimeIndexedRole, che permette di collegare l'ente, il suo ruolo e la sua corrispondente estensione temporale.
domain: Versione della scheda
label: has update official in charge @en
range: Agent
sub property of: ha agente coinvolto nella catalogazione
inverse of: è funzionario responsabile di aggiornamento di
version info: stable @en
version info: stabile
acronimo normativa ICCD: CM/AGG/AGGF

Codice alternativo
type: Class
comment: Questa classe rappresenta un codice che identifica la scheda di catalogo nell'ambito di altri sistemi informativi, assegnato da enti diversi da ICCD.
comment: This class represents an identifier of a catalogue record in information systems other than ICCD. @en
label: Alternative Identifier @en
subclass of: Object
subclass of: Restriction
  on property: è altro codice identificativo di
  some values from: Scheda di catalogo
subclass of: Restriction
  all values from: Literal
  on property: progetto di riferimento
version info: stabile
version info: stable @en
acronimo normativa ICCD: ICCD Normativa Trasversale 4.00: AC/ACC

progetto di riferimento
type: DatatypeProperty
comment: Questa proprietà rappresenta il progetto nell'ambito del quale è stata prodotta una scheda, quella a cui si associa un codice alternativo, assegnato da enti diversi da ICCD, o quella che analizza un bene culturale per finalità diverse da quella specifica della catalogazione del patrimonio culturale.
comment: This property represents the reference project of a record about a cultural property. @en
domain: Class
  union of: Codice alternativo
  union of: Scheda su bene culturale
label: reference project @en
range: Literal
version info: stabile
version info: stable @en
acronimo normativa ICCD: ICCD Normativa Trasversale 4.00: AC/ACC/ACCP; AC/ACS/ACSP

è livello di catalogazione di
type: ObjectProperty
comment: Questa è la proprietà inversa di "ha livello di catalogazione".
comment: This is the inverse property of "has cataloguing level". @en
domain: Livello catalogazione
label: is cataloguing level of @en
range: Scheda di catalogo
sub property of: isCharacteristicOf
version info: stabile
version info: stable @en

Scheda Fotografia
type: Class
comment: This class represents the catalogue record describing Photography. @en
comment: Questa classe rappresenta la scheda catalografica che descrive fotografia.
label: Photograph catalogue record @en
subclass of: Scheda di catalogo
version info: stable @en
version info: stabile

Livello basso di riservatezza
type: Livello di riservatezza
type: NamedIndividual
label: Minimum privacy @en

Modulo informativo
type: Class
comment: Questa classe rappresenta un modulo informativo, uno standard ICCD per attività di censimento e segnalazione di beni culturali, utilizzato per acquisire informazioni per qualsiasi tipo di entità, con un set minimo di dati standardizzati obbligatori.
comment: This class represents an information form, an ICCD standard for cultural heritage census and reporting activities, used to acquire information for any type of entity, with a minimum set of mandatory standardized data. @en
label: Information form @en
subclass of: Object
subclass of: Restriction
  on property: descrive
  some values from: CulturalEntity
subclass of: Restriction
  all values from: Literal
  on property: identificativo del modulo informativo
version info: stable @en
version info: stabile
acronimo normativa ICCD: ICCD Normativa Trasvesale 4.00: AC/MOD

ha agente coinvolto nella catalogazione
type: ObjectProperty
comment: This property is used to associate a catalogue record to an agent playing a role in cataloguing activities. @en
comment: Questa proprietà rappresenta la relazione che collega una versione di una scheda di catalogo a un agente che riveste un ruolo nelle attività di catalogazione di quella scheda. La relazione tra il ruolo e l'agente che lo riveste è espressa, in maniera generica, nel nome della proprietà, che quindi ne fornisce una rappresentazione semplificata, con ridotta espressività. Questa relazione è poi specializzata da sottoproprietà. Nell'ontologia questa relazione è modellata anche, in maniera più espressiva, dalla classe TimeIndexedRole, che permette di collegare l’ente, il suo ruolo e la sua corrispondente estensione temporale.
domain: Versione della scheda
label: has cataloguing agent @en
range: Agent
sub property of: hasRelatedAgent
inverse of: è agente coinvolto nella catalogazione di
property chain axiom: hasRiT
property chain axiom: isRoleInTimeOf
version info: stable @en
version info: stabile

Scheda Siti archeologici
type: Class
comment: This class represents the catalogue record describing Archaeological sites. @en
comment: Questa classe rappresenta la scheda catalografica che descrive siti archeologici.
label: Archaeological sites catalogue record @en
subclass of: Scheda di catalogo
version info: stable @en
version info: stabile

è referente verifica scientifica di
type: ObjectProperty
comment: This is the inverse property of "has scientific director". @en
comment: Questa è la proprietà inversa a "ha referente verifica scientifica".
domain: Agent
label: is scientific director of @en
range: Versione della scheda
sub property of: è agente coinvolto nella catalogazione di
version info: stable @en
version info: stabile

tempo di compilazione di
type: ObjectProperty
comment: Questa è la proprietà inversa di "compilato al tempo".
comment: This is the inverse property of "edited at time". @en
domain: TimeInterval
label: editing time of @en
range: Versione della scheda
version info: stabile
version info: stable @en

ha altro codice identificativo
type: ObjectProperty
comment: Property used to associate a catalogue record with an identifier created in the context of information systems other than ICCD's SIGECweb. @en
comment: Questa proprietà collega una scheda di catalogo a un codice che identifica la scheda di catalogo nell'ambito di altri sistemi informativi, assegnato da enti diversi da ICCD.
domain: Scheda di catalogo
label: has alternative identifier @en
range: Codice alternativo
inverse of: è altro codice identificativo di
version info: stabile
version info: stable @en
acronimo normativa ICCD: ICCD Normativa Trasversale 4.00: AC/ACC

Scheda Complessi archeologici
type: Class
comment: This class represents the catalogue record describing Natural heritage - archaeological complexes. @en
comment: Questa classe rappresenta la scheda catalografica che descrive complessi archeologici.
label: Archaeological complexes catalogue record @en
subclass of: Scheda di catalogo
version info: stable @en
version info: stabile

ha versione
type: ObjectProperty
comment: Proprietà che permette di collegare una scheda di catalogo, intesa come oggetto informativo che descrive un bene culturale, a una sua versione (corrispondente a un particolare stato dovuto a operazioni di redazione, aggiornamento, revisione).
comment: Property used to associate a catalogue record to one of its versions (e.g. after update) @en
domain: Scheda di catalogo
label: has version @en
range: Versione della scheda
inverse of: è versione di
version info: stable @en
version info: stabile

Livello di riservatezza
type: Class
comment: Questa classe rappresenta il livello di riservatezza dei dati contenuti in una scheda catalografica (1 livello basso di riservatezza, 2 livello medio di riservatezza, 3 livello alto di riservatezza)
comment: This class represents the privacy level of the data recorded in a catalogue record (Minimum, Medium, Maximum). @en
label: Privacy level @en
subclass of: Characteristic
subclass of: Restriction
  on property: è livello di riservatezza di
  some values from: Profilo di accesso
version info: stabile
version info: stable @en
acronimo normativa ICCD: ICCD Normativa Trasversale 4.00: AD/ADS/ADSP

è collegato a modulo informativo
type: ObjectProperty
comment: Questa proprietà collega un bene culturale a un modulo informativo in relazione con il bene in esame.
comment: This property relates a cultural property to an information form. @en
domain: CulturalEntity
label: is related to information form @en
range: Modulo informativo
version info: stable @en
version info: stabile
acronimo normativa ICCD: ICCD Normativa Trasvesale 4.00: AC/MOD

ha motivazione di riservatezza
type: ObjectProperty
comment: Questa proprietà collega uno specifico profilo d'accesso ai dati di una scheda catalografica alla motivazione che ha determinato l'adozione di quel profilo d'accesso (es.: scheda contenente dati liberamente accessibili, scheda contenente dati personali, scheda di bene di proprietà privata, scheda di bene a rischio, scheda di bene non adeguatamente sorvegliabile)
domain: Profilo di accesso
label: has privacy reason @en
range: Motivo di riservatezza
sub property of: hasDescription
inverse of: è motivazione di riservatezza di
version info: stabile
version info: stable @en
acronimo normativa ICCD: ICCD Normativa Trasversale 4.00: AD/ADS/ADSM

identificativo della scheda di catalogo
type: FunctionalProperty
type: DatatypeProperty
comment: Questa proprietà permette di associare l'identificativo a una scheda catalografica che descrive un bene culturale.
comment: This property represents the identifier of a catalogue record describing a cultural property. @en
domain: Scheda di catalogo
label: catalogue record identifier @en
range: Literal
sub property of: identifier
version info: stable @en
version info: stabile
acronimo normativa ICCD: Concatenazione dei sottocampi di CD/NCT (NCTR, NCTN, NCTS) e RV/RVE/RVEL

Scheda Beni demoetnoantropologici materiali
type: Class
comment: This class represents the catalogue record describing Tangible demo-ethno-anthropological heritage. @en
comment: Questa classe rappresenta la scheda catalografica che descrive beni demoetnoantropologici materiali.
label: Tangible demo-ethno-anthropological heritage catalogue record @en
subclass of: Scheda di catalogo
version info: stable @en
version info: stabile

ha versione precedente
type: TransitiveProperty
type: ObjectProperty
comment: Questa proprietà associa una versione di una scheda a una sua versione precedente.
comment: Property used to associate a catalogue record version to its previous version. @en
domain: Versione della scheda
label: has previous version @en
range: Versione della scheda
sub property of: follows
is native to: catalogue-record-sequence
inverse of: è versione precedente di
version info: stabile
version info: stable @en

Scheda Architettura
type: Class
comment: This class represents the catalogue record describing Architecture. @en
comment: Questa classe rappresenta la scheda catalografica che descrive architettura.
label: Architecture catalogue record @en
subclass of: Scheda di catalogo
version info: stable @en
version info: stabile

è responsabile di ricerca e redazione di aggiornamento di
type: ObjectProperty
comment: This is the inverse property of "has update responsible research and compilation". @en
comment: Questa è la proprietà inversa a "ha responsabile di ricerca e redazione di aggiornamento".
domain: Agent
label: is update responsible research and compilation of @en
range: Versione della scheda
sub property of: è agente coinvolto nella catalogazione di
version info: stabile
version info: stable @en

Scheda Beni naturalistici-Zoologia
type: Class
comment: This class represents the catalogue record describing Natural heritage - zoology. @en
comment: Questa classe rappresenta la scheda catalografica che descrive beni naturalistici-Zoologia.
label: Natural heritage - zoology catalogue record @en
subclass of: Scheda di catalogo
version info: stable @en
version info: stabile

ha ruolo nel tempo
type: ObjectProperty
comment: Questa proprietà permette di associare una particolare versione di una scheda al ruolo nel tempo che un agente esercita nell'ambito della redazione, dell'aggiornamento o revisione della scheda.
comment: This property is used to associate a particular version of a catalogue record to the role in time of an agent that plays a role in updating the catalogue record. @en
domain: Versione della scheda
label: has role in time @en
range: TimeIndexedRole
sub property of: hasRiT
inverse of: è ruolo nel tempo di
version info: stable @en
version info: stabile

Scheda Monumenti archeologici
type: Class
comment: This class represents the catalogue record describing Archaeological monuments. @en
comment: Questa classe rappresenta la scheda catalografica che descrive monumenti archeologici.
label: Archaeological monuments catalogue record @en
subclass of: Scheda di catalogo
version info: stable @en
version info: stabile

Scheda opere/oggetti d'arte contemporanea
type: Class
comment: This class represents the catalogue record describing Contemporary artworks. @en
comment: Questa classe rappresenta la scheda catalografica che descrive opere/oggetti d'arte contemporanea.
label: Contemporary artworks catalogue record @en
subclass of: Scheda di catalogo
version info: stable @en
version info: stabile

è ente o soggetto responsabile di trascrizione per informatizzazione di
type: ObjectProperty
comment: This is the inverse property of "has digital transcription responsible agent". @en
comment: Questa è la proprietà inversa a "ha ente o soggetto responsabile di trascrizione per informatizzazione".
domain: Agent
label: is digital transcription responsible agent of @en
range: Versione della scheda
sub property of: è agente coinvolto nella catalogazione di
version info: stable @en
version info: stabile

identificativo del modulo informativo
type: DatatypeProperty
type: FunctionalProperty
comment: Questa proprietà permette di associare l'identificativo a un modulo informativo che è collegato a un bene culturale.
comment: This property links an identifier to an information form related to a cultural property. @en
domain: Modulo informativo
label: information form identifier @en
range: Literal
sub property of: identifier
version info: stabile
version info: stable @en
acronimo normativa ICCD: ICCD Normativa Trasversale 4.00: AC/MOD/MODI

è responsabile di modulo di approfondimento
type: ObjectProperty
comment: Questa è la proprietà inversa di "ha responsabile di modulo di approfondimento".
comment: This is the inverse property of "has additional form responsible agent" @en
domain: Agent
label: is additional form responsible agent of @en
range: Modulo di approfondimento
sub property of: isAgentRelatedTo
version info: stabile
version info: stable @en

Livello di Precatalogo
type: Livello catalogazione
type: NamedIndividual
label: Medium Level @en
version info: stable @en
version info: stabile

Scheda Patrimonio scientifico e tecnologico
type: Class
comment: This class represents the catalogue record describing Scientific and technological heritage. @en
comment: Questa classe rappresenta la scheda catalografica che descrive il patrimonio scientifico e tecnologico.
label: Scientific and technological heritage catalogue record @en
subclass of: Scheda di catalogo
version info: stable @en
version info: stabile

Scheda Beni naturalistici-Mineralogia
type: Class
comment: This class represents the catalogue record describing Natural heritage - mineralogy. @en
comment: Questa classe rappresenta la scheda catalografica che descrive beni naturalistici-Mineralogia.
label: Natural heritage - mineralogy catalogue record @en
subclass of: Scheda di catalogo
version info: stable @en
version info: stabile

Scheda Tabella materiali archeologici
type: Class
comment: This class represents the catalogue record describing Archaeological materials tables. @en
comment: Questa classe rappresenta la scheda catalografica che descrive tabella materiali archeologici.
label: Archaeological materials tables catalogue record @en
subclass of: Scheda di catalogo
version info: stable @en
version info: stabile

Scheda Reperti archeologici
type: Class
comment: This class represents the catalogue record describing Archaeological objects. @en
comment: Questa classe rappresenta la scheda catalografica che descrive reperti archeologici.
label: Archaeological objects catalogue record @en
subclass of: Scheda di catalogo
version info: stable @en
version info: stabile

è livello di riservatezza di
type: ObjectProperty
comment: This is the inverse property of "has privacy level". @en
comment: Questa è la proprietà inversa di "ha livello di riservatezza".
domain: Livello di riservatezza
label: is privacy level of @en
range: Profilo di accesso
sub property of: isCharacteristicOf
version info: stabile
version info: stable @en

ha profilo di accesso
type: ObjectProperty
comment: Questa proprietà collega una scheda di catalogo al profilo di accesso ai dati (basso, medio, alto).
domain: Scheda di catalogo
label: has access profile @en
range: Profilo di accesso
sub property of: hasCharacteristic
inverse of: è profilo di accesso di
version info: stabile
version info: stable @en
acronimo normativa ICCD: ICCD Normativa Trasversale 4.00: AD/ADS

Scheda Matrici incise
type: Class
comment: This class represents the catalogue record describing Printing plates. @en
comment: Questa classe rappresenta la scheda catalografica che descrive matrici incise.
label: Printing plates catalogue record @en
subclass of: Scheda di catalogo
version info: stable @en
version info: stabile

è agente coinvolto nella catalogazione di
type: ObjectProperty
comment: This property, inverse of "has cataloguin agent", is used to associate an agent playing a role in cataloguing activities to the catalogue record. @en
comment: Questa proprietà, inversa a "ha agente coinvolto nella catalogazione", rappresenta la relazione che collega un agente che riveste un ruolo nelle attività di catalogazione di una scheda di catalogo alla scheda stessa.
domain: Agent
label: is cataloguing agent of @en
range: Versione della scheda
sub property of: isAgentRelatedTo
version info: stable @en
version info: stabile

Tipo di modulo di approfondimento
type: Class
comment: Questa classe rappresenta il tipo di modulo di approfondimento (Unità Stratigrafica, Tipo Murario, Epigrafia)
comment: This class represents the additional form type (Stratigraphic Unit, Wall Typology, Epigraphy) @en
label: Additional form type @en
subclass of: Type
subclass of: Restriction
  on property: è tipo di modulo di approfondimento di
  some values from: Modulo di approfondimento
version info: stabile
version info: stable @en
acronimo normativa ICCD: ICCD Normativa Trasversale 4.00: DA/APP/APPT

Livello di Catalogo
type: Livello catalogazione
type: NamedIndividual
label: Detailed Level @en
version info: stable @en
version info: stabile

è responsabile ricerca e redazione di
type: ObjectProperty
comment: Questa è la proprietà inversa a "ha responsabile ricerca e redazione".
comment: This is the inverse property of "has responsible research and compilation". @en
domain: Agent
label: is responsible research and compilation of @en
range: Versione della scheda
sub property of: è agente coinvolto nella catalogazione di
version info: stable @en
version info: stabile

ha ente o soggetto responsabile di aggiornamento
type: ObjectProperty
comment: Questa proprietà rappresenta la relazione che collega una versione aggiornata di una scheda di catalogo al relativo ente/soggetto responsabile. La relazione tra il ruolo e l'ente che lo riveste è espressa nel nome della proprietà, che quindi ne fornisce una rappresentazione semplificata, con ridotta espressività. Nell'ontologia questa relazione è modellata anche, in maniera più espressiva, dalla classe TimeIndexedRole, che permette di collegare l'ente, il suo ruolo e la sua corrispondente estensione temporale.
domain: Versione della scheda
label: has update responsible agency or person @en
range: Agent
sub property of: ha agente coinvolto nella catalogazione
inverse of: è ente o soggetto responsabile di aggiornamento di
version info: stabile
version info: stable @en
acronimo normativa ICCD: CM/AGG/AGGE

Scheda Disegni
type: Class
comment: This class represents the catalogue record describing Natural heritage - drawings. @en
comment: Questa classe rappresenta la scheda catalografica che descrive disegni.
label: Drawings catalogue record @en
subclass of: Scheda di catalogo
version info: stable @en
version info: stabile

Motivo di riservatezza
type: Class
comment: Questa classe rappresenta la motivazione che ha determinato l'adozione di un profilo di accesso relativamente ai dati contenuti in una scheda catalografica.
comment: This class represents the reason for the adoption of a specific access profile for a catalogue record. @en
label: Privacy reason @en
subclass of: Description
subclass of: Restriction
  on property: è motivazione di riservatezza di
  some values from: Profilo di accesso
version info: stable @en
version info: stabile
acronimo normativa ICCD: ICCD Normativa Trasversale 4.00: AD/ADS/ADSM

dati pregressi recuperati
type: DatatypeProperty
comment: Questa proprietà rappresenta eventuali informazioni provenienti da schede pregresse redatte sulla base di standard obsoleti, per le quali non è stato possibile effettuare il trasferimento nel tracciato della scheda aggiornato, secondo la sintassi: “acronimocampo: valore; acronimocampo: valore”
comment: This property represents information extracted from versions of a catalogue record using obsolete standards. @en
domain: Scheda di catalogo
label: recovered data @en
range: Literal
version info: stabile
version info: stable @en
acronimo normativa ICCD: ICCD Normativa Trasversale 4.00: AN/RDP

ha referente verifica scientifica
type: ObjectProperty
comment: Questa proprietà rappresenta la relazione che collega la prima versione di una scheda di catalogo al relativo referente verifica scientifica. La relazione tra il ruolo e l'ente che lo riveste è espressa nel nome della proprietà, che quindi ne fornisce una rappresentazione semplificata, con ridotta espressività. Nell'ontologia questa relazione è modellata anche, in maniera più espressiva, dalla classe TimeIndexedRole, che permette di collegare l'ente, il suo ruolo e la sua corrispondente estensione temporale.
domain: Versione della scheda
label: has scientific director @en
range: Agent
sub property of: ha agente coinvolto nella catalogazione
inverse of: è referente verifica scientifica di
version info: stable @en
version info: stabile
acronimo normativa ICCD: CM/RSR

ha ente o soggetto responsabile di trascrizione per informatizzazione
type: ObjectProperty
comment: Questa proprietà rappresenta la relazione che collega una versione, relativa a trascrizione per informatizzazione, di una scheda di catalogo al relativo ente/soggetto responsabile. La relazione tra il ruolo e l'ente che lo riveste è espressa nel nome della proprietà, che quindi ne fornisce una rappresentazione semplificata, con ridotta espressività. Nell'ontologia questa relazione è modellata anche, in maniera più espressiva, dalla classe TimeIndexedRole, che permette di collegare l'ente, il suo ruolo e la sua corrispondente estensione temporale.
domain: Versione della scheda
label: has digital transcription responsible agent @en
range: Agent
sub property of: ha agente coinvolto nella catalogazione
inverse of: è ente o soggetto responsabile di trascrizione per informatizzazione di
version info: stable @en
version info: stabile
acronimo normativa ICCD: CM/RVM/RVME

codice univoco ICCD
type: FunctionalProperty
type: DatatypeProperty
comment: Questa proprietà rappresenta un codice assegnato a un'entità dall'ICCD. Si specializza in sottoproprietà (es.: codice univoco ICCD dell'autore, codice univoco ICCD del riferimento bibliografico, etc.)
comment: This property represents the identifier assigned to a cultural property by ICCD. @en
domain: Thing
label: ICCD identifier @en
range: Literal
sub property of: identifier
version info: stabile
version info: stable @en

è ente o soggetto responsabile di aggiornamento di
type: ObjectProperty
comment: Questa è la proprietà inversa a "ha ente o soggetto responsabile di aggiornamento".
comment: This is the inverse property of "has update responsible agent", @en
domain: Agent
label: is update responsible agent of @en
range: Versione della scheda
sub property of: è agente coinvolto nella catalogazione di
version info: stabile
version info: stable @en

descrive
type: ObjectProperty
comment: Proprietà che consente di associare la scheda di catalogo al bene culturale che essa descrive.
comment: Property used to associate the catalogue record with the cultural property that the catalogue record describes. @en
domain: Scheda di catalogo
label: describes @en
range: CulturalEntity
sub property of: descrive
inverse of: è descritto da
version info: stabile
version info: stable @en

è funzionario responsabile di aggiornamento di
type: ObjectProperty
comment: This is the inverse property of "has update official in charge". @en
comment: Questa è la proprietà inversa a "ha funzionario responsabile di aggiornamento".
domain: Agent
label: is update official in charge of @en
range: Versione della scheda
sub property of: è agente coinvolto nella catalogazione di
version info: stable @en
version info: stabile

Scheda Beni naturalistici-Planetologia
type: Class
comment: This class represents the catalogue record describing Natural heritage - planetary science. @en
comment: Questa classe rappresenta la scheda catalografica che descrive beni naturalistici-Planetologia.
label: Natural heritage - planetary science catalogue record @en
subclass of: Scheda di catalogo
version info: stable @en
version info: stabile

Scheda Beni naturalistici-Paleontologia
type: Class
comment: This class represents the catalogue record describing Natural heritage - paleontology. @en
comment: Questa classe rappresenta la scheda catalografica che descrive beni naturalistici-Paleontologia.
label: Natural heritage - paleontology catalogue record @en
subclass of: Scheda di catalogo
version info: stable @en
version info: stabile

Scheda Saggi stratigrafici
type: Class
comment: This class represents the catalogue record describing Stratigraphic records. @en
comment: Questa classe rappresenta la scheda catalografica che descrive saggi stratigrafici.
label: Stratigraphic records catalogue record @en
subclass of: Scheda di catalogo
version info: stable @en
version info: stabile

ha la versione precedente
type: FunctionalProperty
type: ObjectProperty
comment: Property used to associate a catalogue record version to its immediate previous version. @en
comment: Questa proprietà associa una versione di una scheda alla sua versione immediatamente precedente.
domain: Versione della scheda
label: has immediate previous version @en
range: Versione della scheda
sub property of: ha versione precedente
is native to: catalogue-record-sequence
inverse of: è la versione precedente di
version info: stabile
version info: stable @en

è ruolo nel tempo di
type: ObjectProperty
comment: Property, inverse of "has catalogue record version role in time", used to associate a role in time to the agent playing that role, in the updating of a particular version of a catalogue record. @en
comment: Questa proprietà, inversa a "ha ruolo nel tempo", permette di associare il ruolo nel tempo che un agente esercita nell'ambito della redazione, dell'aggiornamento o revisione della scheda a una particolare versione di una scheda.
domain: TimeIndexedRole
label: is role in time of @en
range: Versione della scheda
version info: stable @en
version info: stabile

Profilo di accesso
type: Class
comment: Questa classe rappresenta il profilo di accesso ai dati contenuti in una scheda catalografica, con cui si forniscono indicazioni circa la diffusione pubblica dei dati catalografici sul web.
comment: This class represents the access profile to the data recorded in a catalogue record, giving instructions for public dissemination of data on the web. @en
label: Access profile @en
subclass of: Characteristic
subclass of: Restriction
  all values from: Literal
  on property: expiryDate
subclass of: Restriction
  on property: ha motivazione di riservatezza
  some values from: Motivo di riservatezza
subclass of: Restriction
  on property: è profilo di accesso di
  some values from: Scheda di catalogo
subclass of: Restriction
  on property: ha livello di riservatezza
  some values from: Livello di riservatezza
version info: stabile
version info: stable @en
acronimo normativa ICCD: ICCD Normativa Trasversale 4.00: AD/ADS

identificativo di sistema
type: DatatypeProperty
type: FunctionalProperty
comment: This property represents the identifier associated in the context of the SIGECweb to the xml file containing a catalogue record. @en
comment: Questa proprietà rappresenta l'identificativo di sistema che viene associato all'interno del sistema Sigec al file xml contenente una scheda di catalogo.
domain: Scheda di catalogo
label: system record code @en
range: Literal
sub property of: identifier
version info: stable @en
version info: stabile

Scheda Fondi fotografici
type: Class
comment: This class represents the catalogue record describing Photographic Fonds. @en
comment: Questa classe rappresenta la scheda catalografica che descrive fondi fotografici.
label: Photographic Fonds catalogue record @en
subclass of: Scheda di catalogo
version info: stable @en
version info: stabile

Modulo di approfondimento
type: Class
comment: This class represents an additional form, that describes specific information about a cultural property (epigraphic documents, stratigraphy, unit, wall typology) @en
comment: Questa classe rappresenta un modulo di approfondimento, utile a trattare secondo un approccio specialistico specifici aspetti del bene in esame (Documenti Epigrafici; Tipi Murari, Unità Stratigrafiche)
label: Additional form @en
subclass of: Object
subclass of: Restriction
  on property: ha tipo di modulo di approfondimento
  some values from: Tipo di modulo di approfondimento
subclass of: Restriction
  on property: identificativo del modulo di approfondimento
  some values from: Literal
subclass of: Restriction
  on property: descrive
  some values from: CulturalEntity
disjoint with: Modulo informativo
version info: stable @en
version info: stabile
acronimo normativa ICCD: ICCD Normativa Trasversale 4.00: DA/APP

local identifier
type: DatatypeProperty
type: FunctionalProperty
comment: This property represents a unique identifier of an entity, within a local inventory. @en
comment: Questa proprietà rappresenta un identificativo che individua un'entità in modo univoco nell'ambito di un repertorio locale. Si specializza in sottoproprietà (es.: identificativo dell'autore nell'ambito di un repertorio locale, identificativo dell'indagine archeologica nell'ambito di un repertorio locale, etc.)
domain: Thing
label: identificativo di repertorio locale
range: Literal
sub property of: identifier
version info: stabile
version info: stable @en

è altro codice identificativo di
type: ObjectProperty
comment: This is the inverse property of "has alternative identifier". @en
comment: Questa è la proprietà inversa di "ha altro codice identificativo".
domain: Codice alternativo
label: is alternative identifier of @en
range: Scheda di catalogo
version info: stabile
version info: stable @en

Scheda Centri/nuclei storici
type: Class
comment: This class represents the catalogue record describing Natural heritage - historic cities / town centres. @en
comment: Questa classe rappresenta la scheda catalografica che descrive centri/nuclei storici.
label: Historic cities / town centres catalogue record @en
subclass of: Scheda di catalogo
version info: stable @en
version info: stabile

Scheda Strumenti musicali-Organo
type: Class
comment: This class represents the catalogue record describing Organs. @en
comment: Questa classe rappresenta la scheda catalografica che descrive strumenti musicali-organo.
label: Musical instruments - Organs catalogue record @en
subclass of: Scheda di catalogo
version info: stable @en
version info: stabile

è descritto da
type: ObjectProperty
comment: This property, inverse property of "describes", was created as a generic property for specific subproperties, and represents the relationship between an entity described by another entity. @en
comment: Questa proprietà, inversa della proprietà "descrive", è stata creata come proprietà generica di sottoproprietà specifiche, e rappresenta la relazione tra un'entità descritta da un'altra entità.
domain: Thing
label: is described by @en
range: Thing
version info: stable @en
version info: stabile

Livello di Inventario
type: Livello catalogazione
type: NamedIndividual
label: Minimum Level @en
version info: stable @en
version info: stabile

ha referente verifica scientifica di aggiornamento
type: ObjectProperty
comment: Questa proprietà rappresenta la relazione che collega una versione aggiornata di una scheda di catalogo al relativo referente verifica scientifica. La relazione tra il ruolo e l'ente che lo riveste è espressa nel nome della proprietà, che quindi ne fornisce una rappresentazione semplificata, con ridotta espressività. Nell'ontologia questa relazione è modellata anche, in maniera più espressiva, dalla classe TimeIndexedRole, che permette di collegare l'ente, il suo ruolo e la sua corrispondente estensione temporale.
domain: Versione della scheda
label: has update scientific revisor @en
range: Agent
sub property of: ha agente coinvolto nella catalogazione
inverse of: è referente verifica scientifica di aggiornamento di
version info: stabile
version info: stable @en
acronimo normativa ICCD: CM/AGG/AGGR

ha responsabile di modulo di approfondimento
type: ObjectProperty
comment: Questa proprietà collega un modulo di approfondimento all'ente/il soggetto responsabile nel SIGECweb della redazione del modulo.
comment: This property relates an additional form to the responsible agent of that form in the SIGECweb. @en
domain: Modulo di approfondimento
label: has additional form responsible agent @en
range: Agent
sub property of: hasRelatedAgent
inverse of: è responsabile di modulo di approfondimento
version info: stabile
version info: stable @en
acronimo normativa ICCD: ICCD Normativa Trasversale 4.00: DA/APP/APPE

è operatore di trascrizione per informatizzazione di
type: ObjectProperty
comment: Questa è la proprietà inversa a "ha operatore di trascrizione per informatizzazione".
comment: This is the inverse property of "has digital transcription operator". @en
domain: Agent
label: is digital transcription operator of @en
range: Versione della scheda
sub property of: è agente coinvolto nella catalogazione di
version info: stable @en
version info: stabile

Scheda Strumenti musicali
type: Class
comment: This class represents the catalogue record describing Musical instruments. @en
comment: Questa classe rappresenta la scheda catalografica che descrive strumenti musicali.
label: Musical instruments catalogue record @en
subclass of: Scheda di catalogo
version info: stable @en
version info: stabile

Modulo sul Tipo Murario
type: Tipo di modulo di approfondimento
type: NamedIndividual
label: Wall Typology form @en

Scheda catalografica su bene culturale complesso
type: Class
comment: This class represents a catalogue record describing a complex cultural property. @en
comment: Questa classe rappresenta una scheda catalografica che descrive un bene culturale complesso, a prescindere dal trattamento catalografico applicato (scheda unica/scheda d'insieme).
label: Complex cultural property catalogue record @en
subclass of: Scheda di catalogo
version info: stable @en
version info: stabile

Scheda Beni numismatici
type: Class
comment: This class represents the catalogue record describing Numismatic properties. @en
comment: Questa classe rappresenta la scheda catalografica che descrive beni numismatici.
label: Numismatic properties catalogue record @en
subclass of: Scheda di catalogo
version info: stable @en
version info: stabile

Scheda Beni demoetnoantropologici immateriali
type: Class
comment: This class represents the catalogue record describing Intangible demo-ethno-anthropological heritage. @en
comment: Questa classe rappresenta la scheda catalografica che descrive beni demoetnoantropologici immateriali.
label: Intangible demo-ethno-anthropological heritage catalogue record @en
subclass of: Scheda di catalogo
version info: stable @en
version info: stabile

ha livello di catalogazione
type: ObjectProperty
comment: Questa proprietà permette di associare una scheda di catalogo al suo livello di catalogazione.
domain: Scheda di catalogo
label: has cataloguing level @en
range: Livello catalogazione
sub property of: hasCharacteristic
inverse of: è livello di catalogazione di
version info: stabile
version info: stable @en
acronimo normativa ICCD: CD/LIR