SiblingDisjoint3
type: All Disjoint Set
Disjoint Class: web:WebRuntime
Disjoint Set: Web Entities Disjoint Group

Java ME
type: Java Platform
comment: Java Platform, Micro Edition
Informative Reference: http://java.sun.com/javame/index.jsp
Name: Java ME
Normative Status: Normative
Version: 1

Mouse
type: Input Device
comment: Represents a typical two button mouse found on a PC device
Id: __InputDevice_Mouse
Normative Status: Normative

APIs
type: ObjectProperty
comment: The APIs supported by a user agent
domain: User Agent
range: API
sub property of: Supports

Location
type: Class
comment: This class represents all the information about a location
subclass of: Context Location Entity
subclass of: Restriction
  on property: Position
  some values from: Position

Informative Reference
type: DatatypeProperty
type: AnnotationProperty
comment: This annotation property serves for indicating informative references for an entity in the ontology. It can be used in order to support the (automatic) documentation generation process
Normative Status: Utility

MMS Maximum Message Size
type: DatatypeProperty
type: FunctionalProperty
comment: The maximum size of an interchanged message in byes
domain: MMS User Agent
range: unsignedLong
sub property of: Maximum Delivery Unit Size
Related UAProf entity: MmsMaxMessageSize

Context Hardware Entity
type: Class
comment: This is the base class for those ontology entities that have to do with hardware
subclass of: Context Entity

Current Device
type: ObjectProperty
type: FunctionalProperty
comment: This property represents the currently used device in a Delivery Context
domain: Delivery Context
range: Device
sub property of: Active

Preferred Formats
type: ObjectProperty
comment: The best supported formats
range: Format
sub property of: Supported Formats

Default Java Runtime Environment
type: ObjectProperty
type: FunctionalProperty
comment: The default Java Runtime Environment
domain: Device Software
range: Java Runtime Environment
sub property of: Default Component
sub property of: Available Java Runtime Environments

Width
type: DatatypeProperty
type: FunctionalProperty
comment: The total width of something as a linear measure, measured in centimeters
domain: Class
  union of: Context Hardware Entity
  union of: Device
range: float

BearerType GPRS
type: Network Bearer Technology
comment: GPRS over GSM networks
Id: _GPRS
Name: GPRS

TDOA
type: Time Difference Method
type: Time of Arrival Method
type: Network Based Method
type: Unassisted Method
comment: The TDOA technique works by measuring the exact time of arrival of a handset radio signal at three or more separate cell sites.
Name: TDOA

UMTS
type: Network Bearer Technology
Id: _UMTS
Name: UMTS

BearerType CDPD
type: Network Bearer Technology
comment: Cellular Digital Packet Data
Id: _CDPD
Name: CDPD

Available Network Bearers
type: ObjectProperty
comment: The available network bearers offered by a Network or available for a Device
domain: Class
  union of: Network
  union of: Network Support
range: Network Bearer
sub property of: Component
sub property of: Available
sub property of: Supported Network Bearers

Software
type: Term Group
comment: It is a set of properties, classes and instances that model the software elements of a Delivery Context
Normative Status: Utility
Term Group Prefix: soft

Vendor
type: Class
comment: This class represents a vendor, i.e an entity that commercializes a product
subclass of: Context Common Entity
subclass of: Restriction
  cardinality: 1
  on property: Name

XHTML 1 Text Module
type: Markup Module
comment: This module defines all of the basic text container elements, attributes, and their content model
Name: Text
normativeReference: http://www.w3.org/TR/2008/REC-xhtml-modularization-20081008/abstract_modules.html#s_textmodule
Normative Status: Informative
Public Identifier: -//W3C//ELEMENTS XHTML Text 1.0//EN

MMS versions
type: DatatypeProperty
comment: The supported MMS versions
domain: MMS User Agent
range: string
Related UAProf entity: MmsVersion

FeatureRestriction 17
type: Feature Restriction
Id: getElementById
Restricted Element: DOM Level 1 Api
Restriction Value: false

LocMeth Disjoint2
type: All Disjoint Set
Disjoint Class: loc:NetworkBasedLocMethod
Disjoint Class: loc:TerminalBasedLocMethod

Color Display
type: Feature
comment: This feature indicates that color display is supported
Id: __Feature_ColorDisplay
Name: ColorDisplay
Normative Status: Normative

Transfer Encoding
type: Class
comment: This class represents transfer encoding formats as specified by RFC 2045 and registered with IANA
subclass of: Context Common Entity
subclass of: Restriction
  cardinality: 1
  on property: Transfer Encoding Name
normativeReference: http://tools.ietf.org/html/rfc2045#section-6
Related UAProf entity: CcppAccept-Encoding

Maximum Downloadable Object Size
type: DatatypeProperty
type: FunctionalProperty
comment: Maximum size in bytes for content (image, ringtone, etc.) downloaded via web browser
domain: Web Browser Features
range: unsignedLong

TransferEncoding 8bit
type: Transfer Encoding
Name: 8bit
Transfer Encoding Name: 8bit

TransferEncoding Binary
type: Transfer Encoding
comment: The binary encoding format as specified in RFC4289
Name: binary
Transfer Encoding Name: binary

Xhtml11Module ClientSideImageMap
type: Markup Module
comment: XHTML 1 Client Side Image Map Module
Name: Client Side Image Map
Normative Status: Utility

Home Network
type: ObjectProperty
type: FunctionalProperty
comment: The home PLMN network of a device
domain: Network Support
range: Public Land Mobile Network

Supported J2ME Profiles
type: ObjectProperty
comment: The supported J2ME profiles
domain: J2ME Runtime Environment
range: J2ME Profile
sub property of: Supports

Default WAP Push Client
type: ObjectProperty
type: FunctionalProperty
comment: The default WAP Push Client on a device
domain: Device Software
range: WAP Push Client
sub property of: Available User Agents
sub property of: Default Component
Related UAProf entity: PushCharacteristics

Maximum Delivery Unit Size
type: DatatypeProperty
type: FunctionalProperty
comment: The maximum message size for a delivery unit supported by a user agent measured in bytes. A Delivery Unit can be defined as a set of material transferred between two cooperating programs as the response to a single request
domain: User Agent
range: unsignedLong

Context Location Entity
type: Class
comment: This class reprensents the set of all delivery context entities that has to do with location
subclass of: Context Entity

WebBrowser y
type: Web Browser
Name: BrandBrowser
Version: 1
Supported Application Protocols: ApplicationProtocol 26
Javascript Enabled: false

ApplicationProtocol 23
type: Application Protocol
comment: FTP
Id: __FTP
Name: FTP
Normative Status: Utility

Delivery Context
type: Class
comment: This class represents the set of characteristics that describes the context in which materials are exchanged between a service and a device
subclass of: Context Entity
subclass of: Aspect
subclass of: Restriction
  max cardinality: 1
  on property: Current Device
subclass of: Restriction
  max cardinality: 1
  on property: Current User Agent
subclass of: Class
  union of: Restriction
    on property: Current Device
    some values from: Device
  union of: Restriction
    on property: Current User Agent
    some values from: User Agent
  union of: Restriction
    on property: Current Runtime Environment
    some values from: Runtime Environment
subclass of: Restriction
  max cardinality: 1
  on property: Current Network Bearer
subclass of: Restriction
  max cardinality: 1
  on property: Environment
subclass of: Restriction
  max cardinality: 1
  on property: Current Runtime Environment
Informative Reference: http://www.w3.org/TR/di-gloss/#def-delivery-context-v2

Bluetooth Profile
type: Class
comment: This class describes a specific Bluetooth profile used to support a particular user scenario
subclass of: Context Hardware Entity
subclass of: Restriction
  min cardinality: 1
  on property: Name
subclass of: Restriction
  cardinality: 1
  on property: Id
Related UAProf entity: BluetoothProfile

Handling Association
type: Class
comment: This class represents the relationship between an entity (MIME Type, URI Scheme, etc.) and a program capable of handling such entity
subclass of: Context Software Entity
subclass of: Restriction
  cardinality: 1
  on property: Handled Element
subclass of: Restriction
  on property: Handler
  some values from: Program
subclass of: Restriction
  cardinality: 1
  on property: Handler
subclass of: Restriction
  on property: Handled Element
  some values from: Context Entity

XHTML 1 List Module
type: Markup Module
comment: As its name suggests, the List Module provides list-oriented elements
Name: List
normativeReference: http://www.w3.org/TR/2008/REC-xhtml-modularization-20081008/abstract_modules.html#s_listmodule
Normative Status: Utility
Normative URI: http://www.w3.org/TR/2008/REC-xhtml-modularization-20081008/abstract_modules.html#s_listmodule
Public Identifier: -//W3C//ELEMENTS XHTML Lists 1.0//EN

Xhtml1Module Iframe
type: Markup Module
comment: XHTML 1 iFrame Module
Name: Iframe
Normative Status: Utility

Not After
type: DatatypeProperty
type: FunctionalProperty
comment: This property conveys a date that indicates that the certificate in question will not be valid after that date
domain: Certificate
range: dateTime

Network Based Method
type: Class
comment: Location method is of type network based. This means that the final location result is calculated in the network
subclass of: Location Method

Modality
type: Class
comment: This class represents modalities, the type of communication channel used for interaction. It also covers the way an idea is expressed or perceived, or the manner in which an action is performed.
subclass of: Context Common Entity
subclass of: Restriction
  cardinality: 1
  on property: Id
Informative Reference: http://www.w3.org/TR/2003/NOTE-mmi-reqs-20030108/#modality

Tactile Display
type: Class
comment: A display that is tac-sensitive, allowing users to interact directly with the objects shown on the screen
subclass of: Display
subclass of: Input Device

JSR 120
type: J2ME Standard Optional Package
comment: Wireless Messaging API
Name: JSR-120
normativeReference: http://jcp.org/aboutJava/communityprocess/final/jsr120/index2.html
Normative Status: Informative
Version: 1.0
JSR: JSR-000120

Bluetooth Status
type: ObjectProperty
type: FunctionalProperty
comment: This property indicates the Bluetooth Status of a device
domain: Device
range: Bluetooth Status

XHTML 1 Hypertext Module
type: Markup Module
comment: The Hypertext Module provides the element that is used to define hypertext links to other resources.
Name: Hypertext
normativeReference: http://www.w3.org/TR/2008/REC-xhtml-modularization-20081008/abstract_modules.html#s_hypertextmodule
Normative Status: Utility
Public Identifier: -//W3C//ELEMENTS XHTML Hypertext 1.0//EN

Normative
type: Normative Status
comment: This isntance represents a "normative" status
Normative Status: Utility

FeatureRestriction 12
type: Feature Restriction
Id: WindowProperty
Restricted Element: XmlHttpRequest
Restriction Value: true

XHTML 1 1
type: XML Format
type: Standard Page Markup
comment: XHTML 1.1
Name: XHTML
Normative Status: Utility
Version: 1.1
Public Identifier: -//W3C//DTD XHTML 1.1//EN

Usable Pixels X
type: DatatypeProperty
type: FunctionalProperty
comment: The typical number of pixels in the X direction of the display which can be used within a delivery context. This may be less than the total number available due to the presence of additional items on the display
domain: Delivery Context
range: int
Related DDR Core Vocabulary Property: displayWidth
Related UAProf entity: BrowserScreenSize

Voice Input Modality
type: Input Modality
comment: Modality that consists of input introduction by means of voice
Id: __InputModality_Voice
Name: Voice
Normative Status: Normative

AllSibling Disjoint
type: All Disjoint Set
Disjoint Class: loc:GeoCoordinateRS
Disjoint Class: loc:GeoCoordinates
Disjoint Class: loc:Location
Disjoint Class: loc:LocationMethod
Disjoint Class: loc:LocationProvider
Disjoint Class: loc:Position

Italics
type: Font Style
comment: Italics style
Id: __FontStyle_Italics
Name: Italics
Normative Status: Normative

Battery Being Charged
type: DatatypeProperty
type: FunctionalProperty
comment: This property indicates whether the battery is currently being charged or not
domain: Battery
range: boolean

Runtime Environment
type: Class
comment: This class represents a runtime environment present in a device. It can be a JRE, Brew or any other technology
subclass of: Program

Associated Entity
type: Class
comment: This is the base class for associated entities in the ontology. Classes derived from this are not part of the delivery context. Rather, they provide information that could, for example, be used to help create normative documentation from the definitions for the delivery context
Normative Status: Utility

Memory
type: ObjectProperty
comment: This property represents the hardware memory component/s of a device
domain: Device Hardware
range: Memory Unit
sub property of: Hardware Component

UTF-8
type: Character Set
Character Set Name: UTF-8
Name: UTF-8

StyleLanguage 41
type: Style Language
Name: CSS Mobile Profile
Version: 1.0

Standard Number
type: DatatypeProperty
type: FunctionalProperty
comment: This is a generic property that holds a machine-readable string that identifies univoquely an standard, for example, EN 302 409 or TS 102 221
range: string

DOM Level 2 Style Api
type: Web Browser API
comment: Document Object Model (DOM) Level 2 Style Specification
Id: http://www.w3.org/TR/2000/REC-DOM-Level-2-Style-20001113
Name: DOM Level 2 Style Module
normativeReference: http://www.w3.org/TR/2000/REC-DOM-Level-2-Style-20001113
Normative Status: Utility
Normative URI: http://www.w3.org/TR/2000/REC-DOM-Level-2-Style-20001113
Version: 1.0

SVG 1 1
type: Standard Page Markup
type: XML Format
type: Image Format
comment: SVG 1.1
Name: SVG
Normative Status: Utility
Version: 1.1
Namespace: http://www.w3.org/2000/svg
Public Identifier: -//W3C//DTD SVG 1.1//EN

JavaPlatform 3
type: Java Platform
comment: J2SE 1.2
Name: J2SE
Version: 1.2

Version
type: DatatypeProperty
type: FunctionalProperty
comment: The version number assigned to something by its vendor
range: string
Related DDR Core Vocabulary Property: version
Related UAProf entity: WmlScriptVersion
Related UAProf entity: WmlVersion
Related UAProf entity: JavaScriptVersion
Related UAProf entity: HtmlVersion
Related UAProf entity: OSVersion
Related UAProf entity: WapVersion
Related UAProf entity: XhtmlVersion
Related UAProf entity: WtaVersion
Related UAProf entity: BrowserVersion
Related UAProf entity: JVMVersion

Font Style
type: ObjectProperty
type: FunctionalProperty
comment: This property represents the font style of a font
domain: Font
range: Font Style

J2ME Optional Packages
type: ObjectProperty
comment: The optional packages that makes available a J2ME runtime environment
domain: J2ME Runtime Environment
sub property of: Supports

Fantasy
type: Font Family
comment: Generic Fantasy Family
Id: __FontFamily_Fantasy
Name: Fantasy
normativeReference: http://www.w3.org/TR/CSS21/fonts.html#fantasive-def
Normative Status: Normative

BearerType HSUPA
type: Network Bearer Technology
comment: High-Speed Uplink Packet Access
Id: _HSUPA
Name: HSUPA

Xhtml11Module Bidirectional
type: Markup Module
comment: XHTML 1 Bidirectional Module
Name: Bidirectional
Normative Status: Utility

Public Land Mobile Network
type: Class
comment: A public land mobile network (PLMN) is a network that is established and operated by an administration or by a recognized operating agency (ROA) for the specific purpose of providing land mobile telecommunications services to the public
subclass of: Network
subclass of: Restriction
  cardinality: 1
  on property: Mobile Network Code
subclass of: Restriction
  cardinality: 1
  on property: Mobile Country Code

Web Runtime
type: Class
comment: This class represents a Web Runtime capable of executing widgets
subclass of: Runtime Environment
subclass of: Context Web Browser Entity

GSM 900 1800 1900
type: Newtwork Mode
comment: Typical GSM operation in Europe
Network Technology: NetworkType GSM
Operation Band: 1900
Operation Band: 1800
Operation Band: 900

CLDC 1.0
type: J2ME Configuration
comment: J2ME Connected, Limited Device Configuration
Name: CLDC
normativeReference: http://jcp.org/aboutJava/communityprocess/final/jsr030/index.html
Normative Status: Utility
Version: 1.0
JSR: JSR-000030

Partial OMA XHTML MP Forms
type: Markup Module
Name: Partial_OMA_XHTML_MP_Forms

Bluetooth Address
type: DatatypeProperty
type: FunctionalProperty
comment: The Bluetooth address of the device represented in hexadecimal format. he Bluetooth address will be 12 characters long. Valid characters are 0-9 and A-F
domain: Bluetooth Hardware
range: string

MmsClient Example
type: MMS User Agent
MMS Maximum Message Size: 3400
MMS versions: 2.4
Accepted Character Sets: CharacterSet ISO-8859-1
Accepted Transfer Encodings: TransferEncoding Base64

SVG 1 2 Tiny
type: Image Format
type: Standard Page Markup
type: XML Format
comment: SVG 1.2 Tiny
Name: SVG Tiny
Normative Status: Utility
Version: 1.2
Namespace: http://www.w3.org/2000/svg
Public Identifier: -//W3C//DTD SVG 1.2 Tiny//EN

Location Method
type: ObjectProperty
type: FunctionalProperty
comment: The location method used by a LocationProvider for determining the current location
domain: Location Provider
range: Location Method

Standard Page Markup
type: Class
comment: A page markup language, such as HTML or WML
subclass of: Format
subclass of: Context Web Browser Entity
subclass of: Restriction
  max cardinality: 1
  on property: Normative URI
subclass of: Restriction
  cardinality: 1
  on property: Version
subclass of: Restriction
  cardinality: 1
  on property: Id

Geographical Coordinate Systems
type: ObjectProperty
comment: Indicates what are goegraphical coordinate systems supported by the location provider
domain: Location Provider
range: Geographical Coordinate Reference System
sub property of: Supports

Network Bearer Technology
type: Class
comment: This class represents network bearer technologies
subclass of: Context Network Entity
subclass of: Restriction
  min cardinality: 1
  on property: Name
subclass of: Restriction
  cardinality: 1
  on property: Id
Related UAProf entity: NetworkCharacteristics

Altitude
type: DatatypeProperty
type: FunctionalProperty
comment: The altitude as defined by the WGS84 coordinate system
domain: WGS84 Coordinates
range: float

Secondary Camera
type: ObjectProperty
comment: This property represents a secondary camera of a device
domain: Device Hardware
range: Camera
sub property of: Hardware Component

Language Tag
type: DatatypeProperty
type: FunctionalProperty
comment: A language tag according to the rules specified by RFC 4646
domain: Language
range: string
sub property of: Id
normativeReference: http://www.ietf.org/rfc/rfc4646.txt

UMTS 2100
type: Newtwork Mode
Network Technology: NetworkType UMTS W-CDMA
Operation Band: 2100

Cellular Hardware
type: Class
comment: This class represents device hardware that can be used to access to mobile operator telephony networks
subclass of: Hardware Component

BearerType EDGE
type: Network Bearer Technology
comment: Enhanced Data rates for GSM Evolution (EDGE)
Id: _EDGE
Name: EDGE

Device Hardware
type: Class
comment: This class represents the hardware in a device
subclass of: Hardware Component
subclass of: Restriction
  max cardinality: 1
  on property: Primary Camera
subclass of: Restriction
  all values from: Input Device
  on property: Input Devices
subclass of: Restriction
  all values from: Pointing Resolution
  on property: Pointing Resolution
Related UAProf entity: HardwarePlatform

BearerType SMS
type: Network Bearer Technology
Id: _SMS
Name: SMS

Handler
type: ObjectProperty
type: FunctionalProperty
comment: This property represents a program that acts as a handler
domain: Handling Association
range: Program

Network
type: Class
comment: This class represents a Network in the Delivery Context
subclass of: Aspect
subclass of: Context Network Entity
subclass of: Restriction
  on property: Network Mode
  some values from: Newtwork Mode

UriSchema 31
type: URI Schema
URI Scheme Name: https

Qwerty Keyboard
type: Keyboard
comment: Represents a full alphanumeric keyboard
Id: __InputDevice_QwertyKeyboard
Normative Status: Normative

Virtual Keyboard
type: Feature
comment: Virtual keyboard feature indicates that exists a virtual keyboard that facilitiates user input
Id: __Feature_VirtualKeyboard
Name: VirtualKeyboard
Normative Status: Normative

Networks Disjoint
type: All Disjoint Set
Disjoint Class: net:PLMNetwork
Disjoint Class: net:WiredNetwork
Disjoint Class: net:WiFiNetwork

Wired Network
type: Class
comment: This class represents a wired network in general
subclass of: Network

Context Java Entity
type: Class
comment: This class subsumes all the classes that are related to the Java characteristics of a Delivery Context
subclass of: Context Software Entity

Battery Level
type: DatatypeProperty
type: FunctionalProperty
comment: This property holds the percentage of the battery capacity that remains available
domain: Battery
range: int

WGS 84
type: Geographical Coordinate Reference System
comment: The WGS 84 geographic coordinates reference system
Id: __GeoCordinateRS_WGS84
Name: WGS84
Normative Status: Normative

Context Software Entity
type: Class
comment: This class subsumes all the entities in the ontology that have to do with software-specific characterisitics
subclass of: Context Entity

Color Depth
type: DatatypeProperty
type: FunctionalProperty
comment: Count the number of bits used for color definition
range: int
Related DDR Core Vocabulary Property: displayColorDepth
Related UAProf entity: BitsPerPixel

Signal Strength
type: DatatypeProperty
type: FunctionalProperty
comment: This property indicates the relative (from 0 to 100) signal strength offered by a Network in this Context
domain: Network
range: int

Pointing Resolution
type: ObjectProperty
type: FunctionalProperty
comment: This property represents the precision with which pointing can be carried out on a device
domain: Device Hardware
range: Pointing Resolution
Related UAProf entity: PointingResolution

Disjoint3
type: All Disjoint Set
Disjoint Class: soft:Context_SoftwareEntity
Disjoint Set: Main Disjoint Group

Javascript Enabled
type: DatatypeProperty
type: FunctionalProperty
comment: This property indicates whether Javascript is enabled or not in the web browser
domain: Web Browser
range: boolean

termGroups
type: ObjectProperty
type: AnnotationProperty
comment: An annotation property to indicate the term groups of the Delivery Context Ontology
range: Term Group
Normative Status: Utility

Orientation
type: DatatypeProperty
type: FunctionalProperty
comment: This property represents the current orientation of a display
domain: Display
range: DataRange
  one of: 0
  one of: 90
  one of: -90
  one of: 180
sub property of: Supported Orientation

Normative Status
type: Class
comment: This class represents the normative status of an entity in the ontology. It is used as an auxiliary element for automatic documentation generation
subclass of: Associated Entity
subclass of: Class
  one of: Normative
  one of: Informative
  one of: Utility
Normative Status: Utility

WebBrowserApi SVGDOM 1 1
type: Web Browser API
comment: SVG Document Object Model (DOM)
Id: http://www.w3.org/TR/2003/REC-SVG11-20030114/svgdom.html
Name: SVG DOM
normativeReference: http://www.w3.org/TR/2003/REC-SVG11-20030114/svgdom.html
Normative Status: Utility
Normative URI: http://www.w3.org/TR/2003/REC-SVG11-20030114/svgdom.html
Version: 1.1

Language
type: Class
comment: This class represents languages
subclass of: Context Common Entity
subclass of: Restriction
  cardinality: 1
  on property: Language Tag
subclass of: Restriction
  max cardinality: 1
  on property: Language Code

iDEN 800
type: Newtwork Mode
Network Technology: NetworkType iDEN
Operation Band: 800

Microphone
type: Class
comment: This class represents a microphone in a device
subclass of: Input Device

Minimum Download Bandwidth
type: DatatypeProperty
type: FunctionalProperty
comment: This property represents a minimum download bandwidth that can be offered and measured in Kbits/s
domain: Bandwidth Support
range: int

MarkupModule 1
type: Markup Module
Name: Extended_XHTML-MP_Format_Attr

BearerType FLEX
type: Network Bearer Technology
Id: _FLEX
Name: FLEX

Network Mode
type: ObjectProperty
comment: This property represents the network mode of a Network
domain: Network
range: Newtwork Mode

Web Entities Disjoint Group
type: All Disjoint Set
comment: Web Entities Disjoint Group
Disjoint Class: web:MarkupModule
Disjoint Class: web:WebBrowserFeatures

DOMLevel3Events
type: Web Browser API
Name: DOM Level 3 Event Module
Version: Level 3.0

Supported URI Schemes
type: ObjectProperty
comment: The supported URI Schemes of a user agent
domain: User Agent
range: URI Schema
sub property of: Supports
Related UAProf entity: Email-URI-Schemes

Feature
type: Class
comment: This class represents features, which are distinguishing characteristics of an item
subclass of: Context Common Entity
subclass of: Restriction
  min cardinality: 1
  on property: Name
subclass of: Restriction
  cardinality: 1
  on property: Id

HTML 3 2
type: Standard Page Markup
comment: HTML 3.2
Name: HTML
Normative Status: Utility
Version: 3.2
Public Identifier: -//W3C//DTD HTML 3.2//EN

FeatureRestriction 8
type: Feature Restriction
Id: document.layers
Restricted Element: DOM Level 1 Api
Restriction Value: true

Supported Location Providers
type: ObjectProperty
comment: This property is a list of the Location Providers supported by a Device or a Network
domain: Class
  union of: Device
  union of: Network
range: Location Provider
sub property of: Supports

Namespace
type: DatatypeProperty
type: FunctionalProperty
comment: The namespace of an XML format
domain: XML Format
range: anyURI

Tethered
type: DatatypeProperty
type: FunctionalProperty
comment: This property states whether this Device is actuating "tethered" to another Device, giving the latter some kind of wireless connection
domain: Device
range: boolean

MEID
type: DatatypeProperty
type: FunctionalProperty
comment: Mobile Equipment Identifier (MEID) is a globally unique number identifying a physical piece of CDMA mobile station equipment. The number format is defined by the 3GPP2 standard S.R0048 but in practical terms, it can be seen as an IMEI but with hexadecimal digits
domain: Device
range: string
sub property of: Device Identifier

DomLevel0
type: Web Browser API
comment: DOM Level 0
Id: __DOM_Level_0
Name: DOM Level 0
Normative Status: Utility
Version: 0

Subject
type: DatatypeProperty
type: FunctionalProperty
comment: The subject of a certificate
domain: Certificate
range: string

ECMAScript 1.2
type: Script Language
Name: ECMAScript
Version: 1.2

CPU
type: Class
comment: This class describes a central processing unit associated with a device
subclass of: Hardware Component
Related UAProf entity: CPU

NetworkType Mobitex
type: Network Technology
comment: MobiTex Network
Id: _Mobitex
Name: Mobitex

XHTML 1 Structure Module
type: Markup Module
comment: The Structure Module defines the major structural elements for XHTML. These elements effectively act as the basis for the content model of many XHTML family document types.
Name: Structure
normativeReference: http://www.w3.org/TR/2008/REC-xhtml-modularization-20081008/abstract_modules.html#s_structuremodule
Normative Status: Utility
Public Identifier: -//W3C//ELEMENTS XHTML Document Structure 1.0//EN

Restrictions
type: ObjectProperty
comment: The restrictions presented by a context entity
domain: Context Entity
range: Feature Restriction

UTM Coordinates
type: Class
comment: This class represents UTM coordinates
subclass of: Geographical Coordinates
subclass of: Restriction
  has value: UTM
  on property: Georeference System
subclass of: Restriction
  cardinality: 1
  on property: Datum
subclass of: Restriction
  cardinality: 1
  on property: UTM Longitude Zone
subclass of: Restriction
  cardinality: 1
  on property: Easting
subclass of: Restriction
  cardinality: 1
  on property: Northing
subclass of: Restriction
  cardinality: 1
  on property: UTM Latitude Zone
Normative Status: Informative

Utility
type: Normative Status
comment: This instance represents the "utility" status

AllDisjointSet 17
type: All Disjoint Set
Disjoint Class: net:Context_NetworkEntity
Disjoint Class: common:Context_CommonEntity

NetworkType AMPS
type: Network Technology
comment: Advanced Mobile Phone System
Id: _AMPS
Name: AMPS

Xhtml11Module Image
type: Markup Module
comment: XHTML 1 Image Module
Name: Image
Normative Status: Utility

WebBrowserApi 5
type: Web Browser API
Name: DOM Level 3 XPath Module
Version: Level 3.0

Network Bearer
type: Class
comment: This class represents a network bearer in a delivery context
subclass of: Context Network Entity
subclass of: Aspect
subclass of: Restriction
  cardinality: 1
  on property: Network Bearer Technology
subclass of: Restriction
  max cardinality: 1
  on property: Current Upload Bandwidth
subclass of: Restriction
  all values from: Network Bearer Technology
  on property: Network Bearer Technology
subclass of: Restriction
  max cardinality: 1
  on property: Current Download Bandwidth
Related UAProf entity: NetworkCharacteristics

Xhtml11Module Metainformation
type: Markup Module
comment: XHTML 1 Metainformation Module
Name: Metainformation
Normative Status: Utility

Phone Keypad
type: Keyboard
comment: A phone-style keypad where multiple symbols are available through multiple presses of a limited number of keys
Id: __InputDevice_PhoneKeypad
Name: __InputDevice_PhoneKeypad
Normative Status: Normative

MP4
type: Video Format
comment: The MP4 video format
Id: _MP4
Name: MP4
Name: MPEG-4
Version: 4

Xhtml11Module Table
type: Markup Module
comment: XHTML 1 Table Module
Name: Table
Normative Status: Utility

PDC 800 1500
type: Newtwork Mode
Network Technology: NetworkType PDC
Operation Band: 800
Operation Band: 1500

Web Browsing
type: Term Group
comment: This group of terms models a minimal set of properties and classes that allow to represent the features of a Delivery Context related to the support of Web Browsing technologies
Normative Status: Utility
Term Group Prefix: web

Maximum Cache Object Size
type: DatatypeProperty
type: FunctionalProperty
comment: The maximum size of an object in the browser cache in bytes
domain: Web Browser Features
range: unsignedLong

WMLScript13
type: Script Language
Name: WMLScript
Version: 1.3

Default Web Runtime Environment
type: ObjectProperty
comment: This property represents the default Web Runtime Environment on a device
sub property of: Available Web Runtime Environments

IS-95 800 1900
type: Newtwork Mode
Network Technology: NetworkType IS-95
Operation Band: 800
Operation Band: 1900

WGS84 Coordinates
type: Class
comment: This class represents WGS84 coordinates
subclass of: Geographical Coordinates
subclass of: Restriction
  has value: WGS84
  on property: Datum
subclass of: Restriction
  cardinality: 1
  on property: Longitude
subclass of: Restriction
  cardinality: 1
  on property: Latitude
subclass of: Restriction
  has value: WGS 84
  on property: Georeference System

Aspect
type: Class
comment: This class represents Aspects of the Context
subclass of: Context Entity
normativeReference: http://www.w3.org/TR/2008/REC-DDR-Simple-API-20081205/#aspect

Restriction Value
type: DatatypeProperty
comment: The value of a feature restriction
domain: Feature Restriction
range: anySimpleType

Sound Mode
type: Class
comment: This class represents the sound modes that can be chosen by the user of a device
subclass of: Context Common Entity
subclass of: Restriction
  max cardinality: 1
  on property: Name
subclass of: Restriction
  cardinality: 1
  on property: Id

DOM Level 2 Core Api
type: Web Browser API
comment: Document Object Model (DOM) Level 2 Core Specification
Id: http://www.w3.org/TR/2000/REC-DOM-Level-2-Core-20001113
Name: DOM Level 2
normativeReference: http://www.w3.org/TR/2000/REC-DOM-Level-2-Core-20001113
Normative Status: Utility
Normative URI: http://www.w3.org/TR/2000/REC-DOM-Level-2-Core-20001113
Version: 1.0

Default Component
type: ObjectProperty
comment: This is a generic property that represents a default Component (Aspect instance)
range: Aspect
sub property of: Component
sub property of: Default

TZ Name
type: DatatypeProperty
type: FunctionalProperty
comment: This property represents the name of a Zone entry in the database commonly referred to as the TZ database. Specifically, in the database's textual form, the string refers to the name field of a zone line
domain: Timezone

Position
type: Class
comment: This class represents a position, which it is composed by the coordinates of a point on the Earth surface, together with the speed, course, and the corresponding accuracies and timestamp
subclass of: Context Location Entity
subclass of: Restriction
  all values from: Geographical Coordinates
  on property: Coordinates
subclass of: Class
  union of: Restriction
    cardinality: 1
    on property: Coordinates
  union of: Restriction
    cardinality: 1
    on property: ISO 6709:1983 String

Mobile Network Code
type: DatatypeProperty
type: FunctionalProperty
comment: A Mobile Network Code (MNC) is used in combination with a Mobile Country Code (MCC) (also known as a "MCC / MNC tuple") to uniquely identify a mobile phone operator/carrier using the GSM, CDMA, iDEN, TETRA and UMTS public land mobile networks and some satellite mobile networks
domain: Public Land Mobile Network
range: string

FeatureRestriction 14
type: Feature Restriction
Id: interlaced
Restricted Element: gif89a
Restriction Value: true

E-Mail Client
type: Class
comment: This class represents a user agent capable of sending and receiving e-mail
subclass of: User Agent

NetworkType IEEE 802.11a
type: Network Technology
comment: WiFi 802.11a
Id: IEEE 802.11a
Name: IEEE 802.11a

Georeference System
type: ObjectProperty
comment: This property represents the reference system in which are expressed the geographical coordinates
domain: Geographical Coordinates
range: Geographical Coordinate Reference System

Not Before
type: DatatypeProperty
type: FunctionalProperty
comment: This property indicates that this certificate is valid not before this date
domain: Certificate
range: dateTime

BluetoothProfile objectPush
type: Bluetooth Profile
comment: The Bluetooth profile that defines how predefined standard objects, such as virtual business cards, are pushed to another device.
Name: Object Push

Touch Screen
type: Tactile Display
comment: Touch screen that allows pointing to an area on the screen
Id: __InputDevice_TouchScreen
Normative Status: Normative

Mobile Country Code
type: DatatypeProperty
type: FunctionalProperty
comment: This property identifies univoquely the country of a mobile network
domain: Public Land Mobile Network
range: string
normativeReference: http://www.itu.int/itudoc/itu-t/ob-lists/icc/e212_685.pdf

Angle Of Arrival Method
type: Class
comment: Location method Angle of Arrival for cellular / terrestrial RF system
subclass of: Location Method

Partial OMA XHTML MP Legacy
type: Markup Module
Name: Partial_OMA_XHTML_MP_Legacy

Content Type
type: Class
comment: This is a class that represents content types, the combination of a MIME media type, subtype and optional parameters
subclass of: Context Common Entity
normativeReference: http://www.iana.org/assignments/media-types/
normativeReference: http://www.ietf.org/rfc/rfc2046.txt

Maximum Upload Bandwidth
type: DatatypeProperty
type: FunctionalProperty
comment: This property represents a maximum upload bandwidth measured in Kbits/s
domain: Bandwidth Support
range: int

StyleLanguage 43
type: Style Language
Name: W-CSS
Version: 1.0

Input Device
type: Class
comment: This class represents an input mechanism that can be available in a device
subclass of: Hardware Component
subclass of: Restriction
  max cardinality: 1
  on property: Id

globalDisjoints
type: All Disjoint Set
Disjoint Class: common:Context_CommonEntity
Disjoint Class: dcn:Aspect
Disjoint Class: dcn:Environment
Disjoint Set: AllSibling Disjoint
Disjoint Set: Sibling Disjoint1
Disjoint Set: Web Entities Disjoint Group
Disjoint Set: SiblingDisjoint2
Disjoint Set: Sibling Disjoint
Disjoint Set: Java Disjoint

Java Platform
type: Class
comment: This class represents Java Platforms
subclass of: Context Java Entity
subclass of: Restriction
  cardinality: 1
  on property: Name
subclass of: Restriction
  max cardinality: 1
  on property: Version
Related UAProf entity: JavaPlatform

CharacterSet UTF-16
type: Character Set
Character Set Name: UTF-16

JavaPlatform 5
type: Java Platform
comment: J2SE 1.4
Name: J2SE
Version: 1.4

NetworkType iDEN
type: Network Technology
comment: Integrated Digital Enhanced Network
Id: _IDEN
Name: iDEN

Typical Download Bandwidth
type: DatatypeProperty
comment: This property represents a typical download bandwidth measured in Kbits/s
domain: Bandwidth Support
range: int

Pointing Resolution
type: Class
comment: This class represents the precision with which the pointing can be achieved on a device
subclass of: Context Hardware Entity
subclass of: Restriction
  cardinality: 1
  on property: Id
Related UAProf entity: PointingResolution

DOM Level 3 API
type: Web Browser API
comment: Document Object Model (DOM) Level 3 Core Specification
Id: http://www.w3.org/TR/2004/REC-DOM-Level-3-Core-20040407
Name: DOM Level 3 Core
normativeReference: http://www.w3.org/TR/2004/REC-DOM-Level-3-Core-20040407
Normative Status: Utility
Normative URI: http://www.w3.org/TR/2004/REC-DOM-Level-3-Core-20040407
Version: 1.0

JSR135
type: J2ME Standard Optional Package
comment: JSR-135
Name: JSR-135

Xhtml1Module Target
type: Markup Module
comment: XHTML 1 Target Module
Name: Target
Normative Status: Utility

XmlHttpRequest
type: Web Browser API
comment: XMLHttpRequest
Id: http://www.w3.org/TR/2008/WD-XMLHttpRequest-20080415/
Name: XMLHttpRequest Level 1
Normative Status: Utility
Normative URI: tp://www.w3.org/TR/2008/WD-XMLHttpRequest-20080415/

E-OTD
type: Time Difference Method
type: Time of Arrival Method
type: Network Based Method
type: Assisted Method
comment: E-OTD systems operate by placing location receivers or reference beacons, overlaid on the wireless network as a location measurement units (LMU) at multiple sites geographically dispersed in a wide area.
Name: E-OTD

TimesFont10
type: Font
comment: Example instances with a Times Roman 10 font
Font Family: Times New Roman
Font Size: 10

Media Recorder
type: Class
comment: This class represents a user agent capable of recording different kind of media, such as a audio or video
subclass of: User Agent

Xhtml11Module BasicTables
type: Markup Module
comment: XHTML 1 Basic Tables Module
Name: BasicTables
Normative Status: Utility

LocationProvider ExampleGPS
type: Location Provider
comment: A location provider based on a GPS receiver
Horizontal Accuracy: 1
Location Costs Money: false
Location Method: TerminallGPSUnAssisted
Geographical Coordinate Systems: UTM
Geographical Coordinate Systems: WGS 84
Vertical Accuracy: 2

Partial OMA XHTML MP IntrinsicEvents
type: Markup Module
Name: Partial_OMA_XHTML_MP_IntrinsicEvents

Supported Bluetooth Profiles
type: ObjectProperty
comment: This property defines the Bluetooth profiles supported by the device
domain: Bluetooth Hardware
range: Bluetooth Profile
sub property of: Supports
Related UAProf entity: BluetoothProfile

Sibling Disjoint
type: All Disjoint Set
Disjoint Class: hard:HardwareStatus
Disjoint Class: hard:BluetoothStatus
Disjoint Class: hard:PointingResolution
Disjoint Class: hard:BluetoothProfile

Content Type Name
type: DatatypeProperty
comment: This property identifies unequivocally a content type. It is the concatenation of the MIME Media type, subtype and optional parameters according to the syntax specified on RFC 2045, section 5.1
domain: Content Type
sub property of: Id
normativeReference: http://tools.ietf.org/html/rfc2045#section-5.1

i-XHTML 1 0
type: XML Format
type: Standard Page Markup
comment: Japanese i-XHTML 1.0
Name: i-XHTML
Version: 1.0
Public Identifier: -//i-mode group (ja)//DTD XHTML i-XHTML(Locale/Ver.=ja/1.0) 1.0//EN

WebBrowserFeatures 1
type: Web Browser Features
Cache Size: 2048
Maximum Cache Object Size: 256
Maximum Downloadable Object Size: 4096
Maximum Embedded Object Size: 1024
Maximum Total Page Weight: 10240
Renders Tables: true
Shows Access Keys: true
Shows Page Title: true
Supports Access Keys: true
Supports Cookies: true

Hardware Status
type: Class
comment: This class represents the status of a hardware component
subclass of: Context Hardware Entity

NetworkType CDMA2000 1xRTT
type: Network Technology
comment: CDMA 2000 1xRTT
Id: _CDMA2000_1xRTT
Name: CDMA2000_1xRTT
Name: 1xrtt

DeviceHardware Hypothetical Device
type: Device Hardware
Battery: Battery Hyp Devi
Built-in Memory: MemoryUnit Hyp Dev Internal
Display: Display Hypothetical Device
Extension Memory: MemoryUnit Hyp Dev Card
Input Character Sets: UTF-8
Input Character Sets: CharacterSet CharacterSet UTF-7
Input Character Sets: CharacterSet UTF-16
Input Character Sets: CharacterSet UTF-16le
Input Character Sets: CharacterSet UTF-16be
Input Character Sets: CharacterSet ISO-8859-2
Input Character Sets: CharacterSet ISO-10646-UCS-2
Input Character Sets: CharacterSet ISO-8859-1
Input Character Sets: CharacterSet WINDOWS-1252
Input Character Sets: CharacterSet US-ASCII
Output Character Sets: CharacterSet ISO-10646-UCS-2
Output Character Sets: CharacterSet UTF-16be
Output Character Sets: CharacterSet UTF-16
Output Character Sets: CharacterSet ISO-8859-2
Output Character Sets: CharacterSet US-ASCII
Output Character Sets: UTF-8
Output Character Sets: CharacterSet ISO-8859-1
Output Character Sets: CharacterSet CharacterSet UTF-7
Output Character Sets: CharacterSet WINDOWS-1252
Output Character Sets: CharacterSet UTF-16le
Pointing Resolution: Pixel Pointing Resolution
Number of Soft Keys: 0

MIME Type
type: ObjectProperty
comment: These are the MIME types associated with this type of format
domain: Format
range: Content Type

Satellite Method
type: Class
comment: The location method uses satellites to assist in obtaining the location
subclass of: Location Method

Current User Agent
type: ObjectProperty
type: FunctionalProperty
comment: The user agent currently used by the user and responsible of the current interaction in a Delivery Context
domain: Delivery Context
range: User Agent
sub property of: Active

gif89a
type: Image Format
Id: _GIF89A
Name: GIF89a
Version: 89a

Horizontal Accuracy
type: DatatypeProperty
type: FunctionalProperty
comment: Stimate of the horizontal accuracy of the location in metres
domain: Class
  union of: Position
  union of: Location Provider
range: int

Operating System
type: Class
comment: This class represents operating systems
subclass of: Program

Typical Upload Bandwidth
type: DatatypeProperty
type: FunctionalProperty
comment: This property represents a typical upload bandwith measured in Kbits/s
domain: Bandwidth Support
range: int

cHTML
type: Standard Page Markup
comment: Compact HTML
Name: cHTML
Version: 1
Public Identifier: -//W3C//DTD Compact HTML 1.0 Draft//EN

User Agent
type: Class
comment: This class represents a client within a device
subclass of: Application Program
Informative Reference: http://www.w3.org/TR/di-gloss/#def-user-agent

sip
type: URI Schema
Name: sip
URI Scheme Name: sip

Hardware Component
type: ObjectProperty
comment: This property represents a hardware component
domain: Device Hardware
range: Hardware Component
sub property of: Component

Sibling Disjoint2
type: All Disjoint Set
Disjoint Class: hard:NfcHardware
Disjoint Class: hard:Display
Disjoint Class: hard:BluetoothHardware
Disjoint Class: hard:Camera
Disjoint Class: hard:WiFiHardware
Disjoint Class: hard:Microphone
Disjoint Class: hard:DeviceHardware
Disjoint Class: hard:Battery
Disjoint Class: hard:MemoryUnit
Disjoint Class: hard:CPU
Disjoint Class: hard:Speaker
Disjoint Class: hard:CellularHardware
Disjoint Set: Sibling Disjoint

NetworkType CDMA2000 EVDO
type: Network Technology
Id: _CDMA2000_EVDO
Name: CDMA2000 EVDO
Name: EVDO

Disjoint5
type: All Disjoint Set
Disjoint Class: loc:Context_LocationEntity
Disjoint Set: Main Disjoint Group

JavaMaxMemorySize
type: DatatypeProperty
type: FunctionalProperty
comment: Indicates the device's maximum size in bytes for storing Java applications
domain: Device
range: unsignedLong

Connected Networks
type: ObjectProperty
comment: The networks to which a device is currently connected
domain: Network Support
range: Network

Xhtml11Module IntrinsicEvents
type: Markup Module
comment: XHTML 1 Intrinsic Events Module
Name: Intrinsic Events
Normative Status: Utility

MobileNetwork 1
type: Network
comment: Example Mobile Network
Name: Example_Network
Normative Status: Informative
Mobile Country Code: 224
Network Mode: GSM 900 1800 1900

Stylus
type: Input Device
comment: Represents a stylus
Id: __InputDevice_Stylus
Normative Status: Normative

Disjoint Class
type: DatatypeProperty
comment: This property contains the URI of a disjoint class in a AllDisjointSet. The URI is represented following the CURIE notation
domain: All Disjoint Set
range: string
Normative Status: Utility

SiblingDisjoint 2
type: All Disjoint Set
Disjoint Class: net:Network
Disjoint Class: net:NetworkBearer
Disjoint Class: net:Proxy
Disjoint Set: Sibling Disjoint

XHTML MP 1 1
type: XML Format
type: Standard Page Markup
comment: XHTML MP 1.1
Name: XHTML-MP
Normative Status: Utility
Version: 1.1
Markup Modules: Partial OMA XHTML MP IntrinsicEvents
Markup Modules: Partial OMA XHTML-MP Presentation
Markup Modules: Partial OMA XHTML MP Forms
Markup Modules: Partial OMA XHTML MP Legacy
Public Identifier: -//WAPFORUM//DTD XHTML Mobile 1.1//EN

Pixel Aspect Ratio
type: DatatypeProperty
type: FunctionalProperty
comment: The pixel aspect ratio as a decimal value, for example 1.33 for a 4:3 aspect. The pixel aspect ratio is the ratio of the resolution width in pixels, to the resolution height in pixels
range: float
Related UAProf entity: PixelAspectRatio

WiFi Network
type: Class
comment: This class represents a WiFi network
subclass of: Network
subclass of: Restriction
  cardinality: 1
  on property: Service Set Identifier

Cache Size
type: DatatypeProperty
type: FunctionalProperty
comment: The size of the cache (in bytes) implemented by the browser
domain: Web Browser Features
range: unsignedLong

Click Wheel
type: Input Device
comment: A wheel that is normally placed either below the screen or on the side of the device that lets the user quickly move up and down and click on link or items on the screen
Id: __InputDevice_ClickWheel
Normative Status: Normative

XHTML Basic 1 1
type: XML Format
type: Standard Page Markup
comment: XHTML Basic 1.1
Name: XHTML-Basic
Normative Status: Utility
Version: 1.1
Markup Modules: XForms OMA TextInputModes
Public Identifier: -//W3C//DTD XHTML Basic 1.1//EN

NetworkType PHS
type: Network Technology
comment: Personal Handy-phone System
Id: _PHS
Name: PHS

Character Set
type: Class
comment: This class represents specific character sets officially identified by IANA
subclass of: Context Common Entity
subclass of: Restriction
  cardinality: 1
  on property: Character Set Name
normativeReference: http://tools.ietf.org/html/rfc2045#section-2.2
Related UAProf entity: CcppAccept-Charset
Related UAProf entity: OutputCharset
Related UAProf entity: InputCharset

Time Zone String
type: DatatypeProperty
type: FunctionalProperty
comment: This property is a string that denotes the timezone as per the rules defined by POSIX 1003.1 in Section 8.3
domain: Timezone
range: string

Maximum Embedded Object Size
type: DatatypeProperty
type: FunctionalProperty
comment: Maximum size in bytes for media embedded in web pages
domain: Web Browser Features
range: unsignedLong

Primary Camera
type: ObjectProperty
type: FunctionalProperty
comment: This property represents the primary camera of a device
domain: Device Hardware
range: Camera
sub property of: Hardware Component
sub property of: Primary

Default Network Bearer
type: ObjectProperty
comment: This property represents the default Network Bearer for a Device
domain: Network Support
range: Network Bearer
sub property of: Default Component
sub property of: Supported Network Bearers

Transparent HTTP Proxy
type: Class
comment: An HTTP proxy that does not modify the request or response beyond what is required for proxy authentication and identification.
subclass of: Http Proxy
normativeReference: http://www.ietf.org/rfc/rfc2616.txt

Script Language
type: Class
comment: This class represents a Script language
subclass of: Context Web Browser Entity
subclass of: Format
subclass of: Restriction
  cardinality: 1
  on property: Name
subclass of: Restriction
  cardinality: 1
  on property: Normative URI

Datum
type: DatatypeProperty
type: FunctionalProperty
comment: The datum that express the reference of the coordinates
domain: Geographical Coordinates
range: string

Xhtml11Module Link
type: Markup Module
comment: XHTML 1 Link Module
Name: Link
Normative Status: Utility

Related UAProf entity
type: DatatypeProperty
type: AnnotationProperty
comment: The name of the related UAProf entities
range: string
Normative Status: Informative

BluetoothProfile genericAccess
type: Bluetooth Profile
comment: The Bluetooth profile that defines the basic level of function that all devices must implement.
Name: Generic Access

CharacterSet US-ASCII
type: Character Set
Character Set Name: ANSI_X3.4-1968
Name: ISO_646.irv:1991
Name: US-ASCII

Operation Band
type: DatatypeProperty
comment: The frequencies of operation of a network. Frequencies are expressed in Mhz
domain: Newtwork Mode
range: int

Push Application Ids
type: DatatypeProperty
comment: This property represents the list of types of Push-enabled applications supported by the device. Application identifiers are represented on absolute URI format. A wildcard ("*") may be used to indicate support for any application
domain: Device Software
range: string
normativeReference: http://www.openmobilealliance.org/tech/omna/omna-push-app-id.htm

gif87
type: Image Format
Id: _GIF87
Name: GIF
Name: GIF87
Version: 87

Muted
type: DatatypeProperty
type: FunctionalProperty
comment: Indicates if a speaker or microphone is muted or not
domain: Class
  union of: Speaker
  union of: Microphone
range: boolean

XML Format
type: Class
comment: This class represents formats that are represented using XML
subclass of: Format
subclass of: Restriction
  cardinality: 1
  on property: Namespace

UTM Coordinates
type: ObjectProperty
type: FunctionalProperty
comment: Coordinates of a point expressed in the UTM reference system
range: UTM Coordinates
sub property of: Coordinates
Normative Status: Informative

Silence
type: Sound Mode
comment: Silence Sound Mode
Id: __SoundMode_Silence
Name: Silence
Normative Status: Normative

Primary
type: ObjectProperty
comment: This property represents a relationship between the device hardware and the primary components it contains
sub property of: Hardware Component

Location
type: Term Group
comment: This group of terms is aimed at defining a set of classes, properties and instances that have to do with Geographic Location
Normative Status: Utility
Term Group Prefix: loc

AllDisjointSet 19
type: All Disjoint Set
Disjoint Class: common:Context_CommonEntity
Disjoint Class: soft:Context_SoftwareEntity
Disjoint Class: hard:Context_HardwareEntity

Maximum Heap Size
type: DatatypeProperty
type: FunctionalProperty
comment: The maximum heap size in bytes supported by a Java Runtime Environment
domain: Java Runtime Environment
range: unsignedLong

Cursive
type: Font Family
comment: Generic Cursive Family
Id: __FontFamily_Cursive
Name: Cursive
normativeReference: http://www.w3.org/TR/CSS21/fonts.html#cursive-def
Normative Status: Normative

ApplicationProtocol 27
type: Application Protocol
comment: WSP Connection-Less
Id: __WSP-CL
Name: WSP-CL
Normative Status: Utility

Certificates
type: ObjectProperty
comment: Installed certificates in a device or user agent
domain: Class
  union of: Device Software
  union of: User Agent
range: Certificate
sub property of: Available

SiblingDisjoint2
type: All Disjoint Set
Disjoint Class: web:WebBrowser
Disjoint Class: web:WebBrowserApi
Disjoint Class: web:PageMarkup
Disjoint Class: web:StyleLanguage
Disjoint Class: web:ScriptLanguage
Disjoint Class: net:Proxy
Disjoint Set: Web Entities Disjoint Group

Output Modality
type: Class
comment: This class represents output modalities
subclass of: Modality

Font Size
type: DatatypeProperty
type: FunctionalProperty
comment: The absolute size of a font measured in points
domain: Font
range: int

Default Web Browser
type: ObjectProperty
type: FunctionalProperty
comment: The default Web Browser in a device
domain: Device Software
range: Web Browser
sub property of: Available User Agents
sub property of: Default Component

Top Level Disjoint Group
type: All Disjoint Set
comment: Global Disjoint
Disjoint Class: dcn:Context_Entity
Disjoint Class: dcn:Associated_Entity
Normative Status: Utility

Track Ball
type: Input Device
comment: A little sphere that acts like a trackball mouse
Id: __InputDevice_TrackBall
Normative Status: Normative

CharacterSet ISO-8859-2
type: Character Set
Character Set Name: ISO_8859-2:1987
Name: ISO-8859-2

TerminallGPSUnAssisted
type: Satellite Method
type: Unassisted Method
type: Terminal Based Method
comment: Location method GPS assisted with no network cooperation
Name: TerminallGPSUnAssisted

Network Support
type: Class
comment: This class represents the network characteristics of a device
subclass of: Context Network Entity
subclass of: Restriction
  on property: Supported Network Modes
  some values from: Newtwork Mode
subclass of: Restriction
  on property: Supported Network Bearers
  some values from: Network Bearer

CharacterSet ISO-10646-UCS-2
type: Character Set
Character Set Name: ISO-10646-UCS-2

Style Language
type: Class
comment: This class represents a Style language
subclass of: Format
subclass of: Context Web Browser Entity
subclass of: Restriction
  cardinality: 1
  on property: Normative URI
subclass of: Restriction
  cardinality: 1
  on property: Name

JTWI Runtime Environment
type: Class
comment: This class represents a JTWI-compliant J2ME runtime environment
subclass of: J2ME Runtime Environment
subclass of: Restriction
  has value: MIDP 2.0
  on property: Supported J2ME Profiles
subclass of: Restriction
  has value: CLDC 1.0
  on property: Supported J2ME Configurations
subclass of: Restriction
  has value: JSR 120
  on property: J2ME Optional Packages
Normative Status: Informative

Newtwork Mode
type: Class
comment: A mode of operation of a network which includes network technology and operation frequency bands
subclass of: Context Network Entity
subclass of: Restriction
  all values from: Network Technology
  on property: Network Technology
subclass of: Restriction
  cardinality: 1
  on property: Network Technology
subclass of: Restriction
  min cardinality: 1
  on property: Operation Band

X.509 Certificate
type: Class
comment: This class represents an X.509 certificate
subclass of: Certificate
subclass of: Restriction
  max cardinality: 1
  on property: Serial Number

Sibling Disjoint
type: All Disjoint Set
Disjoint Class: net:BandwidthSupport
Disjoint Class: net:NetworkBearerTechnology
Disjoint Class: net:NetworkMode
Disjoint Class: net:NetworkSupport
Disjoint Class: net:NetworkTechnology

UTM Longitude Zone
type: DatatypeProperty
type: FunctionalProperty
comment: This property represents the longitude zone according to the UTM coordinate system
domain: UTM Coordinates
range: int
Normative Status: Informative

BluetoothProfile genericObjExch
type: Bluetooth Profile
comment: The Bluetooth profile that defines how the Infra Red Data Association's OBEX object exchange protocol is used to allow devices to exchange objects.
Name: Generic Object Exchange

Video Format
type: Class
comment: This class represents a particular video format, such as AVI or MP4
subclass of: Format

FeatureRestriction 16
type: Feature Restriction
Id: getElementById
Restricted Element: DOM Level 1 Api
Restriction Value: true

LocMeth Disjoint1
type: All Disjoint Set
Disjoint Class: loc:UnassistedLocMethod
Disjoint Class: loc:AssistedLocMethod

Video Player
type: Class
comment: This class represents user agents capable of dealing with video formats
subclass of: Media Player
subclass of: Restriction
  on property: Supported Formats
  some values from: Video Format

Xhtml11Module Scripting
type: Markup Module
comment: XHTML 1 Scripting Module
Name: Scripting
Normative Status: Utility

Battery
type: Class
comment: This class represents a battery in a device
subclass of: Hardware Component

Program Disjoint
type: All Disjoint Set
Disjoint Class: soft:Application
Disjoint Class: soft:OperatingSystem
Disjoint Class: soft:RuntimeEnvironment

HTTP Scheme
type: URI Schema
comment: This instance represents the "http" URI Scheme
Name: HTTP Schema
normativeReference: http://www.ietf.org/rfc/rfc2616.txt
Normative Status: Normative
URI Scheme Name: http

Battery
type: ObjectProperty
comment: This property represents one or more batteries in a device
domain: Device Hardware
range: Battery
sub property of: Hardware Component

CPU Maximum Frequency
type: DatatypeProperty
type: FunctionalProperty
comment: Processor maximum speed
domain: CPU
range: int
Related UAProf entity: CPUMaximumFrequency

WML 1 1
type: XML Format
type: Standard Page Markup
comment: WML 1.1
Name: WML
Normative Status: Utility
Version: 1.1
Public Identifier: -//WAPFORUM//DTD WML 1.1//EN

Java Disjoint
type: All Disjoint Set
Disjoint Class: java:J2meConfiguration
Disjoint Class: java:J2meProfile
Disjoint Class: java:JavaPlatform

WebBrowser x
type: Web Browser
Name: FashionBrowser
Version: 6.31
Accepted Character Sets: CharacterSet ISO-8859-1
Accepted Character Sets: UTF-8
Accepted Transfer Encodings: TransferEncoding Base64
Accepted Transfer Encodings: TransferEncoding 7bit
APIs: XmlHttpRequest
APIs: DomLevel0
Supported Application Protocols: ApplicationProtocol 24
Supported Application Protocols: ApplicationProtocol 23
Supported Application Protocols: ApplicationProtocol 22
Supported URI Schemes: UriSchema 32
Supported URI Schemes: UriSchema 34
Supported URI Schemes: HTTP Scheme
Javascript Enabled: false

Speaker
type: Class
comment: This class represents a speaker component in a device
subclass of: Output Device

ApplicationProtocol 22
type: Application Protocol
comment: HTTPS
Id: __HTTPS
Name: HTTPS
Normative Status: Utility

Environment
type: ObjectProperty
type: FunctionalProperty
comment: The current physical environment associated to a Delivery Context
domain: Delivery Context
range: Environment
sub property of: Active

Display Hypothetical Device
type: Display
comment: The display for the Hypothetical device
Color Depth: 16

Position
type: ObjectProperty
type: FunctionalProperty
comment: The position associated to a Location
domain: Location
range: Position

JavaPlatform 7
type: Java Platform
comment: J2EE 1.4
Name: J2EE
Version: 1.4

Location Costs Money
type: DatatypeProperty
type: FunctionalProperty
comment: This property indicates whether the location provider has a cost for the user
domain: Location Provider
range: boolean

DeviceSoftware Hyp Devi
type: Device Software
comment: Device Software Example
Default Java Runtime Environment: J2meRuntimeEnvironment 20
Certificates: xx
Fonts: TimesFont10
Default Web Browser: WebBrowser x

Java Platforms
type: ObjectProperty
comment: The Java Platforms supported by a Java Runtime Environment
domain: Java Runtime Environment
range: Java Platform
sub property of: Supports

Supports Access Keys
type: DatatypeProperty
type: FunctionalProperty
comment: This property indicates whether the browser supports access keys or not
domain: Web Browser Features
range: boolean

NetworkType CDMA2000 EVDV
type: Network Technology
Id: _CDMA2000_EVDV
Name: CDMA2000 EVDV

Gesture Input Modality
type: Input Modality
comment: Modality that consists of the realization of gestures to input information or commands to the system
Id: __InputModality_Gesture
Name: Gesture
Normative Status: Normative

MIDP 1.0
type: J2ME Profile
comment: Mobile Information Device Profile (MIDP)
Name: MIDP
normativeReference: http://jcp.org/aboutJava/communityprocess/final/jsr037/index.html
Normative Status: Utility
Version: 1.0
JSR: JSR-000037

Battery Capacity
type: DatatypeProperty
type: FunctionalProperty
comment: The capacity of a battery, as an amount of electric charge that it can store, measured in ampere-hours
domain: Battery
range: float

WiFi80211b 2400
type: Newtwork Mode
Network Technology: NetworkType IEEE 802.11b
Operation Band: 2400

NetworkType IS-95
type: Network Technology
comment: IS-95
Id: IS 95
Name: IS-95

Display
type: Class
comment: This class represents a visual display on a device
subclass of: Output Device
Related UAProf entity: HardwarePlatform

Tactile Output Modality
type: Output Modality
comment: This is a tactile modality in which user receives information from the system by means of the tac
Id: __OutputModality_Tactile
Name: Tactile
Normative Status: Normative

Unassisted Method
type: Class
comment: Location method is unassisted it does not need other party in order to obtain the location
subclass of: Location Method

Output Character Sets
type: ObjectProperty
comment: This property defines the character sets supported by the device for output
domain: Device Hardware
range: Character Set
sub property of: Supports
Related UAProf entity: OutputCharSet

Display
type: ObjectProperty
comment: This property represents a display associated with a device
domain: Device Hardware
range: Display
sub property of: Hardware Component

Camera
type: Class
comment: This class represents a camera in a device
subclass of: Input Device

BearerType REFLEX
type: Network Bearer Technology
Id: _REFLEX
Name: REFLEX

On
type: Hardware Status
comment: This status indicates that the hardware component is on
Id: __HardwareStatus_On
Name: On
Normative Status: Normative

Associated Disjoint
type: All Disjoint Set
Disjoint Class: common:AllDisjointSet
Disjoint Class: common:NormativeStatus
Disjoint Class: common:TermGroup

Application Protocol
type: Class
comment: This class represents application-level protocols
subclass of: Context Common Entity
subclass of: Restriction
  cardinality: 1
  on property: Id
Related UAProf entity: Push-SupportedBearers

Font Style
type: Class
comment: This class denotes font styles
subclass of: Context Software Entity
subclass of: Restriction
  min cardinality: 1
  on property: Name
normativeReference: http://www.w3.org/TR/CSS21/fonts.html#font-styling

MIME TYPE GIF
type: Content Type
Content Type Name: image/gif
Normative Status: Utility

FeatureRestriction 11
type: Feature Restriction
Id: ActiveXBased
Restricted Element: XmlHttpRequest
Restriction Value: false

XHTML 1 0
type: XML Format
type: Standard Page Markup
comment: XHTML 1.0
Name: XHTML
Normative Status: Utility
Version: 1.0
Public Identifier: -//W3C//DTD XHTML 1.0 Strict//EN

Character Pointing Resolution
type: Pointing Resolution
comment: The pointing device can select an individual character
Id: __PointingResolution_Character
Name: character
Normative Status: Normative

Latitude
type: DatatypeProperty
type: FunctionalProperty
comment: Latitude as defined by the WGS84 coordinate reference system
domain: WGS84 Coordinates
range: float

Assisted Method
type: Class
comment: Location method is assisted by the other party (Terminal assisted for Network based, Network assisted for terminal based)
subclass of: Location Method

Location Timestamp
type: DatatypeProperty
type: FunctionalProperty
comment: A timestamp that indicates when it was obtained the position in question
domain: Position
range: dateTime

Geographical Coordinates
type: Class
comment: This class represents geographical coordinates that allow to locate precisely a point on the Earth surface
subclass of: Context Location Entity
subclass of: Restriction
  cardinality: 1
  on property: Georeference System
subclass of: Restriction
  on property: Georeference System
  some values from: Geographical Coordinate Reference System

Certificate
type: Class
comment: This class represents a digital certificate
subclass of: Context Software Entity
subclass of: Restriction
  cardinality: 1
  on property: Not Before
subclass of: Restriction
  cardinality: 1
  on property: Subject
subclass of: Restriction
  cardinality: 1
  on property: Not After
subclass of: Restriction
  cardinality: 1
  on property: Issuer

Shows Page Title
type: DatatypeProperty
type: FunctionalProperty
comment: Indicates whether the browser displays the title of the current page or not
domain: Web Browser Features
range: boolean

Hardware Component
type: Class
comment: This class represents a hardware component of a Device
subclass of: Context Hardware Entity
subclass of: Aspect
subclass of: Restriction
  all values from: Hardware Status
  on property: Status

Common
type: Term Group
comment: They are a set of general purpose, generic classes, properties and instances which are used to support the modelling of the different aspects of a Delivery Context
Normative Status: Utility
Term Group Prefix: common

SVG 1 0
type: XML Format
type: Image Format
type: Standard Page Markup
comment: SVG 1.0
Name: SVG
Normative Status: Utility
Version: 1.0
Namespace: http://www.w3.org/2000/svg
Public Identifier: -//W3C//DTD SVG 1.0//EN

Available User Agents
type: ObjectProperty
comment: This property represents the available User Agents on a device
domain: Device Software
range: User Agent
sub property of: Component
sub property of: Available

JavaPlatform 2
type: Java Platform
comment: J2SE 1.1
Name: J2SE
Version: 1.1

Serial Number
type: DatatypeProperty
type: FunctionalProperty
comment: The serial number of something
range: string
sub property of: Id

Device Hardware
type: ObjectProperty
type: FunctionalProperty
comment: This property represents the hardware associated with a device
domain: Device
range: Device Hardware

Java Runtime Environment
type: Class
comment: This class represents Java Runtime Environments
subclass of: Runtime Environment
subclass of: Context Java Entity

Output Device
type: Class
comment: This class represents an output mechanism that can be available in a device
subclass of: Hardware Component

OperatingSystem SymbianOS7
type: Operating System
comment: Example Operating System
Name: MyOperatingSystem
Version: 7

Font Family
type: Class
comment: This class represents Font Familiies
subclass of: Context Software Entity
subclass of: Restriction
  min cardinality: 1
  on property: Name
normativeReference: http://www.w3.org/TR/CSS21/fonts.html#font-family-prop

CharacterSet UTF-16le
type: Character Set
Character Set Name: UTF-16LE

Active
type: ObjectProperty
comment: This is a generic property that represents what Components (Aspect instances) are active in the Context of an Aspect
domain: Aspect
range: Aspect
sub property of: Component
sub property of: Active

Normative Status
type: ObjectProperty
type: AnnotationProperty
type: FunctionalProperty
comment: This annotation property indicates the normative status of an entity in the ontology. The criteria used is that classes and properties are normative by default. On the other hand instances are not normative by default
domain: Context Entity
range: Normative Status
Normative Status: Utility

Size
type: DatatypeProperty
type: FunctionalProperty
comment: This property represents the total size of a hardware element (memory, registry, etc.) in bytes
domain: Memory Unit
range: unsignedLong

Character Set Name
type: DatatypeProperty
comment: The name of a charset officially assigned by IANA
domain: Character Set
sub property of: Id
normativeReference: http://www.iana.org/assignments/character-sets

DOM Level 2 Events API
type: Web Browser API
comment: Document Object Model (DOM) Level 2 Events Specification
Id: http://www.w3.org/TR/2000/REC-DOM-Level-2-Events-20001113
Name: DOM Level 2 Events
normativeReference: http://www.w3.org/TR/2000/REC-DOM-Level-2-Events-20001113
Normative Status: Utility
Normative URI: http://www.w3.org/TR/2000/REC-DOM-Level-2-Events-20001113
Version: 1.0

Supported Orientation
type: DatatypeProperty
comment: This property holds the supported orientations of a display
domain: Display
range: DataRange
  one of: 0
  one of: 90
  one of: -90
  one of: 180

Tactile Input Modality
type: Input Modality
comment: An input modality in which information is entered by touching some sensor or device
Id: __InputModality_TACTILE
Name: Tactile
Normative Status: Normative

StyleLanguage 39
type: Style Language
Name: CSS Mobile Profile
Version: 2.0

Format
type: Class
comment: This class represents formats that can be used to represent something
subclass of: Context Software Entity
subclass of: Restriction
  min cardinality: 1
  on property: Name
subclass of: Restriction
  max cardinality: 1
  on property: Version

Height
type: DatatypeProperty
type: FunctionalProperty
comment: The total height of something as a linear measure in centimeters
range: float

TransferEncoding 7bit
type: Transfer Encoding
Normative Status: Utility
Transfer Encoding Name: 7bit

Current Location
type: ObjectProperty
type: FunctionalProperty
comment: The current location associated to the environment component of this Delivery Context
domain: Environment
range: Location

Character Columns
type: DatatypeProperty
type: FunctionalProperty
comment: The typical number of characters that can be displayed in a single row on the device display. This is an estimate using the default font for the device
domain: Device
range: int
Related UAProf entity: ScreenSizeChar

Country Code
type: DatatypeProperty
type: FunctionalProperty
comment: This property represents a country code as per ISO 3166-1 alpha 3, so the country code is composed by a three letter code
range: string
sub property of: Id
normativeReference: http://www.iso.org/iso/list-en1-semic-2.txt

UTMCoordinates 1
type: UTM Coordinates
comment: Example UTM Coordinates
Datum: WGS84
Easting: 165300.0
UTM Latitude Zone: T
UTM Longitude Zone: 30
Northing: 4.788875

Renders Tables
type: DatatypeProperty
type: FunctionalProperty
comment: This property indicates whether the browser renders tables or not
domain: Web Browser Features
range: boolean

Handled Element
type: ObjectProperty
type: FunctionalProperty
comment: This property represents the handled element in a handler relationship
domain: Handling Association

NetworkType TETRA
type: Network Technology
comment: TErrestrial Trunked RAdio
Id: _TETRA
Name: TETRA

ISO 6709:1983 String
type: DatatypeProperty
type: FunctionalProperty
comment: The position represented as an ISO6709:1983 String
domain: Position
range: string

Active
type: ObjectProperty
comment: This property represents a generic relationship between a Context Entity and other Context Entities which are active in the scope of the former. For instance, the active Bluetooth Profile of a Device or the active Font within an Application
sub property of: Available

Vertical Accuracy
type: DatatypeProperty
type: FunctionalProperty
comment: Stimate of the vertical accuracy of the location in metres
domain: Class
  union of: Position
  union of: Location Provider
range: int

CellularStandardAngleOfArrival
type: Angle Of Arrival Method
type: Network Based Method
type: Unassisted Method
comment: Standard angle of arrival location method in a cellular network
Id: CellularStandardAngleOfArrival
Name: CellularStandardAngleOfArrival
Normative Status: Utility

APN
type: DatatypeProperty
type: FunctionalProperty
comment: The Access Point Name associated to a network bearer
domain: Network Bearer
range: string

Short Range Method
type: Class
comment: Location method Short-range positioning system (for example, Bluetooth LP)
subclass of: Location Method

DOM Level 1 Api
type: Web Browser API
comment: Document Object Model (DOM) Level 1 Specification
Id: http://www.w3.org/TR/REC-DOM-Level-1/
Name: DOM Level 1
normativeReference: http://www.w3.org/TR/REC-DOM-Level-1/
Normative Status: Utility
Normative URI: http://www.w3.org/TR/REC-DOM-Level-1/
Version: 1.0

BluetoothProfile dialup
type: Bluetooth Profile
comment: The Bluetooth profile that defines how devices provide modem services.
Name: Dialup Networking

Java
type: Term Group
comment: These terms model a minimal set of properties and classes that allow to represent the features of a Delivery Context related to the support of Java technologies
Normative Status: Utility
Term Group Prefix: java

Bluetooth Status Hidden
type: Bluetooth Status
comment: This status indicates that the device cannot be discovered by other Bluetooth devices
Id: __BTStatus_Hidden
Name: Hidden
Normative Status: Normative

Device Software
type: Class
comment: This class represents the software in a device
subclass of: Context Software Entity
subclass of: Software Aspect
Related UAProf entity: SoftwarePlatform

Term Group
type: Class
comment: This is an utility class that serves to represent the different term groups that compose the Delivery Context Ontology
subclass of: Associated Entity
Normative Status: Utility

Disjoint2
type: All Disjoint Set
Disjoint Class: hard:Context_HardwareEntity
Disjoint Set: Main Disjoint Group

JavaScript 1.1
type: Script Language
comment: Javascript 1.1
Name: JavaScript
Version: 1.1

Push Client
type: Class
comment: This class represents user agents capable of receiving and processing push requests
subclass of: User Agent
Informative Reference: http://www.openmobilealliance.biz/document/OMA-ORG-Dictionary-V2_6-20070614-A.pdf
Related UAProf entity: PushCharacteristics

CharacterSet CharacterSet UTF-7
type: Character Set
Character Set Name: UTF-7

IMEI
type: DatatypeProperty
type: FunctionalProperty
comment: The International Mobile Equipment Identity or IMEI is a number unique to every GSM and UMTS mobile phone.
domain: Device
range: string
sub property of: Device Identifier

J2meRuntimeEnvironment 20
type: J2ME Runtime Environment
comment: KVM
Name: KVM
Version: 1.0
Supported J2ME Configurations: CLDC 1.0
J2ME Optional Packages: JSR179
Supported J2ME Profiles: MIDP 1.0

Minimum Upload Bandwidth
type: DatatypeProperty
type: FunctionalProperty
comment: This property represents a minimum upload bandwidth that can be offered measured in Kbits/s
domain: Bandwidth Support
range: int

Sibling Disjoint2
type: All Disjoint Set
Disjoint Class: java:JavaRuntimeEnvironment
Disjoint Class: java:J2meOptionalPackage

Xhtml1Module Legacy
type: Markup Module
comment: XHTML 1 Legacy Module
Name: Legacy
Normative Status: Utility

Available Web Runtime Environments
type: ObjectProperty
comment: This property represents the Web Runtime Environments which are available on a device
domain: Device Software
range: Web Runtime
sub property of: Component
sub property of: Available

J2ME Profile
type: Class
comment: This class represents J2ME Profiles
subclass of: Context Java Entity
subclass of: Restriction
  cardinality: 1
  on property: JSR
subclass of: Restriction
  max cardinality: 1
  on property: Version
subclass of: Restriction
  cardinality: 1
  on property: Name
Related UAProf entity: JavaPlatform

Markup Modules
type: ObjectProperty
comment: The modules used by a markup language
domain: Standard Page Markup
range: Markup Module

Monospace
type: Font Family
comment: Generic Monospace Family
Id: __FontFamily_MonoSpace
Name: Monospace
normativeReference: http://www.w3.org/TR/CSS21/fonts.html#monospace-def
Normative Status: Normative

Maximum Total Page Weight
type: DatatypeProperty
type: FunctionalProperty
comment: The maximum page weight in bytes supported by a browser (this includes the markup and all the possible referenced objects in the page) such as images, styleSheets, script files, etc
domain: Web Browser Features
range: unsignedLong
Related UAProf entity: WmlDeckSize

Thickness
type: DatatypeProperty
type: FunctionalProperty
comment: The thickness of something measured in centimeters
range: float

Supported J2ME Configurations
type: ObjectProperty
comment: The supported J2ME configurations
domain: J2ME Runtime Environment
range: J2ME Configuration
sub property of: Supports

Non Transparent HTTP Proxy
type: Class
comment: An HTTP a proxy that modifies the request or response in order to provide some added service to the user agent, such as group annotation services, media type transformation, protocol reduction, or anonymity filtering.
subclass of: Http Proxy
normativeReference: http://www.ietf.org/rfc/rfc2616.txt

HardwareStatus STANDBY
type: Hardware Status
comment: This status indicates that harware component is in standby mode
Id: __HardwareStatus_STANDBY
Name: Standby

MonochromeDisplay
type: Feature
comment: This feature indicates that a display is monochrome
Id: __Feature_MonochromeDisplay
Name: MonochromeDisplay
Normative Status: Normative

Coordinates
type: ObjectProperty
type: FunctionalProperty
comment: The coordinates of a point
domain: Position
range: Geographical Coordinates

Restricted Element
type: ObjectProperty
type: FunctionalProperty
comment: The element to which a restriction applies
domain: Feature Restriction

Resolution Height
type: DatatypeProperty
type: FunctionalProperty
comment: The total number of addressable pixels in the vertical direction of a rectangular element (such as Camera, Display, Image, Video, ...) when held in its default orientation
range: int
Related DDR Core Vocabulary Property: displayHeight
Related UAProf entity: ScreenSize

SVG 1 1 Basic
type: Standard Page Markup
type: Image Format
type: XML Format
comment: SVG 1.1 Tiny
Name: SVG Basic
Normative Status: Utility
Version: 1.1
Namespace: http://www.w3.org/2000/svg
Public Identifier: -//W3C//DTD SVG 1.1//EN

Current Download Bandwidth
type: DatatypeProperty
type: FunctionalProperty
comment: This property represents the current download bandwidth offered by a network bearer measured in Kbits/s
domain: Network Bearer
range: int

BearerType GHOST
type: Network Bearer Technology
Id: _GHOST/R-Data
Name: GHOST/R-Data

Context Entity
type: Class
comment: This is the base class for the entities that define the Context and particularly the Delivery Context

TransferEncoding QuotedPrintable
type: Transfer Encoding
comment: The quoted printable transfer encoding format as specified in the RFC "Multipurpose Internet Mail Extensions (MIME) Part Four
Name: quoted-printable
Transfer Encoding Name: quoted-printable

Number of Soft Keys
type: DatatypeProperty
type: FunctionalProperty
comment: This property represents the number of input keys on the keyboard whose function can be controlled programatically
domain: Device Hardware
range: int
Related UAProf entity: NumberOfSoftKeys

Input Character Sets
type: ObjectProperty
comment: This property defines the character sets supported by the device for input
domain: Device Hardware
range: Character Set
sub property of: Supports
Related UAProf entity: InputCharSet

Input Devices
type: ObjectProperty
comment: The input mechanisms supported by a device
domain: Device Hardware
range: Input Device
sub property of: Supports
Related DDR Core Vocabulary Property: inputDevices
Related UAProf entity: Keyboard

BluetoothProfile serialPort
type: Bluetooth Profile
comment: The Bluetooth profile that defines how devices provide serial port emulation for communication.
Name: Serial Port

BearerType MPAK
type: Network Bearer Technology
Id: _MPAK
Name: MPAK

Network
type: Term Group
comment: This group models classes, properties and instances that have to do with the Network characteristics of the Delivery Context
Normative Status: Utility
Term Group Prefix: net

Issuer
type: DatatypeProperty
comment: The issuer of a certificate
domain: Certificate
range: string

Proxies Disjoint
type: All Disjoint Set
Disjoint Class: net:NonTransparentProxy
Disjoint Class: net:TransparentProxy

Web Browser Features
type: Class
comment: This class represents the features of a Web Browser
subclass of: Context Web Browser Entity

XHTML MP OpenWave Ext
type: XML Format
type: Standard Page Markup
comment: OpenWave XHTML-MP Extensions
Name: XHTML_MP_OpenWave
Version: 1.0
Public Identifier: -//OPENWAVE//DTD XHTML Mobile 1.0//EN

BearerType USSD
type: Network Bearer Technology
comment: Unstructured Supplementary Service Data is a capability of all GSM phones. It is generally associated with real-time or instant messaging type phone services.
Id: _USSD
Name: USSD

Jog Dial
type: Input Device
comment: A jog dial, jog wheel, shuttle dial, or shuttle wheel is a type of knob, ring, wheel, or dial which allows the user to shuttle or jog
Id: __InputDevice_JogDial
Normative Status: Normative

AllDisjointSet 16
type: All Disjoint Set
Disjoint Class: loc:Context_LocationEntity
Disjoint Class: common:Context_CommonEntity

ApplicationProtocol 24
type: Application Protocol
comment: HTTP
Id: __HTTP
Normative Status: Utility

Hardware
type: Term Group
comment: A group of terms with properties, classes and instances that model the hardware elements of a Delivery Context
Normative Status: Utility
Term Group Prefix: hard

Geographical Coordinate Reference System
type: Class
comment: This class represents a geographical coordinate system
subclass of: Context Location Entity
subclass of: Restriction
  cardinality: 1
  on property: Id
subclass of: Restriction
  max cardinality: 1
  on property: Name

Character Display
type: Class
comment: This class represents a character oriented display
subclass of: Display

Related DDR Core Vocabulary Property
type: DatatypeProperty
type: AnnotationProperty
comment: The name of a W3C DDR Core Vocabulary property to which a property in the ontology relates to
range: string
Normative Status: Informative

Name
type: DatatypeProperty
comment: The name of a delivery context entity
domain: Context Entity
range: string
Related UAProf entity: BrowserName
Related UAProf entity: OSName

Normative URI
type: DatatypeProperty
type: FunctionalProperty
comment: This property holds a URI that points to the normative specification of a software technology. One example are the estable URIs that are associated to W3C Recommendations
domain: Context Software Entity
range: anyURI

Supported Network Bearers
type: ObjectProperty
comment: This property holds the set of network bearers supported by a Network or by a Device.
domain: Class
  union of: Network
  union of: Network Support
range: Network Bearer
sub property of: Supports
Related UAProf entity: SupportedBearers

MP3
type: Audio Format
comment: MP3 audio format
Id: _MP3
Name: MPEG-3

Line Pointing Resolution
type: Pointing Resolution
comment: The pointing device can select a line of text
Id: __PointingResolution_Line
Name: line
Normative Status: Normative

Transfer Encoding Name
type: DatatypeProperty
comment: The name of a transfer encoding as officially defined by IANA
domain: Transfer Encoding
sub property of: Id
normativeReference: http://www.iana.org/assignments/transfer-encodings/

Markup Module
type: Class
comment: This class represents a module of a markup language
subclass of: Context Web Browser Entity
subclass of: Restriction
  cardinality: 1
  on property: Id
subclass of: Restriction
  cardinality: 1
  on property: Name

WiFi Hardware
type: Class
comment: This class represents hardware in a device that can be used to access to WiFi networks
subclass of: Hardware Component

DOM Level 2 HTML Api
type: Web Browser API
comment: Document Object Model (DOM) Level 2 HTML Specification
Id: http://www.w3.org/TR/2003/REC-DOM-Level-2-HTML-20030109
Name: DOM Level 2 HTML
normativeReference: http://www.w3.org/TR/2003/REC-DOM-Level-2-HTML-20030109
Normative Status: Utility
Normative URI: http://www.w3.org/TR/2003/REC-DOM-Level-2-HTML-20030109
Version: 1.0

Tetra 400 900
type: Newtwork Mode
Network Technology: NetworkType TETRA
Operation Band: 400
Operation Band: 900

WMLScript12
type: Script Language
Name: WMLScript
Version: 1.2

Supported Formats
type: ObjectProperty
comment: This property represents the formats that are supported by a program
domain: Program
range: Format
sub property of: Supports

Audio Recorder
type: Class
comment: This class represents a user agent capable of recording audio
subclass of: Media Recorder
subclass of: Restriction
  on property: Supported Formats
  some values from: Audio Format

Application Program
type: Class
comment: This class represents an application program
subclass of: Program

Network Technology
type: ObjectProperty
type: FunctionalProperty
comment: This property holds a network technology
domain: Newtwork Mode
range: Network Technology

SVG 1 1 Tiny
type: XML Format
type: Standard Page Markup
type: Image Format
comment: SVG 1.1
Name: SVG Tiny
Normative Status: Utility
Version: 1.1
Namespace: http://www.w3.org/2000/svg
Public Identifier: -//W3C//DTD SVG 1.1//EN

FeatureRestriction 13
type: Feature Restriction
Id: maximumNumberOfFrames
Restricted Element: gif89a
Restriction Value: 5

Usable Pixels Y
type: DatatypeProperty
type: FunctionalProperty
comment: The typical number of pixels in the Y direction of the display which can be used within a delivery context. This may be less than the total number available due to the presence of additional items on the display
domain: Delivery Context
range: int
Related DDR Core Vocabulary Property: displayHeight
Related UAProf entity: BrowserScreenSize

Feature Restriction
type: Class
comment: This class represents feature restrictions related to an implementation
subclass of: Context Common Entity
subclass of: Restriction
  cardinality: 1
  on property: Id
subclass of: Restriction
  min cardinality: 1
  on property: Name

Sans Serif
type: Font Family
comment: Generic Sans Serif Family
Id: __FontFamily_SansSerif
Name: Sansserif
normativeReference: http://www.w3.org/TR/CSS21/fonts.html#sans-serif-def
Normative Status: Normative

Status
type: ObjectProperty
type: FunctionalProperty
comment: This property represents the status of a hardware component
domain: Hardware Component
range: Hardware Status

Accepted Transfer Encodings
type: ObjectProperty
comment: The accepted transfer encodings supported by a user agent.
domain: Program
range: Transfer Encoding
sub property of: Supports
Related UAProf entity: MmsCcppAcceptEncoding
Related UAProf entity: Push-Accept-Encoding
Related UAProf entity: CcppAccept-Encoding

BluetoothBinaryLocMeth
type: Short Range Method
type: Terminal Based Method
type: Unassisted Method
comment: A room-oriented approach, uses a proximity detection method. An access point is installed in every room. For each tag, the system than finds the nearest AP, and respectively indicates its room location
Name: BluetoothBinaryLocationMethod

http://www.w3.org/2007/uwa/context/software.owl#jpeg
type: Image Format
comment: The JPEG file image format image type.
Id: _JPEG
Name: JPG
Name: JPEG

Graphic Display
type: Class
comment: This class represents a graphic display
subclass of: Display

UriSchema 37
type: URI Schema
URI Scheme Name: sips

Active Operating System
type: ObjectProperty
type: FunctionalProperty
comment: This is the active operating system
domain: Device Software
range: Operating System
sub property of: Active

Memory Unit
type: Class
comment: This class represents some memory used in a device. It might, for example, be built-in memory that is part of the device, or it might be removable memory on some form of storage card
subclass of: Hardware Component
subclass of: Restriction
  cardinality: 1
  on property: Size

MemoryUnit Hyp Dev Card
type: Memory Unit
Available Memory Size: 29800000
Size: 32000000

WAP Push Versions
type: DatatypeProperty
comment: Represents the versions of the (WAP) Push enabler supported
domain: WAP Push Client
range: string
Related UAProf entity: Push-Version

StyleLanguage 42
type: Style Language
Name: CSS
Version: 1

http://www.w3.org/2007/uwa/context/software.owl#png
type: Image Format
comment: The PNG file image format image type.
Id: _PNG
Name: PNG

J2ME Configuration
type: Class
comment: This class represents J2ME configurations
subclass of: Context Java Entity
subclass of: Restriction
  max cardinality: 1
  on property: Version
subclass of: Restriction
  cardinality: 1
  on property: Name
subclass of: Restriction
  cardinality: 1
  on property: JSR

Xhtml11Module Object
type: Markup Module
comment: XHTML 1 Object Module
Name: Object
Normative Status: Utility

Character Rows
type: DatatypeProperty
type: FunctionalProperty
comment: The typical number of rows of characters that can be displayed on the device display. This is an estimate using the default font for the device
domain: Device
range: int
Related UAProf entity: ScreenSizeChar

JavaPlatform 4
type: Java Platform
comment: J2SE 1.3
Name: J2SE
Version: 1.3

Plugin
type: Class
comment: This class represents a plugin, i.e. a software piece which extends the functionality offered by a host application (web browser, drawing application, etc)
subclass of: Context Software Entity
subclass of: Software Aspect
subclass of: Restriction
  max cardinality: 1
  on property: Version
subclass of: Restriction
  cardinality: 1
  on property: Name

xx
type: X.509 Certificate
Issuer: xxxx
Subject: xxxxx

Bandwidth Support
type: ObjectProperty
type: FunctionalProperty
comment: The bandwidth support offered by a Network Bearer Technology
domain: Network Bearer Technology
range: Bandwidth Support
sub property of: Supports

Xhtml11Module Forms
type: Markup Module
comment: XHTML 1 Forms Module
Name: Forms
Normative Status: Utility

BearerType SDS
type: Network Bearer Technology
Id: _SDS
Name: SDS

Typical Response Time
type: DatatypeProperty
comment: This property represents the typical response time in seconds of a location provider from the instant in which the location is requested to the moment in which the location is returned
domain: Location Provider
range: int

Normal
type: Font Style
comment: Normal Style
Id: __FontStyle_Normal
Name: Normal
Normative Status: Normative

Bluetooth Status Temporarily Discoverable
type: Bluetooth Status
comment: This status indicates that the device can be temporarily discovered by other Bluetooth devices
Id: __BTStatus_Temp_Discoverable
Name: Temporary Discoverable
Normative Status: Normative

Spanish-Spain
type: Language
comment: Spanish spoken Spain
Language Code: spa
Language Tag: es-ES
Normative Status: Utility

CPU
type: ObjectProperty
comment: This property represents a CPU for a device
sub property of: Hardware Component

Four Way Scroller
type: Input Device
comment: Scroll up and down and side to side
Id: __InputDevice_FourWayScroller
Normative Status: Normative

MemoryUnit Hyp Dev Internal
type: Memory Unit
Available Memory Size: 45900000
Size: 64000000

Device
type: Class
comment: This class represents a device in the delivery context
subclass of: Aspect
subclass of: Context Entity
subclass of: Restriction
  max cardinality: 1
  on property: Model
subclass of: Restriction
  max cardinality: 1
  on property: Version
subclass of: Restriction
  on property: Device Hardware
  some values from: Device Hardware
subclass of: Restriction
  on property: Device Software
  some values from: Device Software
subclass of: Restriction
  all values from: Bluetooth Status
  on property: Bluetooth Status
subclass of: Restriction
  max cardinality: 1
  on property: Vendor
subclass of: Restriction
  cardinality: 1
  on property: Device Hardware
subclass of: Restriction
  cardinality: 1
  on property: Device Software
subclass of: Restriction
  all values from: Sound Mode
  on property: Sound Mode

J2meRuntimeEnvironment 27
type: J2ME Runtime Environment
comment: J9
Name: J9
Version: 1.0
Supported J2ME Configurations: CLDC 1.0
J2ME Optional Packages: JSR179
Supported J2ME Profiles: MIDP 1.0
Supported J2ME Profiles: MIDP 2.0

deliverycontext.owl
type: Ontology
comment: The Delivery Context Ontology models the knowledge of the environment in which devices interact with the Web or other services
author: Jose M. Cantera
author: Rhys Lewis
version info: Delivery Context Ontology (Working Draft February 2009)
termGroups: Network
termGroups: Common
termGroups: Hardware
termGroups: Location
termGroups: Software
termGroups: Java
termGroups: Main
termGroups: Web Browsing

Http Proxy
type: Class
comment: It is a forwarding agent, receiving requests for a URI in its absolute form, rewriting all or part of the message, and forwarding the reformatted request toward the server identified by the URI.
subclass of: Proxy
subclass of: Context Web Browser Entity
normativeReference: http://tools.ietf.org/html/rfc2616#section-1.3

Xhtml11Module Edit
type: Markup Module
comment: XHTML 1 Edit Module
Name: Edit
Normative Status: Utility

Bluetooth Status
type: Class
comment: This class represents the possible statuses of Bluetooth in a device
subclass of: Context Hardware Entity
subclass of: Restriction
  cardinality: 1
  on property: Id

Available
type: ObjectProperty
comment: A generic property that represents Context Entities that are available
sub property of: Supports

Time Difference Method
type: Class
comment: Location method Time Difference for cellular / terrestrial RF system
subclass of: Location Method

Built-in Memory
type: ObjectProperty
type: FunctionalProperty
comment: This property represents the memory built into the device and which is not removable during normal operation
domain: Device Hardware
range: Memory Unit
sub property of: Memory

Media Player
type: Class
comment: This class represents any kind of user agent capable of playing media
subclass of: User Agent

Supports Cookies
type: DatatypeProperty
type: FunctionalProperty
comment: This property indicates whether the browser supports cookies or not
domain: Web Browser Features
range: boolean
Related DDR Core Vocabulary Property: cookieSupport

Xhtml1Module StyleAttribute
type: Markup Module
comment: XHTML 1 Style Attribute Module
Name: Style Attribute
Normative Status: Utility

BearerType GUTS
type: Network Bearer Technology
Id: _GUTS/R-Data
Name: GUTS/R-Data

Estimated Position
type: ObjectProperty
type: FunctionalProperty
comment: The estimated position provided by a location provider
domain: Location Provider
range: Position

Bluetooth Hardware
type: Class
comment: This class represents device hardware that can be used to access to Bluetooth technology
subclass of: Hardware Component
subclass of: Restriction
  all values from: Bluetooth Profile
  on property: Supported Bluetooth Profiles

JSR179
type: J2ME Standard Optional Package
comment: JSR-179
Name: JSR-179
Version: 1.0

Network Bearer Technology
type: ObjectProperty
type: FunctionalProperty
comment: The technology used by a Network Bearer
domain: Network Bearer
range: Network Bearer Technology

UriSchema 32
type: URI Schema
URI Scheme Name: tel

normativeReference
type: DatatypeProperty
type: AnnotationProperty
comment: This annotation property serves for indicating normative references for an entity in the ontology. It can be used in order to support the (automatic) documentation generation process
range: anyURI
Normative Status: Utility

ANSI-136 800
type: Newtwork Mode
Network Technology: NetworkType ANSI-136
Operation Band: 800

Environment
type: Class
comment: This class represents the physical environment in which an interaction takes place
subclass of: Context Entity

Numeric Keypad
type: Keyboard
comment: A keyboard with only numeric input
Id: __InputDevice_NumericKeypad
Normative Status: Normative

NetworkType HSDPA
type: Network Bearer Technology
comment: High-Speed Downlink Packet Access
Id: _HSDPA
Name: HSDPA

Bearer Network
type: ObjectProperty
type: FunctionalProperty
comment: The network that provides the infraestructure of a Network Bearer
domain: Network Bearer
range: Network

MIDP 2.0
type: J2ME Profile
comment: Mobile Information Device Profile 2.0
Name: MIDP
normativeReference: http://jcp.org/aboutJava/communityprocess/final/jsr118/index.html
Normative Status: Utility
Version: 2.0
JSR: JSR-000118

Location Method
type: Class
comment: It represents an specific mechanism used to calculate the location of a thing
subclass of: Context Location Entity
subclass of: Restriction
  min cardinality: 1
  on property: Name

Supported Streamed Formats
type: ObjectProperty
comment: This property represents the formats that are supported by a program in streaming mode
sub property of: Supported Formats

Public Identifier
type: DatatypeProperty
type: FunctionalProperty
comment: The public identifier of an XML format or module
domain: Class
  union of: Markup Module
  union of: Standard Page Markup
range: string
sub property of: Id

Component
type: ObjectProperty
comment: A generic property that represents the relationship between an Aspect of the Delivery Context and its Components (Aspect instances)
domain: Aspect
range: Aspect

Disjoint4
type: All Disjoint Set
Disjoint Class: net:Context_NetworkEntity
Disjoint Set: Main Disjoint Group

Context Web Browser Entity
type: Class
comment: This class subsumes all the Delivery Context entities that have to do with web browsing characteristics
subclass of: Context Software Entity

WGS84Coordinates 25
type: WGS84 Coordinates
comment: Example WGS84 coordinates
Latitude: 44.0
Longitude: 10.0

Timezone
type: Class
comment: A time zone is an identifier for a specific location or region which translates into a combination of rules for calculating an UTC offset
subclass of: Context Common Entity
subclass of: Class
  union of: Restriction
    cardinality: 1
    on property: TZ Name
  union of: Restriction
    cardinality: 1
    on property: Time Zone String
Informative Reference: http://www.w3.org/TR/2005/NOTE-timezone-20051013/

Bandwidth Support
type: Class
comment: This class represents the bandwith characteristics provided by a Network Bearer Technology
subclass of: Context Network Entity
subclass of: Restriction
  max cardinality: 1
  on property: Maximum download Bandwidth
subclass of: Restriction
  max cardinality: 1
  on property: Maximum Upload Bandwidth
subclass of: Restriction
  cardinality: 1
  on property: Typical Download Bandwidth
subclass of: Restriction
  max cardinality: 1
  on property: Minimum Upload Bandwidth
subclass of: Restriction
  max cardinality: 1
  on property: Minimum Download Bandwidth
subclass of: Restriction
  max cardinality: 1
  on property: Typical Upload Bandwidth

Maximum download Bandwidth
type: DatatypeProperty
type: FunctionalProperty
comment: This property represents a maximum download bandwidth measured in Kbits/s
domain: Bandwidth Support
range: int

CLDC 1.1
type: J2ME Configuration
comment: Connected Limited Device Configuration 1.1
Name: CLDC
normativeReference: http://jcp.org/aboutJava/communityprocess/final/jsr139/index.html
Normative Status: Utility
Version: 1.1
JSR: JSR-000139

Available Location Providers
type: ObjectProperty
comment: This property represents the LocationProviders that are currently available in a network, device or the Delivery Context itself as whole
domain: Class
  union of: Network
  union of: Device
  union of: Delivery Context
range: Location Provider
sub property of: Supported Location Providers
sub property of: Available

Sibling Disjoint1
type: All Disjoint Set
Disjoint Class: soft:HandlingAssociation
Disjoint Class: soft:FontStyle
Disjoint Class: soft:FontFamily
Disjoint Class: soft:Font
Disjoint Class: soft:Certificate

JSR82
type: J2ME Standard Optional Package
comment: JSR-82
Name: JSR-82
Version: 1.0

Web Browser API
type: Class
comment: This class represents APIs implemented by Web Browsers
subclass of: Context Web Browser Entity
subclass of: API
subclass of: Restriction
  cardinality: 1
  on property: Normative URI

Partial OMA XHTML-MP Presentation
type: Markup Module
comment: Partial support of the Xhtml1 presentation module
Name: Partial_OMA_XHTML-MP_1_2_Presentation

Disjoint Set
type: ObjectProperty
comment: This property is aimed at linking groups of disjoint classes between them
domain: All Disjoint Set
range: All Disjoint Set
Normative Status: Utility

Location Provider
type: Class
comment: Represents an entity capable of providing location information
subclass of: Context Location Entity
subclass of: Restriction
  on property: Geographical Coordinate Systems
  some values from: Geographical Coordinate Reference System
subclass of: Restriction
  all values from: Geographical Coordinate Reference System
  on property: Geographical Coordinate Systems
subclass of: Restriction
  on property: Location Method
  some values from: Location Method
subclass of: Restriction
  all values from: Location Method
  on property: Location Method

XHTML MP 1 0
type: XML Format
type: Standard Page Markup
comment: XHTML MP 1.0
Name: XHTML-MP
Normative Status: Utility
Version: 1.0
Public Identifier: -//WAPFORUM//DTD XHTML Mobile 1.0//EN

Xhtml11Module Presentation
type: Markup Module
comment: XHTML 1 Presentation Module
Name: Presentation
Normative Status: Utility

XHTML 1 0 Transitional
type: XML Format
type: Standard Page Markup
comment: XHTML 1.0 Transitional
Name: XHTML
Normative Status: Utility
Version: 1.0 Transitional
Public Identifier: -//W3C//DTD XHTML 1.0 Transitional//EN

Speed Feature
type: Feature
comment: This feature indicates that a location provider is capable of determining the speed
Id: __Location_Feature_Speed
Name: Speed
Normative Status: Normative

Course
type: DatatypeProperty
type: FunctionalProperty
comment: The course made good in degrees relative to true north. The value is always in the range [0.0,360.0) degrees
domain: Position
range: double

UTM
type: Geographical Coordinate Reference System
comment: The Universal Traversal Marcator coordinate reference system
Id: __GeocordinateRS_UTM
Name: UTM
Normative Status: Utility

Nokia
type: Vendor
Name: Nokia

Pixel Pointing Resolution
type: Pointing Resolution
comment: The pointing device can select an individual pixel
Id: __PointingResolution_Pixel
Name: pixel
Normative Status: Normative

J2ME Standard Optional Package
type: Class
comment: This class represents standard optional packages that can run ina J2ME runtime environment
subclass of: Context Java Entity
subclass of: API
subclass of: Restriction
  cardinality: 1
  on property: JSR

Memory Card
type: Class
comment: This class represents a storage card which can be attached to a device
subclass of: Memory Unit
subclass of: Restriction
  has value: false
  on property: Volatile

XHTML Basic 1 0
type: XML Format
type: Standard Page Markup
comment: XHTML Basic 1.0
Name: XHTML-Basic
Normative Status: Utility
Version: 1.0
Markup Modules: XForms OMA TextInputModes
Public Identifier: -//W3C//DTD XHTML Basic 1.0//EN

Current Network Bearer
type: ObjectProperty
type: FunctionalProperty
comment: This property represents the currently used network bearer in a Delivery Context
domain: Delivery Context
range: Network Bearer
sub property of: Active

SiblingDisjoint2
type: All Disjoint Set
Disjoint Class: soft:Api
Disjoint Class: soft:Format

Term Group Prefix
type: DatatypeProperty
type: AnnotationProperty
comment: The prefix used for a group of terms
domain: Term Group
range: string
Normative Status: Utility

FeatureRestriction 9
type: Feature Restriction
Id: document.all
Restricted Element: DOM Level 1 Api
Restriction Value: false

Position1
type: Position
comment: An example position
WGS84 Coordinates: WGS84Coordinates 25

NetworkType IEEE 802.11g
type: Network Technology
comment: Wi-Fi 802.11g
Id: IEEE 802.11g
Name: IEEE 802.11g

Bluetooth Discoverable
type: Bluetooth Status
comment: This status indicates that the device can be discovered by other Bluetooth devices
Id: __BTStatus_Discoverable
Name: Discoverable
Normative Status: Normative

MMS User Agent
type: Class
comment: A user agent capable of managing MMS Messages
subclass of: Push Client
subclass of: Restriction
  min cardinality: 1
  on property: MMS versions
Related UAProf entity: MmsCharacteristics

Network Support
type: ObjectProperty
type: FunctionalProperty
comment: The network-related characteristics of a device
domain: Device
range: Network Support

Terminal Based Method
type: Class
comment: Location method is of type terminal based. This means that the final location result is calculated in the terminal
subclass of: Location Method

CharacterSet UTF-16be
type: Character Set
Character Set Name: UTF-16BE

Present Networks
type: ObjectProperty
comment: The networks that are present in the current Environment
domain: Environment
range: Network

Battery Hyp Devi
type: Battery
comment: The battery in a Hypothetical Device
Battery Being Charged: false
Battery Level: 60

ApplicationProtocol 26
type: Application Protocol
comment: WSP Connection Oriented
Id: __WSP-CO
Normative Status: Utility

Xhtml11Module ServerSideImageMap
type: Markup Module
comment: XHTML 1 Server Side Image Map Module
Name: Server Side Image Map
Normative Status: Utility

Xhtml11Module Base
type: Markup Module
comment: XHTML 1 Base Module
Name: Base
Normative Status: Utility

HTML 4 0 1
type: Standard Page Markup
comment: HTML 4 Strict
Name: HTML
Normative Status: Utility
Version: 4.0.1
Public Identifier: -//W3C//DTD HTML 4.01//EN

Image Format
type: Class
comment: This class represents a particular image format, such as jpeg, gif or png
subclass of: Format

GSMCellGlobalIdentity
type: Cell Id Method
type: Terminal Based Method
type: Assisted Method
Name: GSMCellGlobalIdentity

CharacterSet ISO-8859-1
type: Character Set
Character Set Name: ISO_8859-1:1987
Name: ISO-8859-1
Name: ANSI_X3.4-1986
Name: iso-ir-6

WAP Push Maximum Number of Requests
type: DatatypeProperty
type: FunctionalProperty
comment: The maximum number of WAP Push requests that the WAP Push User Agent is capable to deal with
domain: WAP Push Client
range: int
Related UAProf entity: Push-MaxPushReq

Extension Memory
type: ObjectProperty
comment: This property identifies additional memory that is provided to a device, typically in the form of removable memory cards
domain: Device Hardware
range: Memory Unit
sub property of: Memory

Maximum JAR size
type: DatatypeProperty
type: FunctionalProperty
comment: The maximum JAR size for a Java Application supported by a Java Runtime Environment
domain: Java Runtime Environment
range: unsignedLong
Related UAProf entity: JavaMaxDownloadJarSize

Vendor
type: ObjectProperty
type: FunctionalProperty
comment: This property represents a vendor
range: Vendor
Related DDR Core Vocabulary Property: vendor
Related UAProf entity: Vendor
Related UAProf entity: CPU
Related UAProf entity: OSVendor
Related UAProf entity: BrowserVendor

Font
type: Class
comment: This class represents fonts
subclass of: Context Software Entity
subclass of: Restriction
  all values from: Font Style
  on property: Font Style
subclass of: Restriction
  all values from: Font Family
  on property: Font Family
subclass of: Restriction
  cardinality: 1
  on property: Font Family
subclass of: Restriction
  cardinality: 1
  on property: Font Size

Accepted Character Sets
type: ObjectProperty
comment: This property represents the charsets accepted by a user agent
domain: Program
range: Character Set
sub property of: Supports
Related UAProf entity: CcppAccept-Charset
Related UAProf entity: Push-Accept-Charset
Related UAProf entity: MmsCcppAcceptCharSet

Network Technology
type: Class
comment: This class represents different network technologies
subclass of: Context Network Entity
subclass of: Restriction
  cardinality: 1
  on property: Id
subclass of: Restriction
  min cardinality: 1
  on property: Name
Related UAProf entity: NetworkCharacteristics

Supported Application Protocols
type: ObjectProperty
comment: This property represents the application protocols by a program
domain: Program
range: Application Protocol
sub property of: Supports
Related UAProf entity: Push-SupportedBearers

Preferred Network Bearer
type: ObjectProperty
type: FunctionalProperty
comment: This property represents the preferred network bearer for a Network
domain: Network
range: Network Bearer
sub property of: Supported Network Bearers

Supported Bluetooth Version
type: DatatypeProperty
comment: This property represents the version/s of Bluetooth supported
domain: Device Hardware
range: string
Related UAProf entity: SupportedBluetoothVersion

resolutionWidth
type: DatatypeProperty
type: FunctionalProperty
comment: The total number of addressable pixels in the horizontal direction of a rectangular entity (such as Camera, Display, Image, Video, ...) when held in its default orientation. The Property does not apply to entities that are not rectangular or square
range: int
Related DDR Core Vocabulary Property: displayWidth
Related UAProf entity: ScreenSize

FeatureRestriction 4
type: Feature Restriction
Id: animated
Restricted Element: gif89a
Restriction Value: false

NetworkType IEEE 802.11b
type: Network Technology
comment: WiFi 802.11b
Id: IEEE 802.11b
Name: IEEE 802.11b
Name: WiFi

FeatureRestriction 15
type: Feature Restriction
Id: innerHTML
Restricted Element: DOM Level 1 Api
Restriction Value: true

WAP Push Client
type: Class
comment: A user agent capable of managing WAP Push incoming messages
subclass of: Push Client
subclass of: Restriction
  min cardinality: 1
  on property: WAP Push Versions
Related UAProf entity: PushCharacteristics

Software Aspect
type: Class
comment: This class represents a software aspect
subclass of: Aspect

NetworkType PDC
type: Network Technology
comment: Personal Digital Cellular
Id: _PDC
Name: PDC

Keyboard
type: Class
comment: This class represents a keyboard in a device
subclass of: Input Device

BearerType HSCSD
type: Network Bearer Technology
comment: High-Speed Circuit-Switched Data
Id: _HSCSD
Name: HSCSD

Altitude Feature
type: Feature
comment: Indicates that the location provider is capable of determining the altitude
Id: __Location_Feature_Altitude
Name: Altitude
Normative Status: Normative

Bluetooth Status Paired
type: Bluetooth Status
comment: This status indicates that the device is paired to other Bluetooth device
Id: __BTStatus_Paired
Name: Paired
Normative Status: Normative

Fonts
type: ObjectProperty
comment: The fonts provided by a Context Entity. It can be the Device Software in general, a Web Browser or other program
domain: Class
  union of: Program
  union of: Device Software
range: Font
sub property of: Available

BearerType PACKET
type: Network Bearer Technology
comment: Generic packet-based bearer
Id: _PACKET
Name: PACKET

Camera Hypothetical Device
type: Camera
comment: This represents the camera on a Hypothetical Device
resolutionWidth: 307000

Cell Identifier
type: DatatypeProperty
type: FunctionalProperty
comment: The id of the cell to which the device is interacting with in the mobile network
domain: Network Support
range: string
sub property of: Id

StyleLanguage 44
type: Style Language
Name: CSS
Version: 2 Revision 1

English USA
type: Language
comment: American English
Language Code: eng
Language Tag: en-US
Normative Status: Utility

ApplicationProtocol 21
type: Application Protocol
comment: W-HTTP
Id: __W-HTTP
Name: W-HTTP
Normative Status: Utility

NetworkType UMTS W-CDMA
type: Network Technology
comment: UMTS with W-CDMA air interface
Id: _WCDMA
Name: W-CDMA

Sound Mode
type: ObjectProperty
type: FunctionalProperty
comment: This property represents the sound mode currently setted on a device
domain: Device
range: Sound Mode

Volatile
type: DatatypeProperty
type: FunctionalProperty
comment: This property indicates if the memory unit is volatile or not
domain: Memory Unit
range: boolean

Proxy
type: Class
comment: A computer network service that allows clients to make indirect network connections to other network services
subclass of: Program
subclass of: Context Network Entity
subclass of: Aspect
Informative Reference: http://www.w3.org/TR/di-gloss/#def-proxy

Service Set Identifier
type: DatatypeProperty
comment: The SSID of a WiFi network
domain: WiFi Network
range: string

Visual Output Modality
type: Output Modality
comment: This is an output modality in which information is perceived visually by the user
Id: __OutputModality_Visual
Name: Visual

Id
type: DatatypeProperty
type: FunctionalProperty
comment: A machine-readable alphanumeric string that univoquely identifies a Context Entity
domain: Context Entity
range: string

Default MMS Client
type: ObjectProperty
type: FunctionalProperty
comment: The default MMS client on the device
domain: Device Software
range: MMS User Agent
sub property of: Available User Agents
sub property of: Default Component
Related UAProf entity: MmsCharacteristics

WapPushClient Example 1
type: WAP Push Client
WAP Push Maximum Message Size: 2000
WAP Push Maximum Number of Requests: 4
WAP Push Versions: 2.1
Accepted Character Sets: CharacterSet ISO-8859-1
Accepted Transfer Encodings: TransferEncoding 7bit

PDF
type: Format
Id: _PDF
Name: PDF

URI Scheme Name
type: DatatypeProperty
comment: The name of a URI scheme as officially defined by IANA
domain: URI Schema
sub property of: Id
normativeReference: http://www.iana.org/assignments/uri-schemes.html

Xhtml11Module Stylesheet
type: Markup Module
comment: XHTML 1Stylesheet Module
Name: Stylesheet
Normative Status: Utility

URI Schema
type: Class
comment: This class represents URI Schemas as per RFC 3986
subclass of: Context Common Entity
subclass of: Restriction
  cardinality: 1
  on property: URI Scheme Name
normativeReference: http://tools.ietf.org/html/rfc3986

Xhtml11Module BasicForms
type: Markup Module
comment: XHTML 1 Basic Forms Module
Name: BasicForms
Normative Status: Utility

WCSS11
type: Style Language
Name: W-CSS
Version: 1.1

JSR
type: DatatypeProperty
type: FunctionalProperty
comment: The JSR specification id that corresponds to a Java Technology
domain: Class
  union of: J2ME Profile
  union of: J2ME Configuration
  union of: J2ME Standard Optional Package
range: string
sub property of: Id

Informative
type: Normative Status
comment: This instance represents an "informative" status
Normative Status: Utility

Supports
type: ObjectProperty
comment: A generic property that indicates what is supported by a Context Entity
domain: Context Entity
range: Context Entity

Normal
type: Sound Mode
comment: Normal Sound Mode
Id: __SoundMode_Normal
Name: Normal
Normative Status: Normative

Off
type: Hardware Status
comment: This status indicates that the hardware component is off
Id: __HardwareStatus_Off
Name: Off
Normative Status: Normative

Bluetooth Friendly Name
type: DatatypeProperty
type: FunctionalProperty
comment: The Bluetooth friendly name of the device
domain: Device
range: string

Default
type: ObjectProperty
comment: This is a generic property that can be used to represent the relationship between a Context Entity and a default element for such entity
sub property of: Supports

UTM Latitude Zone
type: DatatypeProperty
type: FunctionalProperty
comment: This property represent the UTM latitude zone
domain: UTM Coordinates
range: string
Normative Status: Informative

Device Hypothetical
type: Device
Model: Hypothetical_Model
Vendor: Nokia
Version: 1.0
Device Hardware: DeviceHardware Hypothetical Device
IMEI: aaaa
Device Software: DeviceSoftware Hyp Devi

Shows Access Keys
type: DatatypeProperty
type: FunctionalProperty
comment: This property indicates whether the browser displays automatically the character associated to access keys or not
domain: Web Browser Features
range: boolean

Available Memory Size
type: DatatypeProperty
type: FunctionalProperty
comment: This property represents the amount of memory available for use, in bytes
domain: Memory Unit
range: unsignedLong

NetworkType GSM
type: Network Technology
comment: Global System for Mobile Communications
Id: _GSM
Name: GSM

ARM9
type: CPU
comment: The ARM ARM9 central processing unit
Model: ARM9
CPU Maximum Frequency: 4000

UriSchema 34
type: URI Schema
URI Scheme Name: mailto

Longitude
type: DatatypeProperty
type: FunctionalProperty
comment: The longitude as defined by the WGS84 coordinate system
domain: WGS84 Coordinates
range: float

WGS84 Coordinates
type: ObjectProperty
type: FunctionalProperty
comment: Coordinates of a point expressed in the WGS84 reference system
range: WGS84 Coordinates
sub property of: Coordinates

ExampleDC 1
type: Delivery Context
comment: Example of a Delivery Context
Current Device: Device Hypothetical
Environment: Environment 2
Current Network Bearer: NetworkBearer 2
Current User Agent: WebBrowser x
Usable Pixels X: 340
Usable Pixels Y: 220

NetworkType ANSI-136
type: Network Technology
comment: ANSI-136
Id: ANSI 136
Name: ANSI-136

Time of Arrival Method
type: Class
comment: Location method Time of Arrival (TOA) for cellular / terrestrial RF system
subclass of: Location Method

Common Sibling
type: All Disjoint Set
Disjoint Class: common:ApplicationProtocol
Disjoint Class: common:CharacterSet
Disjoint Class: common:TransferEncoding
Disjoint Class: common:FeatureRestriction
Disjoint Class: common:Vendor
Disjoint Class: common:TimeZone
Disjoint Class: common:Modality
Disjoint Class: common:SoundMode
Disjoint Class: common:UriScheme
Disjoint Class: common:ContentType
Disjoint Class: common:Language
Disjoint Class: common:Feature
Normative Status: Utility

Course Feature
type: Feature
comment: This feature indicates that the location provider supports course determination
Id: __Location_Feature_Course
Name: Course
Normative Status: Normative

Serif
type: Font Family
comment: Generic Serif Family
Id: __FontFamily_Serif
Name: Serif
normativeReference: http://www.w3.org/TR/CSS21/fonts.html#serif-def
Normative Status: Normative

HTML 4 0 1 Transitional
type: Standard Page Markup
comment: HTML 4.01 Transitional
Name: HTML
Normative Status: Utility
Version: 4.0.1 Transitional
Public Identifier: -//W3C//DTD HTML 4.01 Transitional//EN

TransferEncoding Base64
type: Transfer Encoding
comment: The base 64 transfer encoding format as specified in RFC4289
Name: base64
Transfer Encoding Name: base64

WAP Push Maximum Message Size
type: DatatypeProperty
type: FunctionalProperty
comment: THe maximum message size supported by the WAP Push User Agent in bytes
domain: WAP Push Client
range: unsignedLong
sub property of: Maximum Delivery Unit Size
Related UAProf entity: Push-MsgSize

Input Modality
type: Class
comment: This class represents input modalities
subclass of: Modality

Video Recorder
type: Class
comment: This class represents a user agent capable of recording video
subclass of: Media Recorder
subclass of: Restriction
  on property: Supported Formats
  some values from: Video Format

Easting
type: DatatypeProperty
type: FunctionalProperty
comment: The easting (x) component of the UTM coordinates measured in metres
domain: UTM Coordinates
range: float
Normative Status: Informative

NFC Hardware
type: Class
comment: This class represents the NFC hardware on a device
subclass of: Hardware Component

Output Devices
type: ObjectProperty
comment: The output mechanisms supported by a Device
domain: Device Hardware
range: Output Device
sub property of: Supports

StyleLanguage 9
type: Style Language
Name: CSS
Version: 2

Model
type: DatatypeProperty
type: FunctionalProperty
comment: The model identification assigned to something by its vendor
range: string
Related DDR Core Vocabulary Property: model
Related UAProf entity: CPU
Related UAProf entity: Model

Font Family
type: ObjectProperty
type: FunctionalProperty
comment: The font family of a font
domain: Font
range: Font Family

Northing
type: DatatypeProperty
type: FunctionalProperty
comment: The northing component of the UTM coordinates measured in metres
domain: UTM Coordinates
range: float
Normative Status: Informative

All Disjoint Set
type: Class
comment: This is an utility class for representing groups of classes that are pairwise disjoint, following the approach specified by the OWL Abstract Syntax. This class has been created as a workaround to the absence in OWL 1 of an specific construct for establishing class disjointness between groups of classes
subclass of: Associated Entity
subclass of: Class
  union of: Restriction
    min cardinality: 1
    on property: Disjoint Class
  union of: Restriction
    on property: Disjoint Set
    some values from: All Disjoint Set
Informative Reference: http://www.w3.org/TR/2004/REC-owl-semantics-20040210/syntax.html#2.3.2.1
Normative Status: Utility

Language Code
type: DatatypeProperty
comment: It represents a language code according to ISO 639 Part 3
domain: Language
range: string
normativeReference: http://www.sil.org/iso639-3/codes.asp

Sibling Disjoint3
type: All Disjoint Set
Disjoint Class: soft:DeviceSoftware
Disjoint Class: soft:Plugin
Disjoint Class: soft:Program

Content Transformation Proxy
type: Class
comment: This class represents a Content Transformation Proxy, an intermediary in the communications path between a web browser and the origin server. These intermediary adjust HTML pages designed for desktop presentation to provide an enhanced user experience when accessed from a mobile device.
subclass of: Non Transparent HTTP Proxy
Informative Reference: http://www.w3.org/TR/ct-landscape/

Context Network Entity
type: Class
comment: This class reprensents the set of all delivery context entities that have to do with network characteristics
subclass of: Context Entity

Aural Output Modality
type: Output Modality
comment: This modality indicates the ability to use audio as an output modality
Id: __OutputModality_Aural
Name: Aural
Normative Status: Normative

XHTML MP 1 2
type: XML Format
type: Standard Page Markup
comment: XHTML MP 1.2
Name: XHTML-MP
Normative Status: Utility
Version: 1.2
Markup Modules: XForms OMA TextInputModes
Markup Modules: Partial OMA XHTML MP Legacy
Markup Modules: Partial OMA XHTML MP IntrinsicEvents
Public Identifier: -//WAPFORUM//DTD XHTML Mobile 1.2//EN

i-HTML 7 0
type: Standard Page Markup
comment: Other i-Mode steps can be easily added
Name: i-HTML7.0
Version: 7.0

PJPG
type: Image Format
comment: The progressive JPEG file image format image type.
Id: _PJPG
Name: PJPG

Aspects Disjoint
type: All Disjoint Set
Disjoint Class: hard:HardwareComponent
Disjoint Class: soft:SoftwareAspect
Disjoint Class: net:Network
Disjoint Class: net:NetworkBearer

Device Software
type: ObjectProperty
type: FunctionalProperty
comment: This property represents the software on the device
domain: Device
range: Device Software

Available Java Runtime Environments
type: ObjectProperty
comment: The available Java Runtime Environments
domain: Device Software
range: Java Runtime Environment
sub property of: Component
sub property of: Available

API
type: Class
comment: This is a generic class that represents an application programming interface
subclass of: Context Software Entity
subclass of: Restriction
  cardinality: 1
  on property: Name
subclass of: Restriction
  max cardinality: 1
  on property: Version

InfraredHardware
type: Class
comment: This class represents the infrared hardware on a device
subclass of: Hardware Component

Times New Roman
type: Font Family
comment: Example Font Family 'Times New Roman'
Id: _TNR
Name: Times New Roman

BluetoothProfile fileTransfer
type: Bluetooth Profile
comment: The Bluetooth profile that defines how devices perform file transfer.
Name: File Transfer

Current Upload Bandwidth
type: DatatypeProperty
type: FunctionalProperty
comment: This property represents the current upload bandwidth offered by a Network Bearer measured in Kbits/s
domain: Network Bearer
range: int

Time Zone
type: ObjectProperty
comment: This property represents a time zone
range: Timezone

NetworkType TD-SCDMA
type: Network Technology
comment: Chinese standard
Id: _TD_SCDMA
Name: TD-SCDMA

Context Common Entity
type: Class
comment: This class subsumes all the general purpose classes
subclass of: Context Entity

Volume Level
type: DatatypeProperty
type: FunctionalProperty
comment: The relative volume level of a speaker (between 0 and 100)
domain: Speaker
range: int

Device Identifier
type: DatatypeProperty
type: FunctionalProperty
comment: Identifies univoquely a device
domain: Device
range: string
sub property of: Id

Main
type: Term Group
comment: These are the fundamental Aspects and Properties such as the Device or the Delivery Context itself
Normative Status: Utility
Term Group Prefix: dcn

XForms OMA TextInputModes
type: Markup Module
Name: XForms_OMA_TextInputModes

Web Browser
type: Class
comment: This class represents a Web Browser
subclass of: User Agent
subclass of: Context Web Browser Entity
subclass of: Restriction
  has value: HTTP Scheme
  on property: Supported URI Schemes
Related UAProf entity: BrowserUA

BearerType CSD
type: Network Bearer Technology
comment: Circuit Switched Data
Id: _CSD
Name: CSD

Supported Network Modes
type: ObjectProperty
comment: The supported Network Modes of a Device
domain: Network Support
range: Newtwork Mode
sub property of: Supports

Speed
type: DatatypeProperty
type: FunctionalProperty
comment: Observed speed in meters per second
domain: Position
range: double

J2ME Runtime Environment
type: Class
comment: This class represents a J2ME runtime environment
subclass of: Java Runtime Environment
subclass of: Restriction
  has value: Java ME
  on property: Java Platforms
subclass of: Restriction
  min cardinality: 1
  on property: Supported J2ME Configurations
subclass of: Restriction
  min cardinality: 1
  on property: Supported J2ME Profiles
Related UAProf entity: JavaPlatform

Proxy
type: ObjectProperty
comment: This property represents one or more proxies that can be present while using a Network Bearer
domain: Network Bearer
range: Http Proxy
sub property of: Active

Audio Format
type: Class
comment: This class represents a particular audio format, such as MP3 or WAV
subclass of: Format

Oblique
type: Font Style
comment: Oblique Style
Id: __FontStyle_Oblique
Name: Oblique
Normative Status: Normative

Audio Player
type: Class
comment: This class represents a user agent capable of dealing with audio formats
subclass of: Media Player
subclass of: Restriction
  on property: Supported Formats
  some values from: Audio Format

Current Runtime Environment
type: ObjectProperty
type: FunctionalProperty
comment: This property represents the current runtime environment of a Delivery Context
domain: Delivery Context
range: Runtime Environment
sub property of: Active

CharacterSet WINDOWS-1252
type: Character Set
Character Set Name: windows-1252
Name: WINDOWS-1252

Typing Input Modality
type: Input Modality
comment: An input modality in whoch the user enters information by typing using a keyboard or similar
Id: __InputModality_Typing
Name: Typing
Normative Status: Normative

Default Handler
type: ObjectProperty
comment: This property represents a default handler
domain: Device Software
range: Handling Association
sub property of: Default

Cell Id Method
type: Class
comment: Location method Cell-ID for cellular (in GSM, this is the same as CGI, Cell Global Identity)
subclass of: Location Method

Program
type: Class
comment: This class represents a computer program
subclass of: Context Software Entity
subclass of: Software Aspect
subclass of: Restriction
  max cardinality: 1
  on property: Version
subclass of: Restriction
  cardinality: 1
  on property: Name
subclass of: Restriction
  max cardinality: 1
  on property: Vendor

BluetoothProfile headSet
type: Bluetooth Profile
comment: The Bluetooth profile that defines how headsets communicate with devices.
Name: Head Set

ApplicationProtocol 28
type: Application Protocol
comment: WTLS
Id: __WTLS
Name: WTLS
Normative Status: Utility

Main Disjoint Group
type: All Disjoint Set
Disjoint Class: dcn:Environment
Disjoint Class: dcn:Device
Disjoint Class: dcn:DeliveryContext

Last Known Location
type: ObjectProperty
type: FunctionalProperty
comment: The last known location associated to a Delivery Context
domain: Environment
range: Location

Weight
type: DatatypeProperty
type: FunctionalProperty
comment: The weight of something physical, measured in kilos
domain: Context Hardware Entity
range: float