Venerdì
type: Giorno della settimana
type: NamedIndividual
label: Friday @en

Offerta
type: Class
comment: Concetto utilizzato per rappresentare offerte (riduzioni per specifiche categorie di utenti o importo intero) relative ai biglietti d'ingresso per un istituto e luogo della cultura o per un evento.
comment: It represents an offer (reduction for specific types of users or base price) related to the entrance ticket for the Cultural Institute or Site or for the Event. @en
label: Offer @en
subclass of: Restriction
  on property: include
  some values from: Biglietto
subclass of: Restriction
  all values from: Validità
  on property: ha validità
subclass of: Restriction
  all values from: Literal
  on property: descrizione
description: Any fare is expressed within the ontology by using instances of the class Offer. It is possible to specify: * the type of user to whom the offer is applicable (cf. object property cis:hasEligibleUser); * the information about the price (cf. object property hasPriceSpecification); * the information about the temporal validity of the offer (cf. object property hasValidity); * the association with a ticket (cf. object property includes). The following turtle example exemplifies the base offer of the Biblioteca Nazionale Centrale di Roma. offer:Biblioteca_Nazionale_Centrale_base_offer a cis:Offer ; rdfs:label "offerta base "@it , "base offer "@en ; cis:hasEligibleUser userType:Under18 ; cis:hasPriceSpecification priceSpecification:Under18 ; cis:hasValidity validity:Biblioteca_nazionale_centrale_validity ; cis:includes ticket:Biblioteca_nazionale_centrale_ticket_1 . @en
description: Qualsiasi tariffa è rappresentata nell'ontologia attraverso istanze della classe "Offerta". E' possibile specificare: * il tipo di utente al quale l'offerta è applicabile (con la proprietà has utente eligibile) * l'informazione sul prezzo (con la proprietà ha prezzo) * l'informazione sulla validità temporale dell'offerta (con la proprietà ha validità) + l'associazione con il biglietto (con la proprietà "include"). Il seguente codice turtle fornisce un esempio di offerta base per la Biblioteca Nazionale Centrale di Roma offer:Biblioteca_Nazionale_Centrale_base_offer a cis:Offer ; rdfs:label "offerta base "@it , "base offer "@en ; cis:hasEligibleUser userType:Under18 ; cis:hasPriceSpecification priceSpecification:Under18 ; cis:hasValidity validity:Biblioteca_nazionale_centrale_validity ; cis:includes ticket:Biblioteca_nazionale_centrale_ticket_1 .
version info: stabile
version info: stable @en

Oggetto Culturale
type: Class
comment: It represents a cultural asset (even intagible) of the cultural heritage. @en
comment: Rappresenta un bene, materiale o immateriale, del patrimonio culturale.
label: Cultural Heritage Object @en
subclass of: Entità culturale
subclass of: Restriction
  on property: nome
  some values from: Literal
subclass of: Restriction
  all values from: Sede
  on property: è nella sede
description: Un esempio di utilizzo della classe cis:CulturalHeritageObject iè il seguente: culturalheritageobject:Nascita_di_Venere a cis:CulturalHeritageObject ; rdfs:label "Nascita di Venere"@it ;; cis:name "Nascita di Venere"@it ; cis:isInSite site:Palazzo_degli_uffizi .
description: An example of usage of the class cis:CulturalHeritageObject is the following: culturalheritageobject:Nascita_di_Venere a cis:CulturalHeritageObject ; rdfs:label "Nascita di Venere"@it ;; cis:name "Nascita di Venere"@it ; cis:isInSite site:Palazzo_degli_uffizi . @en
version info: stabile
version info: stable @en

Centri di ricerca e promozione culturale
type: Tipo di Istituto e Luogo della Cultura
type: Class
type: NamedIndividual
comment: This class represents cultural institutions that form so-called cultural research and promotion centers. @en
comment: Questa classe rappresenta istituti culturali che costituiscono centri di ricerca e di promozione culturale.
label: Cultural Reseach and Promotion Center @en
subclass of: Istituto e Luogo Della Cultura
description: An example of usage of the class cis:CultReseachCenter is the following: crc:Fondazione_Arnaldo_Pomodoro a cis:CultReseachCenter ; rdfs:label "Fondazione Arnaldo Pomodoro"@it ; rdfs:label "Arnaldo Pomodoro Foundation"@en ; cis:institutionalName "Fondazione Arnaldo Pomodoro"@it ; cis:institutionalName "Arnaldo Pomodoro Foundation"@en ; cis:ISILIdentifier "IT-EX0005" . @en
description: Un esempio di utilizzo della classe cis:CultReseachCenter è il seguente: crc:Fondazione_Arnaldo_Pomodoro a cis:CultReseachCenter ; rdfs:label "Fondazione Arnaldo Pomodoro"@it ; rdfs:label "Arnaldo Pomodoro Foundation"@en ; cis:institutionalName "Fondazione Arnaldo Pomodoro"@it ; cis:institutionalName "Arnaldo Pomodoro Foundation"@en ; cis:ISILIdentifier "IT-EX0005" .
equivalent class: Restriction
  has value: Centri di ricerca e promozione culturale
  on property: ha tipo
version info: unstable @en
version info: versione non definitiva

ha categoria
type: ObjectProperty
comment: Proprietà che permette di associare all'istituto e luogo della cultura la categoria a cui esso è tipicamente associato (es. archeologia, etnografia e antropologia, arte, ...).
comment: Property used to associate the Cultural Institute or Site with its own field of knowledge @en
domain: Istituto e Luogo Della Cultura
label: has discipline @en
range: Categoria prevalente
version info: stabile
version info: stable

Unità di misura
type: Class
comment: Classe che rappresenta un'unità di misura
comment: Class that represents a measurement unit @en
label: Measurement Unit @en
description: Individuals of this class expresses a definite magnitude of physical quantities. For example it is possible to define a quantity for time (e.g., the second), space (e.g., the metre), or temperature (the celcius degree). A measurement unit is always related to individuals of the class 'Quantitative Value' by means of the object property hasMeasurementUnit. This allows representing as RDF assertions like 'the validity of the offer is of 7 days', e.g., quantitativeValue:BaseOfferDuration a cis:QuantitativeValue ; rdfs:label "Durata di validità dell'offerta base della biblioteca nazionale centrale di Roma"@it ; cis:hasMeasurementUnit cis:Day ; cis:hasValue "7"^^xsd:positiveInteger . cis:Day a cis:MeasurementUnit @en
description: Individui di questa classe rappresentano un insieme definito di quantità fisiche. Per esempio, è possibile definire una quantità per il tempo (e.g., il secondo), per lo spazio (e.g., metro) o per la temperatura (gradi celcius) Un'unità di misura è sempre collegata agli individui della classe "Valore Quantitativo" attraverso la proprietà "ha unità di misura". Questo consente di rappresentare in RDF asserzioni come " la validità dell'offerta è di 7 giorni". Per esempio: quantitativeValue:BaseOfferDuration a cis:QuantitativeValue ; rdfs:label "Durata di validità dell'offerta base della biblioteca nazionale centrale di Roma"@it ; cis:hasMeasurementUnit cis:Day ; cis:hasValue "7"^^xsd:positiveInteger . cis:Day a cis:MeasurementUnit
version info: versione non definitiva
version info: unstable @en

è membro di
type: ObjectProperty
comment: Inverse property of hasMember. @en
comment: Proprietà inversa di hasMember.
domain: Class
  union of: Collezione
  union of: Oggetto Culturale
label: is member of @en
range: Collezione
version info: stable @en
version info: stabile

toponimo
type: DatatypeProperty
comment: Proprietà che rappresenta il toponimo dell'area geografica.
comment: This property represents the toponym of a geographical area. @en
domain: Area Geografica
label: toponym @en
range: Literal
sub property of: nome
version info: stabile
version info: stable @en

Area amministrativa ecclesiastica
type: Class
comment: Questa classe rappresenta un'area amministrativa territoriale ecclesiastica. Essa include le diocesi, parrocchie, ecc.
comment: This class represents the clerical administrative area. It can be used to represents Diocese, Parish, etc. @en
label: Clerical Administrative Area @en
subclass of: Area Geografica
subclass of: Restriction
  cardinality: 1
  on property: identificativo
description: Un esempio di utilizzo della classe cis:ClericalAdministrativeArea è il seguente caa:Diocesi_di_San_Marco_Argentano-Scalea a cis:ClericalAdministrativeArea ; rdfs:label "Diocese of San Marco Argentano-Scalea"@en ; rdfs:label "Diocesi di San Marco Argentano-Scalea"@it ; cis:toponym "Diocesi di San Marco Argentano-Scalea"@it ; cis:toponym "Diocese of San Marco Argentano-Scalea"@en ; cis:identifier "SMA-CS" .
description: An example of usage of the class cis:ClericalAdministrativeArea èil the following: caa:Diocesi_di_San_Marco_Argentano-Scalea a cis:ClericalAdministrativeArea ; rdfs:label "Diocese of San Marco Argentano-Scalea"@en ; rdfs:label "Diocesi di San Marco Argentano-Scalea"@it ; cis:toponym "Diocesi di San Marco Argentano-Scalea"@it ; cis:toponym "Diocese of San Marco Argentano-Scalea"@en ; cis:identifier "SMA-CS" . @en
version info: stabile
version info: stable @en

Attrezzatura
type: Class
comment: Rappresenta l'attrezzatura resa disponibile dall'Istituto e luogo della cultura. Per esempio è un'attrezzatura un totem, ecc.
comment: It represents the equipment made available by the Cultural Institute or Site. For instance, the equipment can be a totem, etc. @en
label: Equipment @en
subclass of: Restriction
  on property: nome
  some values from: Literal
description: An example of usage of the class cis:Equipment is the following: equ:Photocopier a cis:Equipment ; rdfs:label "Photocopier"@en ; rdfs:label "Fotocopiatrice"@it ; cis:name "Photocopier"@en ; cis:name "Fotocopiatrice"@it . cissite:Biblioteca_nazionale_centrale cis:makesAvailableEquipment equ:Photocopier . @en
description: Un esempio di utilizzo della classe cis:Equipment è il seguente: equ:Photocopier a cis:Equipment ; rdfs:label "Photocopier"@en ; rdfs:label "Fotocopiatrice"@it ; cis:name "Photocopier"@en ; cis:name "Fotocopiatrice"@it . cissite:Biblioteca_nazionale_centrale cis:makesAvailableEquipment equ:Photocopier .
version info: stabile
version info: stable @en

Carta d'ingresso
type: Class
comment: This class represents a card valid for the entrance to more than one Cultural Institute or Site. It is a subclass of Ticket. @en
comment: Questa classe rappresenta una carta d'ingresso che dà diritto a più ingressi in più luoghi della cultura. E' sottoclasse di ticket.
label: Card @en
subclass of: Biglietto
description: An example of usage of the class cis:Card is the following: card:Parco_archeologico_di_Liternum_Card a cis:Card ; rdfs:label "Ingresso per due giorni al Parco archeologico di Liternum"@it ; rdfs:label "Two-day access to Parco archeologico di Liternum"@en ; cis:name "Ingresso per due giorni al Parco archeologico di Liternum"@it ; cis:name "Two-day access to the Parco archeologico di Liternum"@en ; cis:hasValidity Parco_archeologico_di_Liternum_Card_Validity ; cis:forAccessTo cissite:Parco_archeologico_di_Liternum ; cis:description "With this card a tourist can visit Parco archeologico di Liternum for 2 consecutive days"@en ; cis:description "La card permette l'accesso al Parco archeologico di Liternum per 2 giorni consecutivi"@it . validity:Parco_archeologico_di_Liternum_Card_Validity a cis:Validity ; rdfs:label "Two-day validity"@en ; rdfs:label "Validità per due giorni"@it ; cis:hasDuration Parco_archeologico_di_Liternum_Card_Validity_Duration . quantitativevalue:Parco_archeologico_di_Liternum_Card_Validity_Duration a cis:QuantitativeValue ; rdfs:label "2" ; cis:hasMeasurementUnit cis:Day ; cis:hasValue "2"^^xsd:positiveInteger . cis:Day a cis:MeasurementUnit . @en
description: Un esempio di utilizzo della classe cis:Card è il seguente: card:Parco_archeologico_di_Liternum_Card a cis:Card ; rdfs:label "Ingresso per due giorni al Parco archeologico di Liternum"@it ; rdfs:label "Two-day access to Parco archeologico di Liternum"@en ; cis:name "Ingresso per due giorni al Parco archeologico di Liternum"@it ; cis:name "Two-day access to the Parco archeologico di Liternum"@en ; cis:hasValidity Parco_archeologico_di_Liternum_Card_Validity ; cis:forAccessTo cissite:Parco_archeologico_di_Liternum ; cis:description "With this card a tourist can visit Parco archeologico di Liternum for 2 consecutive days"@en ; cis:description "La card permette l'accesso al Parco archeologico di Liternum per 2 giorni consecutivi"@it . validity:Parco_archeologico_di_Liternum_Card_Validity a cis:Validity ; rdfs:label "Two-day validity"@en ; rdfs:label "Validità per due giorni"@it ; cis:hasDuration Parco_archeologico_di_Liternum_Card_Validity_Duration . quantitativevalue:Parco_archeologico_di_Liternum_Card_Validity_Duration a cis:QuantitativeValue ; rdfs:label "2" ; cis:hasMeasurementUnit cis:Day ; cis:hasValue "2"^^xsd:positiveInteger . cis:Day a cis:MeasurementUnit .
version info: stabile
version info: stable @en

Categoria prevalente
type: Class
comment: It represents a a field of knowledge or human activity. This can be defined in a controlled vocabulary. Examples can be: Modern Art, Ancient History, Ethnografy, etc. @en
comment: Rappresenta un certo ambito della conoscenza o dell'attività umana. Tale ambito è preferibilmente modellato mediante un vocabolario controllato. Esempi: arte contemporanea, storia antica, etnografia, ecc.
label: Subject Discipline @en
subclass of: Restriction
  on property: nome
  some values from: Literal
subclass of: Restriction
  all values from: Literal
  on property: descrizione
description: Un esempio di utilizzo della classe cis:SubjectDiscipline è il seguente: cissite:Museo_archeologico_statale a cis:CulturalInstituteOrSite, cis:Museum ; rdfs:label "Museo archeologico statale" ; cis:institutionalName"Museo archeologico statale" ; cis:ISILIdentifier "T-EX0010" ; cis:hasDiscipline sd:Archeologia ; cis:hasSite site:Museo_archeologico_statale . sd:Archeologia a cis:SubjectDiscipline ; rdfs:label "Archeologia"@it ; rdfs:label "Archaeology"@en ; cis:name "Archeologia"@it ; cis:name "Archaeology"@en ; cis:description "Archaeology, or archeology, is the study of human activity through the recovery and analysis of material culture"@en ; cis:description "L'archeologia è la scienza che studia le civiltà e le culture umane del passato e le loro relazioni con l'ambiente circostante, mediante la raccolta, la documentazione e l'analisi delle tracce materiali che hanno lasciato architetture, manufatti, resti biologici e umani"@it .
description: An example of usage of the class cis:SubjectDiscipline is the following: cissite:Museo_archeologico_statale a cis:CulturalInstituteOrSite, cis:Museum ; rdfs:label "Museo archeologico statale" ; cis:institutionalName"Museo archeologico statale" ; cis:ISILIdentifier "T-EX0010" ; cis:hasDiscipline sd:Archeologia ; cis:hasSite site:Museo_archeologico_statale . sd:Archeologia a cis:SubjectDiscipline ; rdfs:label "Archeologia"@it ; rdfs:label "Archaeology"@en ; cis:name "Archeologia"@it ; cis:name "Archaeology"@en ; cis:description "Archaeology, or archeology, is the study of human activity through the recovery and analysis of material culture"@en ; cis:description "L'archeologia è la scienza che studia le civiltà e le culture umane del passato e le loro relazioni con l'ambiente circostante, mediante la raccolta, la documentazione e l'analisi delle tracce materiali che hanno lasciato architetture, manufatti, resti biologici e umani"@it . @en
version info: stable @en
version info: stabile

Bene Paesaggistico
type: NamedIndividual
type: Class
type: Tipo di Istituto e Luogo della Cultura
comment: This class represents a specific types of cultural institute or site, i.e., the cultural landscape asset. @en
comment: Questa classe rappresenta uno specifico tipo di istituto e luogo della cultura, i.e., il bene paessaggistico così come definito dall'art. 136 del Codice dei Beni Culturali.
label: Cultural Landscape Asset @en
subclass of: Istituto e Luogo Della Cultura
description: An example of usage of the class cis:CulturalLandscapeAsset is the following: cissite:Costiera_Amalfitana a cis:CulturalInstituteOrSite, cis:CulturalLandscapeAsset ; rdfs:label "Costiera Amalfitana"@it ; cis:institutionalName "Costiera Amalfitana"@en ; cis:ISILIdentifier "IT-EX0004" . @en
description: Un esempio di utilizzo della classe cis:CulturalLandscapeAsset è il seguente: cissite:Costiera_Amalfitana a cis:CulturalInstituteOrSite, cis:CulturalLandscapeAsset ; rdfs:label "Costiera Amalfitana"@it ; cis:institutionalName "Costiera Amalfitana"@en ; cis:ISILIdentifier "IT-EX0004" .
equivalent class: Restriction
  has value: Bene Paesaggistico
  on property: ha tipo
version info: versione non definitiva
version info: unstable @en

fornisce servizi
type: ObjectProperty
comment: Property used to represent a supply service relationship between a cultural institute or site and a service. @en
comment: Proprietà utilizzata per rappresentare una relazione di fornitura di servizi da parte di un istituto e luogo della cultura.
domain: Istituto e Luogo Della Cultura
label: provides Service @en
range: Servizio
version info: stable
version info: stabile

ha validità
type: ObjectProperty
comment: Proprietà utilizzata per specificare una validità di un offerta o di un biglietto.
comment: Property used to specify the validity of an offer or ticket. @en
domain: Class
  union of: Offerta
  union of: Biglietto
label: has validity @en
range: Validità
version info: unstable @en
version info: versione non definitiva

Martedì
type: Giorno della settimana
type: NamedIndividual
label: Tuesday @en

tipo di geometria
type: FunctionalProperty
type: DatatypeProperty
comment: Questa proprietà è utilizzata per identificare il tipo di geometria (punto, linea, o poligono) nella rappresentazione geospaziale.
comment: This property is used to represent the geometry type (point, line, or polygon) in the geospatial representation. @en
domain: Geometria
label: geometry type @en
range: Literal
version info: stabile
version info: stable @en

Complesso Monumentale
type: Tipo di Istituto e Luogo della Cultura
type: NamedIndividual
type: Class
comment: It represents a specific type of Cultural Institute or Site; that is, Monumental Area @en
comment: Rappresenta uno specifico tipo di Istituto e Luogo della Cultura ovvero Complesso Monumentale.
label: Monumental Area or Complex @en
subclass of: Istituto e Luogo Della Cultura
description: An example of usage of the class cis:MonumentalArea is the following: cissite:COMPLESSO_MONUMENTALE_DI_VICOPISANO_ROCCA_DEL_BRUNELLESCHI_E_PALAZZO_PRETORIO a cis:CulturalInstituteOrSite, cis:MonumentalArea ; rdfs:label "COMPLESSO MONUMENTALE DI VICOPISANO: ROCCA DEL BRUNELLESCHI E PALAZZO PRETORIO" ; cis:institutionalName "COMPLESSO MONUMENTALE DI VICOPISANO: ROCCA DEL BRUNELLESCHI E PALAZZO PRETORIOi" ; cis:ISILIdentifier "IT-EX0007" . @en
description: Un esempio di utilizzo della classe cis:MonumentalArea è il seguente: cissite:COMPLESSO_MONUMENTALE_DI_VICOPISANO_ROCCA_DEL_BRUNELLESCHI_E_PALAZZO_PRETORIO a cis:CulturalInstituteOrSite, cis:MonumentalArea ; rdfs:label "COMPLESSO MONUMENTALE DI VICOPISANO: ROCCA DEL BRUNELLESCHI E PALAZZO PRETORIO" ; cis:institutionalName "COMPLESSO MONUMENTALE DI VICOPISANO: ROCCA DEL BRUNELLESCHI E PALAZZO PRETORIOi" ; cis:ISILIdentifier "IT-EX0007" .
equivalent class: Restriction
  has value: Complesso Monumentale
  on property: ha tipo
version info: stabile
version info: stable @en

è svolto da
type: ObjectProperty
comment: Proprietà inversa di "ha un ruolo nel tempo"
comment: Inverse property of "holds a role in time" @en
domain: Ruolo Nel Tempo
label: is held by @en
range: Agente
inverse of: detiene un ruolo nel tempo

codice postale
type: DatatypeProperty
comment: Property used to represent the post code of the address of the site of a cultural institute or site. @en
comment: Proprietà utilizzata per rappresentare il codice postale.
domain: Indirizzo
label: post code @en
range: Literal
version info: stable
version info: stabile

Area Archeologica
type: Tipo di Istituto e Luogo della Cultura
type: NamedIndividual
type: Class
comment: Rappresenta uno specifico tipo di Istituto e Luogo della Cultura ovvero Area archeologica.
comment: It represents a specific type of Cultural Institute or SIte; that is, ArchaeologicalArea @en
label: Archaeological Area @en
subclass of: Istituto e Luogo Della Cultura
description: An example of usage of the class cis:ArchaeologicalArea is the following: cissite:Museo_delle_navi_romane_di_Nemi a cis:CulturalInstituteOrSite, cis:ArchaeologicalArea ; rdfs:label "Museo delle navi romane di Nemi" ; cis:institutionalName "Museo delle navi romane di Nemi" ; cis:ISILIdentifier "IT-EX0001" . @en
description: Un esempio di uso della classe cis:ArchaeologicalArea è il seguente: cissite:Museo_delle_navi_romane_di_Nemi a cis:CulturalInstituteOrSite, cis:ArchaeologicalArea ; rdfs:label "Museo delle navi romane di Nemi" ; cis:institutionalName "Museo delle navi romane di Nemi" ; cis:ISILIdentifier "IT-EX0001" .
equivalent class: Restriction
  has value: Area Archeologica
  on property: ha tipo
version info: stabile
version info: stable @en

Attributo
type: Class
comment: Rappresenta gli attributi di una certa descrizione della sede fisica di un istituto e luogo della cultura. Per esempio, metratura, scaffalatura, ecc.
comment: It represents the attribute that a site description of a site of a cultural institute or site may have. For instance, length, the shelving in a library, etc. @en
label: Attribute @en
subclass of: Restriction
  all values from: Literal
  on property: nome
subclass of: Restriction
  all values from: Literal
  on property: descrizione
description: An example of usage of the class cis:Attribute is the following: attribute:Shelving a cis:Attribute ; rdfs:label "Shelving"@en ; rdfs:label "Scaffalature"@it ; cis:name "Shelving"@en ; cis:name "Scaffalature"@it ; cis:description "The linear dimension of a shelf unit (e.g. 3 meters)"@en ; cis:description "La dimensione di uno scaffale in metri lineari (es. 3 metri)"@it . @en
description: Un esempio di utilizzo della classe cis:Attribute è il seguente: attribute:Shelving a cis:Attribute ; rdfs:label "Shelving"@en ; rdfs:label "Scaffalature"@it ; cis:name "Shelving"@en ; cis:name "Scaffalature"@it ; cis:description "The linear dimension of a shelf unit (e.g. 3 meters)"@en ; cis:description "La dimensione di uno scaffale in metri lineari (es. 3 metri)"@it .
version info: stabile
version info: stable @en

Nome Nel Tempo
type: Class
comment: Permette di rappresentare una situazione relativa alla denominazione di un istituto e luogo della cultura che cambia nel tempo.
comment: Permits to represent a situation in which a name of the Cultural Institute or Site change in time. @en
label: Name in Time @en
subclass of: Restriction
  on property: Institutional Name
  some values from: Literal
subclass of: Restriction
  all values from: Literal
  on property: nome alternativo dell'istituto e luogo della cultura
subclass of: Restriction
  on property: è valido durante
  some values from: Intervallo di Tempo
description: An example of usage of the class cis:NameInTime is the following: cissite:Museo_di_Capodimonte a cis:CulturalInstituteOrSite, cis:Museum ; rdfs:label "Museo di Capodimonte" ; cis:institutionalName "Museo di Capodimonte" ; cis:ISILIdentifier "IT-EX0008" ; cis:hasNameInTime nit:Museo_di_Capodimonte ; cis:hasSite site:Museo_di_Capodimonte . nit:Museo_di_Capodimonte a cis:NameInTime ; rdfs:label "Denominazione nel tempo 'Museo di Capodimonte'"@it ; cis:institutionalName "Museo di Capodimonte"@it ; cis:altLabel "Museo Nazionale di Capodimonte"@it ; cis:isValidDuring ti:Intervallo_di_tempo_per_denominazione_nel_tempo_Museo_di_Capodimonte . ti:Intervallo_di_tempo_per_denominazione_nel_tempo_Museo_di_Capodimonte a cis:TimeInterval ; cis:startDate "1957" . @en
description: Un esempio di utilizzo della classe cis:NameInTime è il seguente: cissite:Museo_di_Capodimonte a cis:CulturalInstituteOrSite, cis:Museum ; rdfs:label "Museo di Capodimonte" ; cis:institutionalName "Museo di Capodimonte" ; cis:ISILIdentifier "IT-EX0008" ; cis:hasNameInTime nit:Museo_di_Capodimonte ; cis:hasSite site:Museo_di_Capodimonte . nit:Museo_di_Capodimonte a cis:NameInTime ; rdfs:label "Denominazione nel tempo 'Museo di Capodimonte'"@it ; cis:institutionalName "Museo di Capodimonte"@it ; cis:altLabel "Museo Nazionale di Capodimonte"@it ; cis:isValidDuring ti:Intervallo_di_tempo_per_denominazione_nel_tempo_Museo_di_Capodimonte . ti:Intervallo_di_tempo_per_denominazione_nel_tempo_Museo_di_Capodimonte a cis:TimeInterval ; cis:startDate "1957" .
version info: stabile
version info: stable @en

Sabato
type: Giorno della settimana
type: NamedIndividual
label: Saturday @en

Tipo di Chiusura Temporanea
type: Class
comment: Rappresenta il tipo di chiusura temporanea. Per esempio: per restauro, per inagibilità, ecc.
comment: It represents the type of temporary. Examples can be: closed for renovation, unfit for use, etc. @en
label: Type of Temporary Closure @en
subclass of: Restriction
  all values from: Literal
  on property: descrizione
subclass of: Restriction
  on property: nome
  some values from: Literal
description: An example of usage of the class cis:TemporaryClosureType is the following: cissite:Biblioteca_nazionale_centrale a cis:Library , cis:CulturalInstituteOrSite ; rdfs:label "Biblioteca nazionale centrale"@it ; cis:ISILIdentifier "IT-RM0267" ; cis:hasAccessCondition tc:Biblioteca_nazionale_centrale_temporary_closure . tc:Biblioteca_nazionale_centrale_temporary_closure a cis:TemporaryClosure ; rdfs:label "Chiusura temporanea della Biblioteca Nazionale Centrale di Roma per restauro"@it ; rdfs:label "Temporary closure of Biblioteca Nazionale Centrale di Roma for renovation"@en ; cis:description "Dal 19-01-2015 al 21-01-2015 la Biblioteca Nazionale centrale chiude per restauro"@it ; cis:description "From 2015-01-19 al 2015-01-21 Biblioteca Nazionale centrale is closed for renovation"@en ; cis:hasReason "Renovation"@en; cis:hasReason "Restauro"@it ; cis:hasTemporaryClosureType tct:Renovation ; cis:hasDate "2015-01-19"^^xsd:date ; cis:hasDate "2015-01-20"^^xsd:date ; cis:hasDate "2015-01-21"^^xsd:date . tct:Renovation a cis:TemporaryClosureType; rdfs:label "Renovation"@en; rdfs:label "Restauro"@it ; cis:name "Renovation"@en; cis:name "Restauro";@it ; cis:description"Temporary Closure for Renovation";@en ; cis:description "Chiusura per Restauro";@it . @en
description: Un esempio di utilizzo della classe cis:TemporaryClosureType è il seguente: cissite:Biblioteca_nazionale_centrale a cis:Library , cis:CulturalInstituteOrSite ; rdfs:label "Biblioteca nazionale centrale"@it ; cis:ISILIdentifier "IT-RM0267" ; cis:hasAccessCondition tc:Biblioteca_nazionale_centrale_temporary_closure . tc:Biblioteca_nazionale_centrale_temporary_closure a cis:TemporaryClosure ; rdfs:label "Chiusura temporanea della Biblioteca Nazionale Centrale di Roma per restauro"@it ; rdfs:label "Temporary closure of Biblioteca Nazionale Centrale di Roma for renovation"@en ; cis:description "Dal 19-01-2015 al 21-01-2015 la Biblioteca Nazionale centrale chiude per restauro"@it ; cis:description "From 2015-01-19 al 2015-01-21 Biblioteca Nazionale centrale is closed for renovation"@en ; cis:hasReason "Renovation"@en; cis:hasReason "Restauro"@it ; cis:hasTemporaryClosureType tct:Renovation ; cis:hasDate "2015-01-19"^^xsd:date ; cis:hasDate "2015-01-20"^^xsd:date ; cis:hasDate "2015-01-21"^^xsd:date . tct:Renovation a cis:TemporaryClosureType; rdfs:label "Renovation"@en; rdfs:label "Restauro"@it ; cis:name "Renovation"@en; cis:name "Restauro";@it ; cis:description"Temporary Closure for Renovation";@en ; cis:description "Chiusura per Restauro";@it .
version info: stabile
version info: stable @en

Descrizione della sede
type: Class
comment: Permette di rappresentare una descrizione della sede fisica dell'istituto e luogo della cultura (per esempio, la sede ha una metratura complessiva di XX mq suddivisa in metratura al pubblico e una scaffalatura complessiva di n. YYY).
comment: Permits to represents a description of a site of the cultural institute or site (for instance, the site has a total space available XXX, and a shelving that consists of a set of XX X shelves, etc.) @en
label: Site Description @en
subclass of: Restriction
  all values from: Attributo
  on property: ha attribute
subclass of: Restriction
  all values from: Literal
  on property: descrizione
description: An example of usage of the class cis:SiteDescription is the following: site:Sede_di_Biblioteca_nazionale_centrale_di_Roma a cis:Site ; rdfs:label "Sede Biblioteca nazionale centrale di Roma"@it ; cis:hasAddress address:Indirizzo_della_sede_di_Biblioteca_nazionale_centrale_di_Roma ; cis:hasContactPoint contactPoint:Contatti_di_Biblioteca_nazionale_centrale_di_Roma ; cis:hasGeographicalLocation geographicalFeature:Comune_di_Roma ; cis:isSiteOf cissite:Biblioteca_nazionale_centrale ; cis:hasSiteDescription sd:Sede_di_Biblioteca_nazionale_centrale_di_Roma ; cis:name "Sede di: Biblioteca nazionale centrale di Roma"@it . sd:Sede_di_Biblioteca_nazionale_centrale_di_Roma a cis:SiteDescription ; rdfs:label"Description of the 'Sede di Biblioteca Nazionale Centrale di Roma'"@en ; rdfs:label "Descrizione della 'Sede di Biblioteca Nazionale Centrale di Roma'"@it ; cis:description "La libreria 1000 metri di scaffalature"@it ; cis:description "The Library has 1000 meters of shelves"@en ; cis:hasAttribute attribute:Shelving . attribute:Shelving a cis:Attribute ; rdfs:label "Shelving"@en ; rdfs:label "Scaffalature";@it ; cis:name "Shelving"@en ; cis:name "Scaffalature"@it ; cis:description "The linear dimension of a shelf unit (e.g. 3 meters)"@en ; cis:description ";La dimensione di uno scaffale in metri lineari (es. 3 metri)"@it . @en
description: Un esempio di utilizzo della classe cis:SiteDescription è il seguente: site:Sede_di_Biblioteca_nazionale_centrale_di_Roma a cis:Site ; rdfs:label "Sede Biblioteca nazionale centrale di Roma"@it ; cis:hasAddress address:Indirizzo_della_sede_di_Biblioteca_nazionale_centrale_di_Roma ; cis:hasContactPoint contactPoint:Contatti_di_Biblioteca_nazionale_centrale_di_Roma ; cis:hasGeographicalLocation geographicalFeature:Comune_di_Roma ; cis:isSiteOf cissite:Biblioteca_nazionale_centrale ; cis:hasSiteDescription sd:Sede_di_Biblioteca_nazionale_centrale_di_Roma ; cis:name "Sede di: Biblioteca nazionale centrale di Roma"@it . sd:Sede_di_Biblioteca_nazionale_centrale_di_Roma a cis:SiteDescription ; rdfs:label"Description of the 'Sede di Biblioteca Nazionale Centrale di Roma'"@en ; rdfs:label "Descrizione della 'Sede di Biblioteca Nazionale Centrale di Roma'"@it ; cis:description "La libreria 1000 metri di scaffalature"@it ; cis:description "The Library has 1000 meters of shelves"@en ; cis:hasAttribute attribute:Shelving . attribute:Shelving a cis:Attribute ; rdfs:label "Shelving"@en ; rdfs:label "Scaffalature";@it ; cis:name "Shelving"@en ; cis:name "Scaffalature"@it ; cis:description "The linear dimension of a shelf unit (e.g. 3 meters)"@en ; cis:description ";La dimensione di uno scaffale in metri lineari (es. 3 metri)"@it .
version info: stabile
version info: stable @en

coinvolge
type: ObjectProperty
comment: Proprietà di coinvolgimento che associa un evento a una generica entità culturale.
comment: Involvment property that associates an event with a general cultural entity @en
domain: Evento
label: involves @en
range: Entità culturale
version info: stabile
version info: stable

data di fine
type: DatatypeProperty
comment: end Date of a Time Interval @en
comment: Data di fine di un intervallo temporale
domain: Intervallo di Tempo
label: end Date @en
range: dateTime
version info: stabile
version info: stable @en

unità amministrativa di livello 2
type: DatatypeProperty
comment: Proprietà utilizzata per rappresentare l'unità amministrativa di livello 2 dell'indirizzo della sede di un istituto e luogo della cultura, di solito uno stato, una contea o ogni altra area che tipicamente ricomprende diverse località.
comment: Property used to represent the region of the address of the site of a cultural institute or site, usually a county, state or other such area that typically encompasses several localities. @en
domain: Indirizzo
label: administrative unit level 2 @en
range: Literal
version info: stable
version info: stabile

nome alternativo dell'istituto e luogo della cultura
type: DatatypeProperty
comment: Proprietà utilizzata per associare la situazione name in time a una denominazione alternativa dell'istituto e luogo della cultura.
comment: Property used to associate the situation name in time with the alternative name of the cultural institute or site @en
domain: Nome Nel Tempo
label: alternative label @en
range: Literal
sub property of: nome
version info: stable
version info: stabile

tratta di
type: ObjectProperty
comment: Proprietà che consente di associare un lavoro creativo a un'entità culturale. La stessa proprietà può essere utilizzata in maniera analoga per associare un lavoro creativo a un evento o a un sito.
comment: Property used to associate a creative work with a cultural entity. The same property is used in a similar way to associate the creative work with an event or site @en
domain: Lavoro Creativo
label: is about @en
range: Class
  union of: Entità culturale
  union of: Evento
  union of: Sede
version info: stable
version info: stabile

al tempo
type: ObjectProperty
comment: Proprietà che consente di associare un ruolo nel tempo a un intervallo temporale. La stessa proprietà è utilizzata in maniera analoga per associare una collezione a un intervallo temporale.
comment: Property used to associate the situation role in time with a temporal interval. The same property is used in a similar way to link a site or a collection to a temporal interval @en
domain: Class
  union of: Collezione
  union of: Ruolo Nel Tempo
label: at time @en
range: Intervallo di Tempo
version info: stable
version info: stabile

Catalogo
type: Class
comment: Concept used to represent the catalogue which describes the set of cultural heritage objects included in a Cultural Institute or Site @en
comment: Concetto utilizzato per rappresentare il catalogo che descrive l'insieme delle opere contenute in un istituto e luogo della cultura.
label: Catalogue @en
subclass of: Restriction
  all values from: Collezione
  on property: descrive
subclass of: Restriction
  all values from: anyURI
  on property: ha sito web
subclass of: Restriction
  all values from: Istituto e Luogo Della Cultura
  on property: è catalogo di
subclass of: Restriction
  all values from: Literal
  on property: descrizione
subclass of: Restriction
  on property: nome
  some values from: Literal
description: A catalogue is always associated with an individual of the class 'CulturalInstituteOrSite' (CIS) by means of the object property hasCatalogue (with domain CulturalInstituteOrSite and range Catalogue). The inverse property of hasCatalogue is isCatalogueOf and relates a catalogue to a CIS. An example in turtle is the following: catalogue:Catalogo_Generale_(autore) a cis:Catalogue ; rdfs:label "Catalogo Generale (autore)" ; cis:name "Catalogo Generale (autore)" ; cis:isCatalogueOf cissite:Biblioteca_nazionale_centrale ; cis:description "Catalogo Generale per autore - online"@it . cissite:Biblioteca_nazionale_centrale a cis:Library , cis:CulturalInstituteOrSite ; cis:hasCatalogue catalogue:Catalogo_Generale_(autore) . @en
description: Un catalogo è sempre associato a un individuo della classe "Istitute e luogo della cultura" attraverso la proprietà ha catalogo (che ha dominio CulturaInstituteOrSite e codominio Catalogue). La proprietà inversa di ha catalogo è "è catalogo di" e collega il catalogo all'istituto e luogo della cultura. Un esempio in turtle è il seguente: catalogue:Catalogo_Generale_(autore) a cis:Catalogue ; rdfs:label "Catalogo Generale (autore)" ; cis:name "Catalogo Generale (autore)" ; cis:isCatalogueOf cissite:Biblioteca_nazionale_centrale ; cis:description "Catalogo Generale per autore - online"@it . cissite:Biblioteca_nazionale_centrale a cis:Library , cis:CulturalInstituteOrSite ; cis:hasCatalogue catalogue:Catalogo_Generale_(autore) .
version info: stabile
version info: stable @en

è relativo a ruolo nel tempo
type: ObjectProperty
comment: proprietà inversa di "ruolo per"
comment: inverse property for "roleFor" @en
domain: Class
  union of: Entità culturale
  union of: Evento
label: is related to role in time @en
range: Ruolo Nel Tempo
inverse of: ruolo per

Lunedì
type: Giorno della settimana
type: NamedIndividual
label: Monday @en

ruolo per
type: ObjectProperty
type: FunctionalProperty
comment: Proprietà che consente di associare la situazione ruolo nel tempo esercitato da un agente al relativo istituto e luogo della cultura. La stessa proprietà è utilizzata in modo analogo per associare ruolo nel tempo all'evento.
comment: Property used to associate the situation role in time played by an agent with the relative cultural institute or site. The same property is used in a similar way to associate role in time with an event @en
domain: Ruolo Nel Tempo
label: role for @en
range: Class
  union of: Entità culturale
  union of: Evento
version info: stabile
version info: stable

Valuta
type: Class
comment: Questa classe rappresenta la valuta per i biglietti di ingresso agli eventi o luoghi della cultura. Nel nostro dominio è associata alla descrizione del prezzo per i biglietti. Assume valori specifici (e.g., Euro).
comment: This class represents a currency. In our domain currency is typically associated with Price Specification for tickets, and assumes specific values (e.g., Euro). @en
label: Currency @en
description: Individuals of the this class represent currency instances (e.g., Euro, US Dollar, Pound, Australian Dollar, etc.); they are always associated with individuals of the class 'Price Specification'. This allows modelling Price Specification as a a quantified value, where the value is expressed as an integer and it is quantified in terms of a currency An example is the following: priceSpecification:Under18> a cis:PriceSpecification ; rdfs:label "price specification under 18 "@en , "costo under 18 "@it ; cis:hasCurrency cis:Euro ; cis:hasCurrencyValue "5"^^xsd:float . cis:Euro a cis:Currency ; rdfs:label "Euro"@en, "Euro"@it . @en
description: Individui di questa classe rappresentano le istanze di valuta (e.g., euro, dollaro americano, sterlina, ecc) e sono sempre associati a individui della classe "Prezzo". Questo consente di modellare il prezzo come un valore quantitativo, dove il valore è espresso come un intero e è quantificato in termini di valura. Un esempio è il seguente: priceSpecification:Under18> a cis:PriceSpecification ; rdfs:label "price specification under 18 "@en , "costo under 18 "@it ; cis:hasCurrency cis:Euro ; cis:hasCurrencyValue "5"^^xsd:float . cis:Euro a cis:Currency ; rdfs:label "Euro"@en, "Euro"@it .
version info: stabile
version info: stable @en

Area Geografica
type: Class
comment: Rappresenta una caratteristica geografica. Può essere usata per rappresentare un comune, o un'area che ricomprendere diverse aree ammistrative.
comment: It represents a geographical feature. It can be used to model a municipality or an area across different administrative areas. @en
label: Geographical Area @en
subclass of: Restriction
  all values from: Geometria
  on property: ha geometria
subclass of: Restriction
  on property: toponimo
  some values from: Literal
description: Questa classe consente di descrivere un'area geografica. Le aree geografiche sono semrep associate a individui della classe Sede attraverso la proprietà ha locazione geografica (dominio Sede e codonimio Area Geografica). Un area geografica è descritta dall'insieme di individui della classe geometria. Un individuo della classe geometria è descritto utilizzando le coordinate del sistema di riferimento come per esempio WGS84. E? univocamente identificata da latitudine e longitudine. Questo significa che un area geografica può essere un punto, una linea o un poligono. Per esempio, il seguente frammento di codice in turtle fornisce rappresenta un area geografica corrispondente alla sede della Biblioteca Centrale di Roma. site:Sede_di_Biblioteca_nazionale_centrale_di_Roma a cis:Site ; cis:hasGeographicalLocation geographicalArea:Comune_di_Roma ; cis:isSiteOf cissite:Biblioteca_nazionale_centrale ; cis:name "Biblioteca nazionale centrale di Roma"@it . geographicalArea:Comune_di_Roma a cis:GeographicalArea ; rdfs:label "Comune di Roma"@it ; cis:toponym "Roma" ; owl:sameAs <http://spcdata.digitpa.gov.it/Comune/H501> , <http://datiopen.istat.it/odi/risorsa/territorio/comuni/Roma_58091> ; hasGeometry geometry:Comune_di_Roma . geometry:Comune_di_Roma a cis:Geometry ; geo:lat "41.906784" ; geo:long "12.504962" .
description: This class allows describing a geographical area. Geographical areas are always associated with individuals of the class 'Site' by means of the object property hasGeographicalLocation (domain Site and range 'Geographical Area'). A geographical area is described by a set of individuals of the class Geometry. A individual of the class Geometry is described by using a coordinate system related to Earth such as WGS84. It is univocally identified by lat/long. This means that a geographical area can be a point, a line or a polygon. For example, the following snippet provides a turtle model that represents a Geographical Area corresponding to the Site of the Biblioteca Centrale di Roma. site:Sede_di_Biblioteca_nazionale_centrale_di_Roma a cis:Site ; cis:hasGeographicalLocation geographicalArea:Comune_di_Roma ; cis:isSiteOf cissite:Biblioteca_nazionale_centrale ; cis:name "Biblioteca nazionale centrale di Roma"@it . geographicalArea:Comune_di_Roma a cis:GeographicalArea ; rdfs:label "Comune di Roma"@it ; cis:toponym "Roma" ; owl:sameAs <http://spcdata.digitpa.gov.it/Comune/H501> , <http://datiopen.istat.it/odi/risorsa/territorio/comuni/Roma_58091> ; hasGeometry geometry:Comune_di_Roma . geometry:Comune_di_Roma a cis:Geometry ; geo:lat "41.906784" ; geo:long "12.504962" . @en
version info: stable @en
version info: stabile

Giorno della settimana
type: Class
comment: This class represents the set of all the days of the week. @en
comment: Classe che rappresenta l'insieme dei giorni della settimana.
label: Day of the Week @en
description: An example of usage of the class cis:DayOfTheWeek is the following: orari:Orari_di_apertura_di_Biblioteca_nazionale_centrale_di_Roma_giovedi a cis:OpeningHoursSpecification ; rdfs:label "Opening Hours of Biblioteca nazionale centrale di Roma - thursday"@en , "Orari di apertura di Biblioteca nazionale centrale di Roma - giovedì"@it ; cis:closes "19:00:00"^^xsd:time ; cis:hasAdmissionType addmissionType:Tipo_di_apertura_al_pubblico ; cis:hasDayOfWeek cis:Thursday ; cis:opens "08:30:00"^^xsd:time . For the complete example see the class cis:OpeningHoursSpecification @en
description: Un esempio di utilizzo della classe cis:DayOfTheWeek è il seguente: orari:Orari_di_apertura_di_Biblioteca_nazionale_centrale_di_Roma_giovedi a cis:OpeningHoursSpecification ; rdfs:label "Opening Hours of Biblioteca nazionale centrale di Roma - thursday"@en , "Orari di apertura di Biblioteca nazionale centrale di Roma - giovedì"@it ; cis:closes "19:00:00"^^xsd:time ; cis:hasAdmissionType addmissionType:Tipo_di_apertura_al_pubblico ; cis:hasDayOfWeek cis:Thursday ; cis:opens "08:30:00"^^xsd:time . Per un esempio più completo si veda la classe cis:OpeningHoursSpecification
version info: unstable @en
version info: versione non definitiva

ha tipo di chiusura temporanea
type: ObjectProperty
comment: Property used to associate the temporary closure with its type @en
comment: Proprietà che consente di associare una chiusura temporanea al suo tipo.
domain: Chiusura Temporanea
label: has temporary closure type @en
range: Tipo di Chiusura Temporanea
version info: stabile
version info: stable

Condizioni di accesso
type: Class
comment: Concept used to represent general information for the public access to the Cultural Institute or Site or to the Event. For instance, examples of information include: opening hours, type of admission, temporary closing, etc. @en
comment: Concetto che rappresenta le informazioni generali per l'accesso da parte del pubblico all'Istituto e Luogo della Cultura e all'evento. Per esempio consente di modellare informazioni quali gi orari di apertura, le chiusure temporanee (con le relative motivazioni), il tipo di apertura al pubblico, ecc.
label: Access condition @en
subclass of: Restriction
  all values from: Class
    union of: Istituto e Luogo Della Cultura
    union of: Evento
  on property: condizione di accesso per
description: This class is used for representing the access conditions associated with a 'Cultural Institute or Site' or an 'Event'. Access conditions are meant to be indivuduals of the following classes: * Opening Hours Specification * Temporary Closure * Type of Booking An example in turtle is the following: cis a CulturalInstituteOrSite ; description "An entity representing an individual of the class 'Institute or Site.'" ; hasAccessCondition cis_access_condition . cis_access_condition a Access ; description "The individual of the class 'Access' that specifies the access condition associated with the CulturalInstituteOrSite called cis" . @en
description: Questa classe è utilizzata per rappresentare le condizioni di accesso associate a un "Istituto e luogo della Culrura" o a un "Evento": Le condizione di accesso sono individui delle seguenti classi: * Orari di apertura * Chiusara Temporanea * Tipo di Prenotazione Un esempio dell'uso della classe in turle è il seguente: cis a CulturalInstituteOrSite ; description "An entity representing an individual of the class 'Institute or Site.'" ; hasAccessCondition cis_access_condition . cis_access_condition a Access ; description "The individual of the class 'Access' that specifies the access condition associated with the CulturalInstituteOrSite called cis" .
version info: stabile
version info: stable @en

Orari di Apertura
type: Class
comment: Rappresenta gli orari di apertura
comment: It represents the opening hours specification @en
label: Opening Hours Specification @en
subclass of: Condizioni di accesso
subclass of: Restriction
  all values from: time
  on property: apre
subclass of: Restriction
  all values from: Tipo di apertura
  on property: ha tipo di apertura
subclass of: Restriction
  all values from: Giorno della settimana
  on property: ha giorno della settimana
subclass of: Restriction
  all values from: time
  on property: chiude
subclass of: Restriction
  all values from: Literal
  on property: descrizione
description: Individui di questa classe specificano particolari condizioni di accesso ai luoghi della cultura o eventi, i.e., gli orari di apertura dei luoghi o degli eventi. Gli orari di apertura sono espressi in termini di * orario apertura (con la proprietà "apre") * orario di chiusura (con la proprietà "chiude") * il giorno della settimana a cui l'orario di apertura si riferisce (con la proprietà ha giorno della settimana) * il tipo di apertura (settimanale, mensile, giornaliera, ecc) (con la proprietà ha tipo di apertura) Un esempio in turle è il seguente: cissite:Biblioteca_nazionale_centrale a cis:Library , cis:CulturalInstituteOrSite ; cis:hasAccessCondition orari:Orari_di_apertura_di_Biblioteca_nazionale_centrale_di_Roma_giovedi orari:Orari_di_apertura_di_Biblioteca_nazionale_centrale_di_Roma_giovedi a cis:OpeningHoursSpecification ; rdfs:label "Opening Hours of Biblioteca nazionale centrale di Roma - thursday"@en , "Orari di apertura di Biblioteca nazionale centrale di Roma - giovedì"@it ; cis:closes "19:00:00"^^xsd:time ; cis:hasAdmissionType addmissionType:Tipo_di_apertura_al_pubblico ; cis:hasDayOfWeek cis:Thursday ; cis:opens "08:30:00"^^xsd:time . admissionType:Tipo_di_apertura_al_pubblico a cis:AdmissionType ; cis:description "daily" .
description: Individuals of this class specify a particula access conditions, i.e., the opening hours of a 'Cultural Institute or Site' or an 'Event'. Opening hours are represented in terms of: * opening time (cf. property opens); * closing time (cf. property closes); * the day of the week that the opening specification refers to (cf. property hasDayOfWeek); * the admission type, e.g. weekly, monthly, daily, etc (cf. property hasAdmmissionType). An example in turtle is the following: cissite:Biblioteca_nazionale_centrale a cis:Library , cis:CulturalInstituteOrSite ; cis:hasAccessCondition orari:Orari_di_apertura_di_Biblioteca_nazionale_centrale_di_Roma_giovedi orari:Orari_di_apertura_di_Biblioteca_nazionale_centrale_di_Roma_giovedi a cis:OpeningHoursSpecification ; rdfs:label "Opening Hours of Biblioteca nazionale centrale di Roma - thursday"@en , "Orari di apertura di Biblioteca nazionale centrale di Roma - giovedì"@it ; cis:closes "19:00:00"^^xsd:time ; cis:hasAdmissionType addmissionType:Tipo_di_apertura_al_pubblico ; cis:hasDayOfWeek cis:Thursday ; cis:opens "08:30:00"^^xsd:time . admissionType:Tipo_di_apertura_al_pubblico a cis:AdmissionType ; cis:description "daily" . @en
version info: stable @en
version info: stabile

Evento
type: Class
comment: it represents an event that typically is related to the cultural domain @en
comment: Rappresenta un evento culturale.
label: Event @en
subclass of: Restriction
  on property: è ospitato da
  some values from: Sede
subclass of: Restriction
  on property: nome
  some values from: Literal
subclass of: Restriction
  all values from: Evento
  on property: è sotto evento di
subclass of: Restriction
  all values from: Evento
  on property: ha sotto eventi
subclass of: Restriction
  all values from: Biglietto
  on property: ha biglietto
subclass of: Restriction
  on property: è relativo a ruolo nel tempo
  some values from: Ruolo Nel Tempo
description: Un esempio di utilizzo della classe cis:Event è il seguente: event:Vincenzo_Gemito_al_Museo_di_Capodimonte a cis:Event; cis:isHostedBy site:Museo_di_Capodimonte; cis:name "Vincenzo Gemito, dal salotto Minozzi al Museo di Capodimonte" ; rdfs:comment "Apre al pubblico al Museo di Capodimonte la mostra ‘Vincenzo Gemito, dal salotto Minozzi al Museo di Capodimonte’, organizzata dalla Soprintendenza speciale per il patrimonio storico" ; cis:involves culturalheritageobject:Il_giocatore_di_carte ; cis:hasSubEvent event:Vincenzo_Gemito_Il_Pescatorello ; rdfs:label "Vincenzo Gemito, dal salotto Minozzi al Museo di Capodimonte" ; cis:takesPlaceDuring ti:Durata_di_Vincenzo_Gemito_dal_salotto_Minozzi_al_Museo_di_Capodimonte . event:Vincenzo_Gemito_Il_Pescatorello a cis:Event ; cis:isHostedBy site:Museo_di_Capodimonte; rdfs:label "Vincenzo Gemito, esposizione de Il Pescatorello" ; cis:name "Vincenzo Gemito, esposizione de Il Pescatorello&apos" ; cis:involves culturalheritageobject:Il_Pescatorello ; cis:takesPlaceDuring ti:Durata_di_Vincenzo_Gemito_dal_salotto_Minozzi_al_Museo_di_Capodimonte . ti:Durata_di_Vincenzo_Gemito_dal_salotto_Minozzi_al_Museo_di_Capodimonte a cis:TimeInterval ; rdfs:label "Intervallo di durata dell'evento 'Vincenzo Gemito, dal salotto Minozzi al Museo di Capodimonte'"; cis:startDate "2014-11-28T00:00:00"^^xsd:dateTime; cis:endDate "2015-07-16T00:00:00"^^xsd:dateTime . culturalheritageobject:Il_giocatore_di_carte a cis:CulturalHeritageObject ; rdfs:label "Il giocatore di carte" ;; cis:name "l giocatore di carte" ; cis:isInSite site:Museo_di_Capodimonte . cultualheritageobject:Il_Pescatorello a cis:CulturalHeritageObject ; rdfs:label "Il Pescatorello" ; cis:name "Il Pescatorello&quot" ; cis:isInSite site:Museo_di_Capodimonte .
description: An example of usage of the class cis:Event is the following: event:Vincenzo_Gemito_al_Museo_di_Capodimonte a cis:Event; cis:isHostedBy site:Museo_di_Capodimonte; cis:name "Vincenzo Gemito, dal salotto Minozzi al Museo di Capodimonte" ; rdfs:comment "Apre al pubblico al Museo di Capodimonte la mostra ‘Vincenzo Gemito, dal salotto Minozzi al Museo di Capodimonte’, organizzata dalla Soprintendenza speciale per il patrimonio storico" ; cis:involves culturalheritageobject:Il_giocatore_di_carte ; cis:hasSubEvent event:Vincenzo_Gemito_Il_Pescatorello ; rdfs:label "Vincenzo Gemito, dal salotto Minozzi al Museo di Capodimonte" ; cis:takesPlaceDuring ti:Durata_di_Vincenzo_Gemito_dal_salotto_Minozzi_al_Museo_di_Capodimonte . event:Vincenzo_Gemito_Il_Pescatorello a cis:Event ; cis:isHostedBy site:Museo_di_Capodimonte; rdfs:label "Vincenzo Gemito, esposizione de Il Pescatorello" ; cis:name "Vincenzo Gemito, esposizione de Il Pescatorello&apos" ; cis:involves culturalheritageobject:Il_Pescatorello ; cis:takesPlaceDuring ti:Durata_di_Vincenzo_Gemito_dal_salotto_Minozzi_al_Museo_di_Capodimonte . ti:Durata_di_Vincenzo_Gemito_dal_salotto_Minozzi_al_Museo_di_Capodimonte a cis:TimeInterval ; rdfs:label "Intervallo di durata dell'evento 'Vincenzo Gemito, dal salotto Minozzi al Museo di Capodimonte'" ; cis:startDate "2014-11-28T00:00:00"^^xsd:dateTime; cis:endDate "2015-07-16T00:00:00"^^xsd:dateTime . culturalheritageobject:Il_giocatore_di_carte a cis:CulturalHeritageObject ; rdfs:label "Il giocatore di carte" ;; cis:name "l giocatore di carte" ; cis:isInSite site:Museo_di_Capodimonte . cultualheritageobject:Il_Pescatorello a cis:CulturalHeritageObject ; rdfs:label "Il Pescatorello" ; cis:name "Il Pescatorello&quot" ; cis:isInSite site:Museo_di_Capodimonte . @en
version info: stabile
version info: stable @en

Ruolo Nel Tempo
type: Class
comment: Concetto utilizzato per rappresentare una situazione relativa a un ruolo che evolve nel tempo. Nel caso specifico il ruolo è esercitato da un agente su un istituto e luogo della cultura.
comment: Concept used to represent a situation in which a role can vary in time. In this specific domain, it is the role of an agent played on a Cultural Institute or Site. @en
label: Role in Time @en
subclass of: Restriction
  on property: con ruolo
  some values from: Ruolo
subclass of: Restriction
  on property: al tempo
  some values from: Intervallo di Tempo
subclass of: Restriction
  on property: ruolo per
  some values from: Class
    union of: Istituto e Luogo Della Cultura
    union of: Evento
subclass of: Restriction
  on class: Agente
  on property: è svolto da
  qualified cardinality: 1
description: Un esempio di utilizzo della classe cis:RoleInTime è il seguente: agent:Andrea_De_Pasquale a cis:Agent ; rdfs:label "Andrea De Pasquale"; ; cis:name "Andrea De Pasquale" ; cis:reportsTo agent:Soprintendenza ; cis:holdsRoleInTime roleInTime:Andrea_De_Pasquale_DirectorOfBibliotecaNazionaleCentrale . roleInTime:Andrea_De_Pasquale_DirectorOfBibliotecaNazionaleCentrale a cis:RoleInTime ; rdfs:label "Andrea De Pasquale director of Biblioteca Nazionale Centrale"@en ; cis:atTime timeInteval:Andrea_De_Pasquale_DirectorOfBibliotecaNazionaleCentrale_20130101_20161231 ; cis:roleFor cissite:Biblioteca_nazionale_centrale ; cis:withRole role:Director . timeInteval:Andrea_De_Pasquale_DirectorOfBibliotecaNazionaleCentrale_20130101_20161231 a cis:TimeInterval ; rdfs:label "Andrea De Pasquale director of Biblioteca Nazionale from 1-1-2013 through 31-12-2016"@en ; cis:startDate "2013-01-01"^^xsd:dateTime ; cis:endDate "2016-12-31"^^xsd:dateTime . role:Director a cis:Role ; rdfs:label "Director"@en ; rdfs:label "Direttore"@it ; cis:name "Direttore"@it ; cis:name ";Director"@en .
description: An example of usage of the class cis:RoleInTime is the following: agent:Andrea_De_Pasquale a cis:Agent ; rdfs:label "Andrea De Pasquale"; ; cis:name "Andrea De Pasquale" ; cis:reportsTo agent:Soprintendenza ; cis:holdsRoleInTime roleInTime:Andrea_De_Pasquale_DirectorOfBibliotecaNazionaleCentrale . roleInTime:Andrea_De_Pasquale_DirectorOfBibliotecaNazionaleCentrale a cis:RoleInTime ; rdfs:label "Andrea De Pasquale director of Biblioteca Nazionale Centrale"@en ; cis:atTime timeInteval:Andrea_De_Pasquale_DirectorOfBibliotecaNazionaleCentrale_20130101_20161231 ; cis:roleFor cissite:Biblioteca_nazionale_centrale ; cis:withRole role:Director . timeInteval:Andrea_De_Pasquale_DirectorOfBibliotecaNazionaleCentrale_20130101_20161231 a cis:TimeInterval ; rdfs:label "Andrea De Pasquale director of Biblioteca Nazionale from 1-1-2013 through 31-12-2016"@en ; cis:startDate "2013-01-01"^^xsd:dateTime ; cis:endDate "2016-12-31"^^xsd:dateTime . role:Director a cis:Role ; rdfs:label "Director"@en ; rdfs:label "Direttore"@it ; cis:name "Direttore"@it ; cis:name ";Director"@en . @en
version info: stable @en
version info: stabile

nome divisione postale
type: DatatypeProperty
comment: Property used to represent the key postal division of the address of the site of the cultural institute or site, usually the city. (INSPIRE's definition is 'One or more names created and maintained for postal purposes to identify a subdivision of addresses and postal delivery points.'). @en
comment: Proprietà utilizzata per rappresentare la divisione postale principale dell'indirizzo della sede dell'istituto e del luogo della cultura, di solito una città.
domain: Indirizzo
label: post name @en
range: Literal
version info: stabile
version info: stable

Collezione
type: Class
comment: Rappresenta il patrimonio complessivo dell'Istituto e Luogo della Cultura o le singole collezioni di cui esso si compone.
comment: It represents the cultural heritage included in a Cultural Institute or Site or single collections that compone the cultural heritage @en
label: Collection @en
subclass of: Entità culturale
subclass of: Restriction
  all values from: Intervallo di Tempo
  on property: al tempo
subclass of: Restriction
  all values from: Class
    union of: Collezione
    union of: Oggetto Culturale
  on property: ha membro
subclass of: Restriction
  all values from: Catalogo
  on property: è descritto da
subclass of: Restriction
  all values from: Literal
  on property: descrizione
subclass of: Restriction
  on property: nome
  some values from: Literal
description: Individuals of this class represent cultural heritage included in a Cultural Institute or Site. A Cultural Institute or Site can be related to a collection by means of the object property hasCollection. Additionally, a collection can be composed of items that, in turn, can be individuals of the class 'Collection' or the class 'Cultural Heritage Object'. For example, this allows to assert that the Biblioteca Centrale di Roma has its own cultural heritage (e.g,, Patrimonio di Biblioteca Centrale di Roma). This cultural heritage is composed of different items, e.g., Archivio Capizucchi, Fondo Ceccarius, etc. This can be modelled by using turtle in the following way: cissite:Biblioteca_nazionale_centrale a cis:Library , cis:CulturalInstituteOrSite ; cis:hasCollection collezioni:Patrimonio_di_Biblioteca_nazionale_centrale_di_Roma . collezioni:Patrimonio_di_Biblioteca_nazionale_centrale_di_Roma a cis:Collection ; rdfs:label "Patrimonio di: Biblioteca nazionale centrale di Roma" ; cis:hasMember collezioni:Archivio_Capizucchi, collezioni:Fondo_Ceccarius . collezioni:Archivio_Capizucchi a cis:Collection ; rdfs:label "Archivio Capizucchi" ; cis:isMemberOf collezioni:Patrimonio_di_Biblioteca_nazionale_centrale_di_Roma ; cis:description "materiale documentario relativo alla famiglia Capizucchi"@it . collezioni:Fondo_Ceccarius a cis:Collection ; rdfs:label "Fondo Ceccarius" ; cis:isMemberOf collezioni:Patrimonio_di_Biblioteca_nazionale_centrale_di_Roma ; cis:description "volumi, opuscoli, articoli e fotografie della biblioteca di G. Ceccarelli"@it . @en
description: Individui di questa classe rappresentano il patrimonio culturale incluso in un Istituto e luogo della cultural. Un Istituto e luogo della cultural è relazionato a una collezione attraverso la proprietà "ha collezione". Inoltre, una collezione può essere composta da elementi che a loro volta possono essere individui della classe "Collezione" o della classe "Oggetto culturale". L'esempio sotto riportato permette di asserire che la Biblioteca Centrale di Roma ha il proprio patrimonio (e..g, Patrimonio della Biblioteca Centrale di Roma). Questo patrimonio culturale è formato da diversi elementi, e.g., Archivio Cpizucchi, Fondo Ceccarius, ecc. Nello specifico, questo può essere modellato in turtle come segue: cissite:Biblioteca_nazionale_centrale a cis:Library , cis:CulturalInstituteOrSite ; cis:hasCollection collezioni:Patrimonio_di_Biblioteca_nazionale_centrale_di_Roma . collezioni:Patrimonio_di_Biblioteca_nazionale_centrale_di_Roma a cis:Collection ; rdfs:label "Patrimonio di: Biblioteca nazionale centrale di Roma" ; cis:hasMember collezioni:Archivio_Capizucchi, collezioni:Fondo_Ceccarius . collezioni:Archivio_Capizucchi a cis:Collection ; rdfs:label "Archivio Capizucchi" ; cis:isMemberOf collezioni:Patrimonio_di_Biblioteca_nazionale_centrale_di_Roma ; cis:description "materiale documentario relativo alla famiglia Capizucchi"@it . collezioni:Fondo_Ceccarius a cis:Collection ; rdfs:label "Fondo Ceccarius" ; cis:isMemberOf collezioni:Patrimonio_di_Biblioteca_nazionale_centrale_di_Roma ; cis:description "volumi, opuscoli, articoli e fotografie della biblioteca di G. Ceccarelli"@it .
version info: stabile
version info: stable @en

ha posta elettronica certificata (PEC)
type: DatatypeProperty
comment: Proprietà utilizzata per associare un indirizzo PEC a un punto di contatto
comment: Property used to associate a certified email address to a contact point @en
domain: Punto di Contatto
label: has certified email @en
range: anyURI
version info: stabile
version info: stable

Biglietto
type: Class
comment: It represents an entrance ticket for a Cultural Institute or Site, if required, and for an event @en
comment: Rappresenta il biglietto d'ingresso per l'Istitituto e Luogo della Cultura, qualora sia previsto, e per l'evento culturale.
label: Ticket @en
subclass of: Restriction
  all values from: Literal
  on property: descrizione
subclass of: Restriction
  all values from: Class
    union of: Istituto e Luogo Della Cultura
    union of: Evento
  on property: per l'accesso a
subclass of: Restriction
  all values from: Literal
  on property: nome
subclass of: Restriction
  all values from: Validità
  on property: ha validità
description: An example of usage of the class cis:Ticket is the following: offer:Biblioteca_Nazionale_Centrale_base_offer a cis:Offer ; rdfs:label "offerta base "@it , "base offer"@en ; cis:hasEligibleUser userType:Under18 ; cis:hasPriceSpecification priceSpecification:Under18 ; cis:hasValidity validity:Biblioteca_nazionale_centrale_validity ; cis:includes ticket:Biblioteca_nazionale_centrale_ticket_1 . ticket:Biblioteca_nazionale_centrale_ticket_1 a cis:Ticket ; rdfs:label "Biglietto per accedere a 'Biblioteca Nazionale Centrale di Roma'"@it ; rdfs:label "Ticket for access to 'Biblioteca Nazionale Centrale di Roma'"@en ; cis:name "Biglietto base per accedere 'Biblioteca Nazionale Centrale di Roma'"@it ; cis:name"Basic ticket for access to 'Biblioteca Nazionale Centrale di Roma'"@en ; cis:description "Biglietto che permette l'accesso per un giorno alla 'Biblioteca Nazionale Centrale di Roma'"@it ; cis:description "One-day ticket for 'Biblioteca Nazionale Centrale di Roma'"@en ; cis:hasValidity validity:Biblioteca_nazionale_centrale_ticket_1; cis:forAccessTo cissite:Biblioteca_nazionale_centrale . validity:Biblioteca_nazionale_centrale_ticket_1 a cis:Validity ; rdfs:label "One day validity"@en ; rdfs:label "Validità per 1 giorno"@it ; cis:hasDuration qv:Biblioteca_nazionale_centrale_ticket_1 . qv:Biblioteca_nazionale_centrale_ticket_1 a cis:QuantitativeValue ; rdfs:label "1"; cis:hasMeasurementUnit cis:Day ; cis:hasValue "1"^^xsd:positiveInteger . priceSpecification:Under18 a cis:PriceSpecification ; rdfs:label "price specification under 18 "@en , "costo per ragazzi sotto i 18 anni "@it ; cis:hasCurrency cis:Euro ; cis:hasCurrencyValue "5"^^xsd:float . userType:Under18 a cis:UserType ; rdfs:label "Under 18" ; cis:name "Under 18"; ; cis:description "People under 18 years old";@en; cis:description "Persone con età inferiore ai 18 anni"@it . @en
description: Un esempio dell'utilizzo della classe cis:Ticket è il seguente: offer:Biblioteca_Nazionale_Centrale_base_offer a cis:Offer ; rdfs:label "offerta base "@it , "base offer"@en ; cis:hasEligibleUser userType:Under18 ; cis:hasPriceSpecification priceSpecification:Under18 ; cis:hasValidity validity:Biblioteca_nazionale_centrale_validity ; cis:includes ticket:Biblioteca_nazionale_centrale_ticket_1 . ticket:Biblioteca_nazionale_centrale_ticket_1 a cis:Ticket ; rdfs:label "Biglietto per accedere a 'Biblioteca Nazionale Centrale di Roma'"@it ; rdfs:label "Ticket for access to 'Biblioteca Nazionale Centrale di Roma'"@en ; cis:name "Biglietto base per accedere 'Biblioteca Nazionale Centrale di Roma'"@it ; cis:name"Basic ticket for access to 'Biblioteca Nazionale Centrale di Roma'"@en ; cis:description "Biglietto che permette l'accesso per un giorno alla 'Biblioteca Nazionale Centrale di Roma'"@it ; cis:description "One-day ticket for 'Biblioteca Nazionale Centrale di Roma'"@en ; cis:hasValidity validity:Biblioteca_nazionale_centrale_ticket_1; cis:forAccessTo cissite:Biblioteca_nazionale_centrale . validity:Biblioteca_nazionale_centrale_ticket_1 a cis:Validity ; rdfs:label "One day validity"@en ; rdfs:label "Validità per 1 giorno"@it ; cis:hasDuration qv:Biblioteca_nazionale_centrale_ticket_1 . qv:Biblioteca_nazionale_centrale_ticket_1 a cis:QuantitativeValue ; rdfs:label "1"; cis:hasMeasurementUnit cis:Day ; cis:hasValue "1"^^xsd:positiveInteger . priceSpecification:Under18 a cis:PriceSpecification ; rdfs:label "price specification under 18 "@en , "costo per ragazzi sotto i 18 anni "@it ; cis:hasCurrency cis:Euro ; cis:hasCurrencyValue "5"^^xsd:float . userType:Under18 a cis:UserType ; rdfs:label "Under 18" ; cis:name "Under 18"; ; cis:description "People under 18 years old";@en; cis:description "Persone con età inferiore ai 18 anni"@it .
version info: stable @en
version info: stabile

è ospitato da
type: ObjectProperty
comment: This property is the inverse of "hosts" and links the Event to the Site of the Cultural Institute or Site @en
comment: Questa proprietà è l'inversa di "ospita" e collega un evento a una sede di un istituto e luogo della cultura
domain: Evento
label: is hosted by @en
range: Sede
inverse of: ospita
version info: versione non definitiva
version info: unstable @en

Biblioteca
type: NamedIndividual
type: Class
type: Tipo di Istituto e Luogo della Cultura
comment: It represents a specific type of Cultural Institute or Site; that is, Library @en
comment: Rappresenta uno specifico tipo di Istituto e Luogo della Cultura, ovvero Biblioteca.
label: Library @en
subclass of: Istituto e Luogo Della Cultura
equivalent class: Restriction
  has value: Biblioteca
  on property: ha tipo
version info: stabile
version info: stable @en

Parco Archeologico
type: Tipo di Istituto e Luogo della Cultura
type: Class
type: NamedIndividual
comment: It represents a specific type of Cultural Institute or SIte; that is, Archaeological Park @en
comment: Rappresenta uno specifico tipo di Istituto e Luogo della Cultura ovvero Parco Archeologico.
label: Archaeological Park @en
subclass of: Istituto e Luogo Della Cultura
description: Un esempio di utilizzo della classe cis:ArchaeologicalPark è il seguente: cissite:Parco_archeologico_di_Liternum a cis:CulturalInstituteOrSite, cis:ArchaeologicalPark ; rdfs:label "Parco archeologico di Liternum" ; cis:institutionalName "Parco archeologico di Liternum" ; cis:ISILIdentifier "IT-EX0002" .
description: An example of usage of the class cis:ArchaeologicalPark is the following: cissite:Parco_archeologico_di_Liternum a cis:CulturalInstituteOrSite, cis:ArchaeologicalPark ; rdfs:label "Parco archeologico di Liternum" ; cis:institutionalName "Parco archeologico di Liternum" ; cis:ISILIdentifier "IT-EX0002" . @en
equivalent class: Restriction
  has value: Parco Archeologico
  on property: ha tipo
version info: stable @en
version info: stabile

è sotto evento di
type: ObjectProperty
comment: Proprietà inversa di "ha sotto eventi"
comment: Inverse Property of "has sub event" @en
domain: Evento
label: is sub-event of @en
range: Evento
inverse of: ha sotto eventi

Oggetto audio
type: Class
comment: Concetto utilizzato per rappresentare materiali multimediali di tipo audio.
comment: Concept used to represent multimedia objects of type audio. @en
label: Audio Object @en
subclass of: Lavoro Creativo
subclass of: Restriction
  all values from: anyURI
  on property: url
description: An example of usage of the class cis:AudioObject is the following: audio:Audio_Tour_Parco_archeologico_di_Liternum a cis:AudioObject , cis:CreativeWork ; rdfs:label "Audio Tour of the Parco archeologico di Liternum"@en ; rdfs:label "Audio guida del Parco archeologico di Liternum"@it ; cis:url http://www.example.com/Audio/Audio_Tour_Parco_archeologico_di_Liternum.mp3 ; cis:isAbout cissite:Parco_archeologico_di_Liternum . @en
description: Un esempio di utilizzo della classe cis:AudioObject è il seguente: audio:Audio_Tour_Parco_archeologico_di_Liternum a cis:AudioObject , cis:CreativeWork ; rdfs:label "Audio Tour of the Parco archeologico di Liternum"@en ; rdfs:label "Audio guida del Parco archeologico di Liternum"@it ; cis:url http://www.example.com/Audio/Audio_Tour_Parco_archeologico_di_Liternum.mp3 ; cis:isAbout cissite:Parco_archeologico_di_Liternum .
version info: stabile
version info: stable @en

Prezzo
type: Class
comment: Rappresenta la specifica del prezzo del biglietto.
comment: It represents the price specification of the ticket @en
label: Price Specification @en
subclass of: Restriction
  on property: ha prezzo
  some values from: float
subclass of: Restriction
  on property: ha valuta
  some values from: Valuta
description: Un prezzo fornisce informazioni sul costo di un offerta necessaria per entrare in un luogo della cultura o accedere a un evento. E' associata a una valuta (e.g., euro) e al valore della valuta (quantità, e.g., 5). Il seguente esempio in turle mostra la specifica del prezzo per l'offerta base per entrare alla Biblioteca Nazionale Centrale di Roma priceSpecification:Under18 a cis:PriceSpecification ; rdfs:label "price specification under 18 "@en , "costo per i ragazzi sotto i 18 anni "@it ; cis:hasCurrency cis:Euro ; cis:hasCurrencyValue "5"^^xsd:float . offer:Biblioteca_Nazionale_Centrale_base_offer a cis:Offer ; rdfs:label "offerta base "@it , "base offer "@en ; cis:hasEligibleUser userType:Under18 ; cis:hasPriceSpecification priceSpecification:Under18 ; cis:hasValidity validity:Biblioteca_nazionale_centrale_validity ; cis:includes ticket:Biblioteca_nazionale_centrale_ticket_1 .
description: A price specification provides the information about the cost of an offer for entering a Cultural Institute or Site. It is associated to a currency (e.g., Euro) and a currency value (i.e., a quantity, e.g., 5). The following turtle provides an example about the price specification of the base offer for entering the Biblioteca Nazionale Centrale di Roma. priceSpecification:Under18 a cis:PriceSpecification ; rdfs:label "price specification under 18 "@en , "costo under 18 "@it ; cis:hasCurrency cis:Euro ; cis:hasCurrencyValue "5"^^xsd:float . offer:Biblioteca_Nazionale_Centrale_base_offer a cis:Offer ; rdfs:label "offerta base "@it , "base offer "@en ; cis:hasEligibleUser userType:Under18 ; cis:hasPriceSpecification priceSpecification:Under18 ; cis:hasValidity validity:Biblioteca_nazionale_centrale_validity ; cis:includes ticket:Biblioteca_nazionale_centrale_ticket_1 . @en
version info: stable @en
version info: stabile

ha telefono
type: DatatypeProperty
comment: Property used to represent one or more telephone numbers for the contact point @en
comment: proprietà utilizzata per rappresentare uno o più numeri di telefono per il punto di contatto
domain: Punto di Contatto
label: has telephone @en
range: anyURI
version info: stable @en
version info: stabile

include
type: ObjectProperty
comment: Property used to associate an offer with the relative ticket @en
comment: Proprietà utilizzata per associare un'offerta al relativo biglietto.
domain: Offerta
label: includes @en
range: Biglietto
version info: stabile
version info: stable

Tipo di apertura
type: Class
comment: Rappresenta il tipo di apertura al pubblico. Esempi sono: Settimanale, Mensile, Giornaliera, ecc.
comment: It represents the type of admission. Examples are: weekly, monthly, daily, etc. @en
label: Admission Type @en
subclass of: Restriction
  all values from: Literal
  on property: descrizione
subclass of: Restriction
  on property: nome
  some values from: Literal
description: Individui di questa classe identificano i possibili tipi di politiche di accesso che possono essere applicate agli orari di apertura di un luogo e istituto della cultura. Per esempio, indicano che un istituto e luogo della cultura apre alle 9:00 e chiude ogni giorno alle 17:00. Un esempio in turle è il seguente: openingHoursSpecification:Orari_di_apertura_di_Biblioteca_nazionale_centrale_di_Roma_giovedi a cis:OpeningHoursSpecification ; rdfs:label "Opening Hours of Biblioteca nazionale centrale di Roma - thursday"@en ; cis:closes "19:00:00"^^xsd:time ; cis:hasAdmissionType admissionType:Tipo_di_apertura_al_pubblico ; cis:hasDayOfWeek cis:Thursday ; cis:opens "08:30:00"^^xsd:time . admissionType:Tipo_di_apertura_al_pubblico a cis:AdmissionType ; rdfs:label "Tipo di apertura al pubblico" ; cis:name "giornaliera" ; cis:description "Apertura al pubblico giornaliera" .
description: Individuals of this class identify the possible admission types (in terms of access policies) that can be applied to the opening hours specifications of a Cultural Institute or Site (CIS). For example. it can be used to indicate that the a CIS opens at 9:00 and closes at 17:00 daily. An example in turtle is the following. openingHoursSpecification:Orari_di_apertura_di_Biblioteca_nazionale_centrale_di_Roma_giovedi a cis:OpeningHoursSpecification ; rdfs:label "Opening Hours of Biblioteca nazionale centrale di Roma - thursday"@en ; cis:closes "19:00:00"^^xsd:time ; cis:hasAdmissionType admissionType:Tipo_di_apertura_al_pubblico ; cis:hasDayOfWeek cis:Thursday ; cis:opens "08:30:00"^^xsd:time . admissionType:Tipo_di_apertura_al_pubblico a cis:AdmissionType ; rdfs:label "Tipo di apertura al pubblico" ; cis:name "giornaliera" ; cis:description "Apertura al pubblico giornaliera" . @en
version info: stabile
version info: stable @en

ospita
type: ObjectProperty
comment: Property used to associate a cultural institute or site to an event @en
comment: Proprietà usata per associare un istituto e luogo della cultura a un evento.
domain: Sede
label: hosts @en
range: Evento
version info: versione ancora non definitiva
version info: unstable

è giorno della settimana di
type: ObjectProperty
comment: Proprietà inversa di "ha giorno della settimana".
comment: Inverse property of has day of week. @en
domain: Giorno della settimana
label: is day of week of @en
range: Orari di Apertura
version info: versione non definitiva
version info: unstable @en

è fornito da
type: ObjectProperty
comment: Proprietà inversa di "fornisce servizio"
comment: Inverse property of "provides service" @en
domain: Servizio
label: is provided by @en
range: Istituto e Luogo Della Cultura
inverse of: fornisce servizi

si tiene durante
type: ObjectProperty
comment: Proprietà utilizzata per associare un evento a un intervallo temporale entro cui l'evento ha luogo.
comment: Property used to associate an event with a temporal interval within which the event takes place @en
domain: Evento
label: takes place during @en
range: Intervallo di Tempo
version info: stable
version info: stabile

rende disponibile attrezzatura
type: ObjectProperty
comment: Proprietà che consente di associare l'istituto e luogo della cultura alle attrezzature da esso possedute.
comment: Property that permits to associate the Cultural Institute or Site with its own equipment @en
domain: Istituto e Luogo Della Cultura
label: makes available equipment @en
range: Attrezzatura
version info: stabile
version info: stable

Entità culturale
type: Class
comment: Classe che fornisce una generalizzazione per le tre classi di istituto e luogo della cultura, collezione e oggetto culturale. Non corrisponde ad un concetto usato normalmente nel linguaggio del dominio, ma risponde all'esigenza di modellare proprietà e assiomi di property-restriction comuni ad ognuna di queste tre classi. La classe CulturalEntity non sarà mai istanziata direttamente
comment: Class that provides a generalization of three classes; that is , cultural institute or site, collection and cultural heritage object. It does not correspond to a concept used typically in the cultural domain but it is used in order to model properties and property restrictions that are common to all the these three classes. The class will never be directly instanziated. @en
label: Cultural Entity @en
version info: stabile
version info: stable @en

Lavoro Creativo
type: Class
comment: Concetto utilizzato per rappresentare tutti quei materiali, multimediali (file audio, video), immagini), bibliografici, articoli di varia natura che si riferiscono e citano l'Istituto e Luogo della Cultura.
comment: Concept used to represent all types of creative works such multimedia objects (audio, video, image files), bibliographic references, and different types of articles, that refer to and cite the Cultural Institute or Site @en
label: Creative Work @en
subclass of: Restriction
  all values from: Class
    union of: Entità culturale
    union of: Evento
    union of: Sede
  on property: tratta di
version info: stabile
version info: stable @en

Indirizzo
type: Class
comment: It represents an address as defined by the specifications of the EU INSPIRE directive https://inspire-twg.jrc.ec.europa.eu/inspire-fc.html#_C2538 @en
comment: Rappresenta un indirizzo così come descritto nelle specifiche della direttiva Europea INSPIRE https://inspire-twg.jrc.ec.europa.eu/inspire-fc.html#_C2538.
label: Address @en
subclass of: Restriction
  on property: unità amministrativa di livello 2
  some values from: Literal
subclass of: Restriction
  all values from: Literal
  on property: unità amministrativa di livello 1
subclass of: Restriction
  cardinality: 1
  on property: identificativo dell'indirizzo
subclass of: Restriction
  on property: codice postale
  some values from: Literal
subclass of: Restriction
  all values from: Literal
  on property: nome divisione postale
subclass of: Restriction
  on property: indirizzo completo
  some values from: Literal
description: Individuals of the class Site are associated with individual of the class Address by means of the object property hasAddress. An address is characterised by the following properties: * addressIdentifier: a unique ID of the address; * administrativeUnitLevel1: e.g., Rome; * administrativeUnitLevel2: e.g., Lazio; * fullAddress: the literal that records the full address as a string; * postCode: the postal code corresponding to the address; * postName: the key postal name, usually the city ; An example in turtle is the following: site:Sede_di_Biblioteca_nazionale_centrale_di_Roma a cis:Site ; rdfs:label "Sede di: Biblioteca nazionale centrale di Roma"@it ; cis:hasAddress address:Indirizzo_della_sede_di_Biblioteca_nazionale_centrale_di_Roma ; address:Indirizzo_della_sede_di_Biblioteca_nazionale_centrale_di_Roma a cis:Address ; rdfs:label "Indirizzo della sede di: Biblioteca nazionale centrale di Roma"@it ; cis:addressID "IT-RM0267_IT_1" ; cis:adminUnitL1 "Roma"@it ; cis:adminUnitL2 "Lazio"@it ; cis:fullAddress "Viale Castro Pretorio 105 - 00185 - Roma (RM" ; cis:postName "Rome" ; cis:postCode "00185" . @en
description: Individui della classe Address sono connessi ad invididui della classe Site attraverso la proprietà che collega Site ad Address hasAddress. Un indirizzo è caratterizzato dalle seguenti proprietà: * Identificativo dell'indirizzo: un ID univoco dell'indirizzo; * livello amministrativo 1: di solito il comune, e.g., Roma; * livello amministrativo 2: di solito la regione, e.g., Lazio; * indirizzo completo: un literal che rappresenta l'indirizzo completo come una stringa * codice postale: il codice postale corrispondere all'indirizzo. * nome postale: il nome chiave postale di solito la città Un esempio in turtle è il seguente: site:Sede_di_Biblioteca_nazionale_centrale_di_Roma a cis:Site ; rdfs:label "Sede di: Biblioteca nazionale centrale di Roma"@it ; cis:hasAddress address:Indirizzo_della_sede_di_Biblioteca_nazionale_centrale_di_Roma ; address:Indirizzo_della_sede_di_Biblioteca_nazionale_centrale_di_Roma a cis:Address ; rdfs:label "Indirizzo della sede di: Biblioteca nazionale centrale di Roma"@it ; cis:addressID "IT-RM0267_IT_1" ; cis:adminUnitL1 "Roma"@it ; cis:adminUnitL2 "Lazio"@it ; cis:fullAddress "Viale Castro Pretorio 105 - 00185 - Roma (RM") ; cis:postName "Roma" ; cis:postCode "00185" .
version info: stable @en
version info: stabile

ha sito web
type: DatatypeProperty
comment: Property used to represent a web site @en
comment: Proprietà utilizzata per rappresentare un sito web
domain: Class
  union of: Catalogo
  union of: Punto di Contatto
  union of: Progetto
label: has web site @en
range: anyURI
version info: stable @en
version info: stabile

Oggetto immagine
type: Class
comment: Concept used to represent an image file. @en
comment: Concetto utilizzato per rappresentare un file immagine.
label: Image Object @en
subclass of: Lavoro Creativo
subclass of: Restriction
  all values from: anyURI
  on property: url
description: Un esempio dell'utilizzo della classe cis:ImageObject è il seguente: image:Poster_Evento_Vincenzo_Gemito_al_Museo_di_Capodimonte a cis:ImageObject , cis:CreativeWork ; rdfs:label "Poster of the event 'Vincenzo Gemito al Museo di Capodimonte'"@en; rdfs:label "Poster dell'evento 'Vincenzo Gemito al Museo di Capodimonte'"@it; cis:url http://www.example.com/Image/Poster_Evento_Vincenzo_Gemito_al_Museo_di_Capodimonte.png ; cis:isAbout event:Vincenzo_Gemito_al_Museo_di_Capodimonte .
description: An example of the usage of the class cis:ImageObject is the following: image:Poster_Evento_Vincenzo_Gemito_al_Museo_di_Capodimonte a cis:ImageObject , cis:CreativeWork ; rdfs:label "Poster of the event 'Vincenzo Gemito al Museo di Capodimonte'"@en; rdfs:label "Poster dell'evento 'Vincenzo Gemito al Museo di Capodimonte'"@it; cis:url http://www.example.com/Image/Poster_Evento_Vincenzo_Gemito_al_Museo_di_Capodimonte.png ; cis:isAbout event:Vincenzo_Gemito_al_Museo_di_Capodimonte . @en
version info: stabile
version info: stable @en

Servizio
type: Class
comment: It represents a service that is provided by the Cultural Institute or Site. For instance, a service can be: the presence of a restaurant internal to the Cultural Institute or Site, the uso of an educational room, the use of a free wifi connection @en
comment: Rappresenta un servizio offerto da un istituto e luogo della cultura. Per esempio, un servizio può essere: la presenza di un ristorante interno al luogo, l'uso una sala didattica, l'uso di una connessione wifi libera, ecc.
label: Service @en
subclass of: Restriction
  all values from: Literal
  on property: descrizione
subclass of: Restriction
  all values from: Punto di Contatto
  on property: ha punto di contatto
subclass of: Restriction
  on property: nome
  some values from: Literal
subclass of: Restriction
  all values from: Istituto e Luogo Della Cultura
  on property: è fornito da
description: Un istituto della cultura può offrire una serie di servizi (e.g., Wi-Fi, accesso ai disabili, caffetteria, ecc.). Questi servizi sono rappresentati da individui della classe "Servizio" e sono in relazione con l'istituto della cultural attraverso la proprietà "fornisce servizio". Il seguente esempio mostra in turtle l'uso della classe servizio: service:Caffetteria a cis:Service ; cis:name "Caffetteria" . service:Connessione_WI-FI a cis:Service ; cis:name "Connessione WI-FI" . cissite:Biblioteca_nazionale_centrale a cis:Library , cis:CulturalInstituteOrSite ; cis:providesService service:Caffetteria, service:Connessione_WI-FI.
description: A Cultural Institute or Site (CIS) might offer a variety of services (e.g., Wi-Fi Handicapped access, cafeteria, etc.). These services are represented as individuals of the class 'Service' and they are in relationship with a CIS by means of the object property providesService. The following is an example expressed by using the turtle syntax: service:Caffetteria a cis:Service ; cis:name "Caffetteria" . service:Connessione_WI-FI a cis:Service ; cis:name "Connessione WI-FI" . cissite:Biblioteca_nazionale_centrale a cis:Library , cis:CulturalInstituteOrSite ; cis:providesService service:Caffetteria, service:Connessione_WI-FI. @en
version info: stabile
version info: stable @en

ha prezzo
type: DatatypeProperty
comment: Proprietà utilizzata per indicare il prezzo del biglietto.
comment: Property used to represent the price of the ticket. @en
domain: Prezzo
label: has currency value @en
range: float
version info: stabile
version info: stable

è coinvolto in progetto
type: ObjectProperty
comment: Proprietà utilizzata per rappresentare una relazione di coinvolgimento tra l'istituto e luogo della cultura e un progetto.
comment: Property used to represent an involvement relationship between a cultural institute or site and a project @en
domain: Istituto e Luogo Della Cultura
label: is involved in a project @en
range: Progetto
version info: stable
version info: stabile

indirizzo completo
type: DatatypeProperty
comment: Proprietà utilizzata per indicare l'indirizzo completo della sede di un istituto e luogo della cultura.
comment: Property used to represent the full address of the site of a cultural institute or site. @en
domain: Indirizzo
label: full address @en
range: Literal
version info: stabile
version info: stable

descrizione
type: DatatypeProperty
comment: This property is used to indicate a description of the cultural institute or site @en
comment: Questa proprietà è utilizzata per indicare una descrizione dell'istituto e luogo della cultura
domain: Thing
label: description @en
range: Literal
version info: stabile
version info: stable @en

ha locazione geografica
type: ObjectProperty
comment: Property used to associate a site with a geographical area where the site is located. @en
comment: Proprietà che consente di associare una sede di un istituto e luogo della cultura a un'area geografica in cui si trova la sede.
domain: Sede
label: has geographical location @en
range: Area Geografica
version info: stable
version info: stabile

ha geometria
type: ObjectProperty
comment: Proprietà utilizzata per associare un sito alle proprie coordinate geografiche.
comment: Property used to associate a site with its own geographical coordinates @en
domain: Class
  union of: Area Geografica
  union of: Sede
label: has geometry @en
range: Geometria
version info: stable
version info: stabile

Validità
type: Class
comment: Questa classe rappresenta la validità di biglietti e di offerte
comment: This class represents the validity for the ticket and offering. @en
label: Validity @en
subclass of: Restriction
  all values from: Class
    union of: Valore quantitativo
    union of: Intervallo di Tempo
  on property: ha durata
description: Un esempio di utilizzo della classe cis:Validity è il seguente: validity:Parco_archeologico_di_Liternum_Card_Validity a cis:Validity ; rdfs:label "Two-day validity"@en ; rdfs:label "Validità per due giorni"@it ; cis:hasDuration Parco_archeologico_di_Liternum_Card_Validity_Duration . qv:Parco_archeologico_di_Liternum_Card_Validity_Duration a cis:QuantitativeValue ; rdfs:label "2";; cis:hasMeasurementUnit cis:Day ; cis:hasValue "2"^^xsd:positiveInteger .
description: An example of usage of the class cis:Validity is the following: validity:Parco_archeologico_di_Liternum_Card_Validity a cis:Validity ; rdfs:label "Two-day validity"@en ; rdfs:label "Validità per due giorni"@it ; cis:hasDuration Parco_archeologico_di_Liternum_Card_Validity_Duration . qv:Parco_archeologico_di_Liternum_Card_Validity_Duration a cis:QuantitativeValue ; rdfs:label "2";; cis:hasMeasurementUnit cis:Day ; cis:hasValue "2"^^xsd:positiveInteger . @en
version info: non stabile
version info: unstable @en

ha tipo di apertura
type: ObjectProperty
comment: Property used to associate the opening hours specification to the admission type @en
comment: Proprietà che consente di associare gli orari di apertura al tipo di apertura.
domain: Orari di Apertura
label: has admission type @en
range: Tipo di apertura
version info: stable
version info: stabile

Sede
type: Class
comment: It represents a georeferenced physical site related to the Cultural Institute or Site. A Cultural Institute or Site can be located in more than one physical site. For instance, a Site can be "Palazzo Venezia" which is the site of the "Museum of Palazzo Venezia" and of "Library of Archaelogy and Art History". @en
comment: Rappresenta un luogo fisico georeferenziato relativo all'Istituto e luogo della Cultura. Un Istituto e Luogo della Cultura può avere più di un luogo fisico associato. Nell'ambito dell'Istituto Centrale per il Catalogo e la Documentazione (ICC)D) tale concetto rappresenta il contenitore fisico. Per esempio, un luogo fisico può essere "Palazzo Venezia" dove ha sede il "Museo Nazionale di Palazzo Venezia" o la "Biblioteca di Archeologia e Storia dell'Arte".
label: Site @en
subclass of: Restriction
  on property: è contenitore fisico di
  some values from: Istituto e Luogo Della Cultura
subclass of: Restriction
  on property: ha indirizzo
  some values from: Indirizzo
subclass of: Restriction
  all values from: Geometria
  on property: ha geometria
subclass of: Restriction
  all values from: Punto di Contatto
  on property: ha punto di contatto
subclass of: Restriction
  all values from: Evento
  on property: ospita
subclass of: Restriction
  all values from: Literal
  on property: descrizione
subclass of: Restriction
  on property: ha descrizione della sede
  some values from: Descrizione della sede
subclass of: Restriction
  on property: nome
  some values from: Literal
subclass of: Restriction
  on property: ha locazione geografica
  some values from: Area Geografica
description: Una sede è sempre associata agli individui della classe "Istituto e Luogo della Cultura" attraverso la proprietà ha sede. Una sede è caratterizzata dalle seguenti proprietà: * ha indirizzo: consente di associare una sede con un individuo della classe indirizzo che fornisce la descrizione dell'indirizzo; * ha punto di contatto: consente di associare una sede con un individuo che identifica un punto di contatto; * ha locazione geografica: consente di associare la sede con la descrizione dell'area geografica * nome: una proprietà che consente di specificare il nome della sede * è sede di: la proprietà inversa di ha sede Il seguente esempio in turle mostra una sede associata a un istituto e luogo della cultura: site:Sede_di_Biblioteca_nazionale_centrale_di_Roma a cis:Site ; rdfs:label "Sede Biblioteca nazionale centrale di Roma"@it ; cis:hasAddress address:Indirizzo_della_sede_di_Biblioteca_nazionale_centrale_di_Roma ; cis:hasContactPoint contactPoint:Contatti_di_Biblioteca_nazionale_centrale_di_Roma ; cis:hasGeographicalLocation geographicalFeature:Comune_di_Roma ; cis:isSiteOf cissite:Biblioteca_nazionale_centrale ; cis:name "Sede di: Biblioteca nazionale centrale di Roma"@it . cissite:Biblioteca_nazionale_centrale a cis:Library , cis:CulturalInstituteOrSite ; cis:hasSite site:Sede_di_Biblioteca_nazionale_centrale_di_Roma .
description: A site is always associated with an individual of the class 'Cultural Institute or Site' (CIS) by means of the object property hasSite. A site is characterised by the following properties: * hasAddress that allows associating the site with an indidivdual of the class Address, this latter providing the description of the address; * hasContactPoint that associates the site with an individual identifying a contact point; * hasGeographicalLocation for relating the site to the description of its geographical features, that, in turn, is represented by means of an individual of the class 'Geographical Area'; * name that is the datatype property for associating the site with a literal expressing a name; * isSiteOf that is the inverse property of hasSite. The following is an example of a Site and its association with a CIS site:Sede_di_Biblioteca_nazionale_centrale_di_Roma a cis:Site ; rdfs:label "Sede Biblioteca nazionale centrale di Roma"@it ; cis:hasAddress address:Indirizzo_della_sede_di_Biblioteca_nazionale_centrale_di_Roma ; cis:hasContactPoint contactPoint:Contatti_di_Biblioteca_nazionale_centrale_di_Roma ; cis:hasGeographicalLocation geographicalFeature:Comune_di_Roma ; cis:isSiteOf cissite:Biblioteca_nazionale_centrale ; cis:name "Sede di: Biblioteca nazionale centrale di Roma"@it . cissite:Biblioteca_nazionale_centrale a cis:Library , cis:CulturalInstituteOrSite ; cis:hasSite site:Sede_di_Biblioteca_nazionale_centrale_di_Roma . @en
version info: stable @en
version info: stabile

Valore quantitativo
type: Class
comment: Class that represents a quantitative value. @en
comment: Classe che rappresenta un valore quantitativo
label: Quantitative Value @en
subclass of: Restriction
  on property: ha unità di misura
  some values from: Unità di misura
subclass of: Restriction
  on property: ha valore
  some values from: positiveInteger
description: An example of usage of the class cis:QuantitativeValue is the following: qv:Parco_archeologico_di_Liternum_Card_Validity_Duration a cis:QuantitativeValue ; rdfs:label "2"; cis:hasMeasurementUnit cis:Day ; cis:hasValue "2"^^xsd:positiveInteger . cis:Day a cis:MeasurementUnit . @en
description: Un esempio di utilizzo della classe cis:QuantitativeValue è il seguente: qv:Parco_archeologico_di_Liternum_Card_Validity_Duration a cis:QuantitativeValue ; rdfs:label "2"; cis:hasMeasurementUnit cis:Day ; cis:hasValue "2"^^xsd:positiveInteger . cis:Day a cis:MeasurementUnit .
version info: unstable @en
version info: versione non definitiva

ha motivazione
type: DatatypeProperty
comment: Property used to describe a reason for the temporary closure. @en
comment: Proprietà utilizzata per descrivere una motivazione della chiusura temporanea.
domain: Chiusura Temporanea
label: has reason @en
range: Literal
version info: stabile
version info: stable

ha indirizzo
type: ObjectProperty
comment: Proprietà che consente di associare un sito fisico a un indirizzo.
comment: Property that permits to associate a site with an address @en
domain: Sede
label: has address @en
range: Indirizzo
version info: stable
version info: stabile

detiene un ruolo nel tempo
type: ObjectProperty
comment: Property used to associate an agent with the situation role in time the agent can play @en
comment: Proprietà utilizzata per associare un agente alla situazione "ruolo nel tempo", ovvero ad un determinato ruolo ricoperto dall'agente stesso in un deteminato arco temporale
domain: Agente
label: holds role in time @en
range: Ruolo Nel Tempo
version info: stable
version info: stabile

è contenitore fisico di
type: ObjectProperty
comment: Inverse property of "has Site" @en
comment: Proprietà inversa di "ha sede".
domain: Sede
label: is site of @en
label: è sede di
range: Istituto e Luogo Della Cultura
inverse of: ha contenitore fisico
version info: stable @en
version info: stabile

ha email
type: DatatypeProperty
comment: Property used to specify email address for a contact point @en
comment: Proprietà utilizzata per specificare indirizzi email del punto di contatto
domain: Punto di Contatto
label: has email @en
range: anyURI
version info: stable @en
version info: stabile

Tipo di Istituto e Luogo della Cultura
type: Class
comment: Questa classe rappresenta il tipo di istituto e luogo della cultura.
comment: This class represents the type of cultural institute or site. @en
label: Cultural Institute or Site Type @en
subclass of: Restriction
  all values from: Literal
  on property: descrizione
subclass of: Restriction
  on property: nome
  some values from: Literal
version info: versione non definitiva
version info: unstable @en

è descritto da
type: ObjectProperty
comment: Proprietà inversa di "descrive"
comment: Inverse property of "describes" @en
domain: Collezione
label: is described by @en
range: Catalogo
inverse of: descrive

Chiusura Temporanea
type: Class
comment: Rappresenta le informazioni sulla chiusura temporanea
comment: It represents the information on the temporary closure @en
label: Temporary Closure @en
subclass of: Condizioni di accesso
subclass of: Restriction
  all values from: Datatype
    union of: date
    union of: dateTime
  on property: ha data
subclass of: Restriction
  all values from: Literal
  on property: ha motivazione
subclass of: Restriction
  all values from: Tipo di Chiusura Temporanea
  on property: ha tipo di chiusura temporanea
subclass of: Restriction
  all values from: Literal
  on property: descrizione
description: A temporary closure is a subclass of 'AccessCondition' whose individuals provide information about a temporary closure. These individuals are described in terms of: * the closure date (cf. property hasDate); * the reason about the temporary closure (cf. property hasReason); * the type associated with the temporary closure (cf. property hasTemporaryClosureType). An example in turtle is the following: cissite:Biblioteca_nazionale_centrale a cis:Library , cis:CulturalInstituteOrSite ; cis:hasAccessCondition orari:Chiusura_estiva_di_Biblioteca_nazionale_centrale_di_Roma orari:Chiusura_estiva_di_Biblioteca_nazionale_centrale_di_Roma cis:hasDate "2015-08-15"^^xsd:dateTime ; cis:hasReason "Chiusura estiva" ; @en
description: La chiusura temporanea è una sottoclasse di Condizioni di accesso i cui individui forniscono informazioni sulla chiusura temporanea. Gli individui sono descritti in termini di: * data di chiusura (con la proprietà ha data); * la motivazione per la chiusura (con la proprietà ha motivazione) * il tipo associato con la chiusura temporanea (con la proprietà ha tipo chiusura temporanea) Un esempio è il seguente: cissite:Biblioteca_nazionale_centrale a cis:Library , cis:CulturalInstituteOrSite ; cis:hasAccessCondition orari:Chiusura_estiva_di_Biblioteca_nazionale_centrale_di_Roma orari:Chiusura_estiva_di_Biblioteca_nazionale_centrale_di_Roma cis:hasDate "2015-08-15"^^xsd:dateTime ; cis:hasReason "Chiusura estiva" ;
version info: stabile
version info: stable

è valido durante
type: ObjectProperty
comment: Property used to associate the situation name in time with a temporal validity interval @en
comment: Proprietà usata per associare la situzione "nome nel tempo", ovvero una denominazione valida in un certo arco temporale, a un intervallo temporale di validità
domain: Nome Nel Tempo
label: is valid during @en
range: Intervallo di Tempo
version info: stable
version info: stabile

Oggetto video
type: Class
comment: Concetto utilizzato per rappresentare materiali multimediali di tipo video.
comment: Concept used to represent multimedia objects of type video. @en
label: Video Object @en
subclass of: Lavoro Creativo
subclass of: Restriction
  all values from: anyURI
  on property: url
version info: stable @en
version info: stabile

Conservatore di archivi
type: NamedIndividual
type: Tipo di Istituto e Luogo della Cultura
type: Class
comment: This class represents a specific tyep of cultural institute or site, i.e., Holder of Archive @en
comment: Questa classe rappresenta una specifica tipologia di istituto e luogo della cultura, i.e., Archivio
label: Holder of Archives @en
subclass of: Istituto e Luogo Della Cultura
description: Un esempio di utilizzo della classe cis:HolderOfArchive è il seguente: cissite:Archivio_di_Stato_di_Oristano a cis:CulturalInstituteOrSite, cis:HolderOfArchive ; rdfs:label "Archivio di Stato di Oristano" ; cis:institutionalName "Archivio di Stato di Oristano" ; cis:ISILIdentifier "IT-EX0006" .
description: An example of usage of the class cis:HolderOfArchive is the following: cissite:Archivio_di_Stato_di_Oristano a cis:CulturalInstituteOrSite, cis:HolderOfArchive ; rdfs:label "Archivio di Stato di Oristano" ; cis:institutionalName "Archivio di Stato di Oristano" ; cis:ISILIdentifier "IT-EX0006" . @en
equivalent class: Restriction
  has value: Conservatore di archivi
  on property: ha tipo
version info: stable @en
version info: stabile

ha biglietto
type: ObjectProperty
comment: proprietà inversa di "per accedere a"
comment: Inverse property of "for access to" @en
domain: Class
  union of: Istituto e Luogo Della Cultura
  union of: Evento
label: has ticket @en
range: Biglietto
inverse of: per l'accesso a

Agente
type: Class
comment: Rappresenta un agente. Esso può essere un'organizzazione (pubblica e/o privata), un'associazione/fondazione, un singolo soggetto. Per esempio, nel contesto della presente ontologia può essere utilizzato per rappresentare una soprintendenza, un comune, un singolo soggetto privato, ecc.
comment: It represents an agent. It can be an organization (public and/or private), an association/foundation or a single person. In the context of this ontology it can be a municipality, a supervision authority, a single private citizen @en
label: Agent @en
subclass of: Restriction
  all values from: Agente
  on property: riporta a
subclass of: Restriction
  all values from: Ruolo Nel Tempo
  on property: detiene un ruolo nel tempo
subclass of: Restriction
  on property: nome
  some values from: Literal
description: An Agent is described by means of its name and a set of properties that allows modeling its role in time and, in case of physical persons, his/her belonging relationship to the public or private organization. An example of the use of the Agent class only is provided below in turtle (for an example of the role modeling, interested readers can refer to the examples provided with the Role and RoleInTime classes): agent:Andrea_De_Pasquale a cis:Agent ; rdfs:label "Andrea De Pasquale" ; cis:name "Andrea De Pasquale" ; cis:reportsTo agent:Soprintendenza_Roma ; cis:holdsRoleInTime roleInTime:Andrea_De_Pasquale_DirectorOfBibliotecaNazionaleCentrale . agent:Soprintendenza_Roma a cis:Agent ; rdfs:label "Superintendence Rome"@en ; rdfs:label "Soprintendenza Roma"@it ; cis:name "Superintendence Rome"@en ; cis:name "Soprintendenza Roma esempio"@it . @en
description: Un agente è descritto mediante il suo nome e da una serie di proprietà che consentono di modellare il suo ruolo nel tempo e, nel caso di persone fisiche, di appartenenza a una certa organizzazione, pubblica o privata. Un esempio solo dell'uso della classe Agent in turtle è il seguente (per l'uso delle classi relative al ruolo si vedano le classi Role e RoleInTime): agent:Andrea_De_Pasquale a cis:Agent ; rdfs:label "Andrea De Pasquale" ; cis:name "Andrea De Pasquale" ; cis:reportsTo agent:Soprintendenza_Roma ; cis:holdsRoleInTime roleInTime:Andrea_De_Pasquale_DirectorOfBibliotecaNazionaleCentrale . agent:Soprintendenza_Roma a cis:Agent ; rdfs:label "Superintendence Rome"@en ; rdfs:label "Soprintendenza Roma"@it ; cis:name "Superintendence Rome"@en ; cis:name "Soprintendenza Roma esempio"@it .
version info: stable @en
version info: stabile

ha latitudine
type: DatatypeProperty
comment: Property used to associate a latitude with a Point @en
comment: Proprietà utilizzata per associare la latitudine a un punto
domain: Geometria
label: has latitude @en
range: decimal
version info: stable
version info: stabile

ha sotto eventi
type: ObjectProperty
comment: Property used to describe large events to which single sub events refer. For instance, a large event can be the first world war centenary to which single events celebrating the 100th anniversary refer @en
comment: Proprietà utilizzata per rappresentare grandi eventi che hanno singoli eventi che ad esso fanno riferimento. Ad esempio, un grande evento può essere il centenario della prima guerra mondiale a cui fanno riferimento una serie di eventi singoli.
domain: Evento
label: has sub event @en
range: Evento
version info: stable
version info: stabile

ha durata
type: ObjectProperty
comment: Questa proprietà è utilizzata per specificare il periodo temporale di validità.
comment: This property is used to specify the temporal duration of the validity. @en
domain: Validità
label: has duration @en
range: Class
  union of: Valore quantitativo
  union of: Intervallo di Tempo
version info: unstable @en
version info: versione non definitiva

nome
type: DatatypeProperty
comment: Property used to associate a name with an event and a project @en
comment: Proprietà utilizzata per associare un nome all'evento o al progetto
domain: Thing
label: name @en
range: Literal
version info: stabile
version info: stable

ha punto di contatto
type: ObjectProperty
comment: Property which links a cultural insttiute or site to its contact points. The same property is used to link in a similar way the event to its contact points and to link the site of the cultural institute or site with its contact points @en
comment: Proprietà che collega un istituto e luogo della cultura ai propri punti di contatto. La stessa proprietà è utilizzata in maniera analoga per collegare il luogo fisico con i propri punti di contatto, ad anche per collegare un evento ai propri contatti
domain: Class
  union of: Istituto e Luogo Della Cultura
  union of: Evento
  union of: Servizio
  union of: Sede
label: has contact point @en
range: Punto di Contatto
version info: stable
version info: stabile

Giovedì
type: Giorno della settimana
type: NamedIndividual
label: Thursday @en

catalogo
type: ObjectProperty
comment: Property used to associate the Cultural Institute or SIte with a catalogue of cultural collections included in the institute or site. The relatioships can be used to indicate that a Cultural Institute or Site has an its own catalogue or situations where a Cultural Institute or Site contributes to a union catalogue (this latter case is represented by libraries that can contribute to or participate in a union catalogue). @en
comment: Proprietà utilizzata per associare l'istituto e luogo della cultura a un catalogo che descrive le opere in esso contenute. Tale relazione può essere utilizzata per indicare che un istituto e luogo della cultura ha un catalogo ma anche una situazione per cui un istituto e luogo della cultura partecipa a un catalogo (in quest'ultimo caso un esempio è rappresentato dalle biblioteche che possono partecipare a un catalogo collettivo).
domain: Istituto e Luogo Della Cultura
label: catalogue @en
range: Catalogo
version info: stabile
version info: stable

Museo
type: Class
type: NamedIndividual
type: Tipo di Istituto e Luogo della Cultura
comment: It represents a specific type of Cultural Institute or Site; that is, Museum @en
comment: Rappresenta uno specifico tipo di istituto e luogo della cultura ovvero museo.
label: Museum @en
subclass of: Istituto e Luogo Della Cultura
description: An example of usage of the class cis:Museum is the following: cissite:Museo_di_Capodimonte a cis:CulturalInstituteOrSite, cis:Museum ; rdfs:label "Museo di Capodimonte"; ; cis:institutionalName "Museo di Capodimonte" ; cis:ISILIdentifier "IT-EX0008" . @en
description: Un esempio di utilizzo della classe cis:Museum è il seguente: cissite:Museo_di_Capodimonte a cis:CulturalInstituteOrSite, cis:Museum ; rdfs:label "Museo di Capodimonte"; ; cis:institutionalName "Museo di Capodimonte" ; cis:ISILIdentifier "IT-EX0008" .
equivalent class: Restriction
  has value: Museo
  on property: ha tipo
version info: stable @en
version info: stabile

ha specifica di prezzo
type: ObjectProperty
comment: Questa proprietà è utliizzata per collegare l'offerta per i biglietti a una specifica del prezzo.
comment: This property is used to link the offer for a ticket to its price specification. @en
domain: Offerta
label: has price specification @en
range: Prezzo
version info: stabile
version info: stable @en

ha valuta
type: ObjectProperty
comment: This property is used to connected the Price specification to Currency @en
comment: Questa proprietà collega la specifica del prezzo del ticket per un evento o istituto e luogo della cultura con la classe currency
domain: Prezzo
label: has currency @en
range: Valuta
version info: unstable @en
version info: versione non definitiva

Teatro
type: NamedIndividual
type: Tipo di Istituto e Luogo della Cultura
type: Class
comment: This class represents a cultural institute or site of type Theatre @en
comment: Questa classe rappresenta un istituto e luogo della cultura di tipo Teatro
label: Theatre @en
subclass of: Istituto e Luogo Della Cultura
description: Un esempio di utilizzo della classe cis:Theatre è il seguente: cissite:Teatro_Olimpico a cis:CulturalInstituteOrSite, cis:Theatre ; rdfs:label "Teatro Olimpico" ; cis:name "Teatro Olimpico" ; cis:ISILIdentifier "IT-EX0011" .
description: An example of usage of the class cis:Theatre is the following: cissite:Teatro_Olimpico a cis:CulturalInstituteOrSite, cis:Theatre ; rdfs:label "Teatro Olimpico" ; cis:name "Teatro Olimpico" ; cis:ISILIdentifier "IT-EX0011" . @en
equivalent class: Restriction
  has value: Teatro
  on property: ha tipo
version info: versione non definitiva
version info: unstable @en

ha nome nel tempo
type: ObjectProperty
comment: Property which associate a cultural institute or site or a site with the situation name in time @en
comment: Proprietà che associa un istituto o luogo della cultura o un sito alla situazione "denominazione nel tempo", ovvero una determinata denominazione valida in un determinato arco temporale
domain: Class
  union of: Istituto e Luogo Della Cultura
  union of: Sede
label: has name in time @en
range: Nome Nel Tempo
version info: stabile
version info: stable

Tipo prenotazione
type: Class
comment: It represents the type of booking for the cultural institute or site or for the event. Examples can be: Mandatory, Optional, None (free access). @en
comment: Rappresenta la tipologia di prenotazione per l'istituto e luogo della cultura o per l'evento. Esempi possono essere: Obbligatoria, Facoltativa, Nessuna (ingresso libero).
label: Type of Booking @en
subclass of: Condizioni di accesso
subclass of: Restriction
  on property: nome
  some values from: Literal
subclass of: Restriction
  all values from: Literal
  on property: descrizione
description: An example of usage of the class cis:Booking is the following: booking:Mandatory a cis:Booking , cis:AccessCondition ; rdfs:label "Mandatory Booking"@en ; rdfs:label "Prenotazione obbligatoria"@it ; cis:name "Mandatory Booking"@en ; cis:name "Prenotazione obbligatoria"@it ; cis:description "Per accedere al luogo della cultura o evento è necessaria la prenotazione"@it ; cis:description "Booking is mandatory in order to access to the CIS or the event"@en ; cis:accessConditionFor event:Vincenzo_Gemito_al_Museo_di_Capodimonte . event:Vincenzo_Gemito_al_Museo_di_Capodimonte a cis:Event ; cis:isHostedBy site:Museo_di_Capodimonte ; rdfs:label "Vincenzo Gemito, dal salotto Minozzi al Museo di Capodimonte" ; cis:name "Vincenzo Gemito, dal salotto Minozzi al Museo di Capodimonte" ; rdfs:comment "Apre al pubblico al Museo di Capodimonte la mostra ‘Vincenzo Gemito, dal salotto Minozzi al Museo di Capodimonte’, organizzata dalla Soprintendenza speciale per il patrimonio storico" ; cis:involves culturalheritageobject:Il_giocatore_di_carte ; cis:hasSubEvent event:VincenzoGemitoIlPescatorello ; cis:hasAccessCondition booking:Mandatory ; cis:takesPlaceDuring ti:Durata_di_Vincenzo_Gemito_dal_salotto_Minozzi_al_Museo_di_Capodimonte . @en
description: Un esempio di uso della classe cis:Booking è il seguente: booking:Mandatory a cis:Booking , cis:AccessCondition ; rdfs:label "Mandatory Booking"@en ; rdfs:label "Prenotazione obbligatoria"@it ; cis:name "Mandatory Booking"@en ; cis:name "Prenotazione obbligatoria"@it ; cis:description "Per accedere al luogo della cultura o evento è necessaria la prenotazione"@it ; cis:description "Booking is mandatory in order to access to the CIS or the event"@en ; cis:accessConditionFor event:Vincenzo_Gemito_al_Museo_di_Capodimonte . event:Vincenzo_Gemito_al_Museo_di_Capodimonte a cis:Event ; cis:isHostedBy site:Museo_di_Capodimonte ; rdfs:label "Vincenzo Gemito, dal salotto Minozzi al Museo di Capodimonte" ; cis:name "Vincenzo Gemito, dal salotto Minozzi al Museo di Capodimonte" ; rdfs:comment "Apre al pubblico al Museo di Capodimonte la mostra ‘Vincenzo Gemito, dal salotto 'Minozzi al Museo di Capodimonte’, organizzata dalla Soprintendenza speciale per il patrimonio storico" ; cis:involves culturalheritageobject:Il_giocatore_di_carte ; cis:hasSubEvent event:VincenzoGemitoIlPescatorello ; cis:hasAccessCondition booking:Mandatory ; cis:takesPlaceDuring ti:Durata_di_Vincenzo_Gemito_dal_salotto_Minozzi_al_Museo_di_Capodimonte .
version info: stabile
version info: stable @en

ha longitudine
type: DatatypeProperty
comment: Proprietà utilizzata per associare la longitudine a un punto
comment: Property used to associate the longitude with a Point @en
domain: Geometria
label: has longitude @en
range: decimal
version info: stable
version info: stabile

identificativo
type: DatatypeProperty
type: FunctionalProperty
comment: This property represents an identifier for a Thing. @en
comment: Questa proprietà rappresenta un identificativo per una cosa.
domain: Thing
label: identifier @en
range: Literal
version info: stable @en
version info: stabile

riporta a
type: ObjectProperty
comment: Questa proprietà consente di rappresentare una relazione di appartenenza di un agente a un altro agente. Per esempio la relazione può essere utilizzata per poter esprimere che un certo responsabile di un istituto e luogo della cultura agisce per conto di una specifica organizzazione.
comment: This property permits to represent a general belonging relationship of an agent. For instance, the property can be used to represent the case in which an agent with Role responsible acts on the cultural Istitute or site on behalf of an Organization to which (s)he belongs. @en
domain: Agente
label: reports to @en
range: Agente
version info: stabile
version info: stable @en

url
type: DatatypeProperty
comment: Thi property represents an URL. @en
comment: Questa proprietà rappresenta un URL
domain: Class
  union of: Oggetto audio
  union of: Oggetto immagine
  union of: Articolo
  union of: Oggetto video
label: Cultural-ON (Cultural ONtology): Ontologia dei Luoghi della Cultura e degli Eventi Culturali
range: anyURI
version info: versione non definitiva
version info: unstable @en

ha data
type: DatatypeProperty
comment: Property used to represent the date of the temporary closure. @en
comment: Proprietà utilizzata per indicare una data della chiusura temporanea.
domain: Chiusura Temporanea
label: has date @en
range: Datatype
  union of: date
  union of: dateTime
version info: stabile
version info: stable

offre
type: ObjectProperty
comment: Property used to associate an agent with an offer for accessing an event or a cultural institute or site @en
comment: Proprietà che consente di associare un agente all'offerta per l'accesso a un evento o a un luogo della cultura.
domain: Agente
label: offers @en
range: Offerta
version info: stabile
version info: stable

Identificativo ISIL
type: FunctionalProperty
type: DatatypeProperty
comment: This property is used to define the unique identifier of the cultural institute or site (i.e., the ISIL - International Standard Identifier for Libriaries and Related Organization - code). Subproperty of identifier. @en
comment: Questa proprietà è utilizzata per rappresentare l'identificativo univoco dell'Istituto e luogo della cultura, i.e., il codice ISIL (International Standard identifier for Libraries and Related Organization). Sotto proprietà di identificativo.
domain: Istituto e Luogo Della Cultura
label: ISIL identifier @en
range: Literal
sub property of: identificativo
version info: Stable @en
version info: Stabile

Cultural-ON (Cultural ONtology): Ontologia dei Luoghi della Cultura e degli Eventi Culturali
type: Ontology
type: NamedIndividual
type: SemanticAsset
comment: During the definition of Cultural-ON, an in depth discussion between the working group responsible for cultural linked open data, formed by the Ministry of Cultural Heritage and Activities and Tourism (Service I) and the Institute of Cognitive Sciences and Technologies of the Council of Research (CNR) and the working group of the "Istituto beni artistici culturali e naturali" of Emilia Romagna Region, in order to contribute to the integration of the two ontologies, thus guaranteeing semantic interoperability. @en
comment: Nel corso dell'elaborazione di Cultural-ON è stato avviato un approfondito confronto tra il gruppo di lavoro responsabile del progetto di valorizzazione del patrimonio informativo pubblico attraverso i linked open data, costituito dal Ministero dei beni e delle attività culturali e del turismo (Servizio I della Direzione generale Organizzazione) e dall’Istituto di Scienze e Tecnologie della Cognizione del Consiglio Nazionale delle Ricerche (CNR) con il gruppo costituito nell'ambito del progetto di pubblicazione di linked open data del dominio cultura, intrapreso dall'Istituto beni artistici culturali e naturali della Regione Emilia-Romagna che si inserisce nel più ampio progetto Open Data Emilia-Romagna, al fine di contribuire ad un’ampia integrazione tra le due ontologie, nella prospettiva di una sempre maggiore interoperabilità.
creator: Istituto di Scienze e Tecnologie della Cognizione, Consiglio Nazionale delle Ricerche (ISTC-CNR, ST-Lab)
creator: Annarita Orsini (MIBACT)
creator: Ministero dei Beni e delle Attività Culturali e il Turismo (MIBACT)
creator: Giorgia Lodi (ISTC-CNR, ST-Lab)
creator: Andrea Nuzzolese (ISTC-CNR, ST-Lab)
creator: Silvio Peroni (ISTC-CNR, ST-Lab)
creator: Valentina Presutti (ISTC-CNR, ST-Lab)
creator: Aldo Gangemi (ISTC-CNR, ST-Lab)
creator: Luigi Asprino (ISTC-CNR, ST-Lab)
creator: Chiara Veninata (MIBACT)
date: 2015-01-12
description: L'ontologia ha lo scopo di modellare i dati che caratterizzano gli istituti e i luoghi della cultura, come ad esempio i dati sugli enti o sulle persone che hanno un determinato ruolo sugli istituti e luoghi della cultura, le sedi fisiche dei luoghi, i contatti, eventuali materiali multimediali che descrivono un istituto e luogo della cultura e ogni altra informazione utile al pubblico per poter accedere all'istituto e luogo della cultura. Inoltre, l'ontologia rappresenta gli eventi che possono aver luogo in un istituto e luogo della cultura. La figura seguente illustra alcuni elementi principali dell'ontologia. La figura non è esaustiva ma è inserita per aiutare a comprendere alcune relazioni tra concetti dell'ontologia. Per ogni classe dell'ontologia saranno forniti esempi di utilizzo in turtle; solo per alcune classi saranno altresì riportate figure specifiche che illustrano le relazioni e i concetti che ruotano attorno a tali classi. il file alignment_xml.owl inoltre rapprensenta tutti gli allineamenti dell'ontologia con altre esistenti nel Web dei dati come per esempio FOAF, Dubin Core, PRO, schema.org, etc.
description: The ontology aims at modelling the data on cultural institutes or sites such as data regarding the agents that play a specific role on cultural institutes or sites, the sites themselves, the contact points, all multimedia files which describe the cultural institute or site and any other information useful to the public in order to access the institute or site. Moreover, the ontology represents events that can take place in specific cultural institutes or sites. The following figure illustrates some of the core elements of the ontology. The figure is not exaustive; however, it is included in order to help readers to understand some relationships among important concepts represented in the ontology. For each class, examples of their usage in turtle are provided; moreover, for only some of the classes, specific figures are reported that show the relationships and concepts connected to them. The alignment_xml.owl complements the ontology with the alignments with external ontologies such as FOAF, PRO, schma.org, dublin core, etc. @en
license: it
modified: 2016-03-30
rights: legalcode
title: Cultural-ON (Cultural ONtology): Cultural Institute/Site and Cultural Event Ontology @en
version IRI: http://dati.beniculturali.it/cis/2.0
version info: 2.0 - March 30 2016 @en
version info: Versione 2.0 - 30 Marzo 2016

ha unità di misura
type: ObjectProperty
comment: Questa proprietà è utilizzata per rappresentare un'unità di misura.
comment: This property is used to represent a measurement unit. @en
domain: Valore quantitativo
label: has measurement unit @en
range: Unità di misura
version info: unstable @en
version info: versione non definitiva

con ruolo
type: ObjectProperty
type: FunctionalProperty
comment: Property used to associate the situation role in time with the role itself @en
comment: Proprietà che consente di associare la situazione ruolo nel tempo con il ruolo stesso.
domain: Ruolo Nel Tempo
label: with Role @en
range: Ruolo
version info: stable
version info: stabile

apre
type: DatatypeProperty
comment: This property is used to represent the opening time @en
comment: Questa proprietà è utilizzata per rappresentare l'orario di apertura
domain: Orari di Apertura
label: opens @en
range: time
version info: non stabile
version info: unstable @en

Data di inizio
type: DatatypeProperty
comment: Data di inizio di un intervella temporale
comment: Srart date of a Time Interval @en
domain: Intervallo di Tempo
label: start Date @en
range: dateTime
version info: stabile
version info: stable @en

Articolo
type: Class
comment: Concept used to represent a news article. @en
comment: Concetto utilizzato per rappresentare un articolo
label: News Article @en
subclass of: Lavoro Creativo
subclass of: Restriction
  all values from: anyURI
  on property: url
version info: stable @en
version info: stabile

è parte di
type: ObjectProperty
comment: This object property is meant to link a cultural institute or site with itself. This can be used to represent all those cases in which a institute or site can be part of another general institute or site. This property can be effectively used in the cases of Sections of the Central Archive. @en
comment: Questa proprietà è utilizzata per connettere, con una relazione "essere parte di", un istituto e luogo della cultura a se stesso. In particolare, tale proprietà può essere efficacemente usata per rappresentare sezioni dell'Archivio di Stato (sezione dell'Archivio di Spoleto che è parte dell'Archivio di Stato)
domain: Istituto e Luogo Della Cultura
label: is part of @en
range: Istituto e Luogo Della Cultura
version info: non stabile
version info: unstable @en

Area Amministrativa statale
type: Class
comment: This class represents an administrative geographical area that is typically managed by a public body. It can be a Region, a Municipality, a Province, a sub-municipality area, etc. @en
comment: Questa classe rappresenta un'area amministrativa territoriale statale gestita tipicamente da un organismo pubblico. Essa può essere una Regione, una Provincia, un Comune, un area sub comunale, etc.
label: Governamental Administrative Area @en
subclass of: Area Geografica
subclass of: Restriction
  cardinality: 1
  on property: ha codice ISTAT
description: Un esempio di utilizzo della classe cis:GovernamentalAdministrativeArea è il seguente: gaa:Lazio a cis:GovernamentalAdministrativeArea ; rdfs:"Lazio";; cis:toponym "Lazio";; cis:hasISTATCode "12" .
description: An example of usage of the class cis:GovernamentalAdministrativeArea is the following: gaa:Lazio a cis:GovernamentalAdministrativeArea ; rdfs:label "Lazio" ; cis:toponym "Lazio" ; cis:hasISTATCode "12" . @en
version info: stabile
version info: stable @en

Istituto e Luogo Della Cultura
type: Class
comment: Sono istituti e luoghi della cultura i musei, le biblioteche e gli archivi, le aree e i parchi archeologici, i complessi monumentali. Gli istituti e luoghi e della cultura che appartengono a soggetti pubblici sono destinati alla pubblica fruizione ed espletano un servizio pubblico. Le strutture espositive e di consultazione nonché i luoghi della cultura che appartengono a soggetti privati e sono aperti al pubblico espletano un servizio privato di utilità sociale.
comment: The class Cultural Institute or Site represents museums, libraries, archive holders, archaeologic areas and parks, monumental areas. The cultural institutes of sites that are owned by public bodies are meant to offer public services. The cultural institutes or sites that are owned by private subjects, and are open to the public, offer a public and societal service. @en
label: Cultural Institute or Site @en
subclass of: Entità culturale
subclass of: Restriction
  on property: ha tipo
  some values from: Tipo di Istituto e Luogo della Cultura
subclass of: Restriction
  all values from: Attrezzatura
  on property: rende disponibile attrezzatura
subclass of: Restriction
  all values from: Condizioni di accesso
  on property: ha condizioni di accesso
subclass of: Restriction
  on property: Institutional Name
  some values from: Literal
subclass of: Restriction
  cardinality: 1
  on property: Identificativo ISIL
subclass of: Restriction
  all values from: Catalogo
  on property: catalogo
subclass of: Restriction
  all values from: Biglietto
  on property: ha biglietto
subclass of: Restriction
  all values from: Nome Nel Tempo
  on property: ha nome nel tempo
subclass of: Restriction
  all values from: Progetto
  on property: è coinvolto in progetto
subclass of: Restriction
  on property: è relativo a ruolo nel tempo
  some values from: Ruolo Nel Tempo
subclass of: Restriction
  all values from: Servizio
  on property: fornisce servizi
subclass of: Restriction
  all values from: Lavoro Creativo
  on property: è soggetto di
subclass of: Restriction
  all values from: Punto di Contatto
  on property: ha punto di contatto
subclass of: Restriction
  all values from: Collezione
  on property: ha collezione
subclass of: Restriction
  all values from: Categoria prevalente
  on property: ha categoria
subclass of: Restriction
  on property: ha contenitore fisico
  some values from: Sede
subclass of: Restriction
  all values from: Literal
  on property: descrizione
subclass of: Restriction
  all values from: Istituto e Luogo Della Cultura
  on property: è parte di
description: An example of usage of the class 'Cultural Institute or Site' is the following: cissite:Biblioteca_nazionale_centrale a cis:Library , cis:CulturalInstituteOrSite ; rdfs:comment """La Biblioteca Nazionale Centrale di Roma fu inaugurata il 14 marzo 1876 in un'ala del monumentale Palazzo cinquecentesco del Collegio Romano, sede dell'antica Bibliotheca Secreta o Major dei Gesuiti, che costituì il nucleo originario della nuova istituzione, cui si aggiunsero i fondi manoscritti e a stampa di 69 biblioteche conventuali devolute al Regno d'Italia dopo la soppressione delle corporazioni religiose di Roma nel 1873. Cento anni dopo la Biblioteca venne trasferita nella nuova sede, all'interno della zona archeologica del Castro Pretorio, fra la Città universitaria e la Stazione Termini, realizzata su progetto degli architetti Massimo Castellazzi, Tullio Dell'Anese e Annibale Vitellozzi."""@it ; rdfs:label "Biblioteca nazionale centrale"@it ; cis:ISILIdentifier "IT-RM0267"^^xsd:string ; cis:description """La Biblioteca Nazionale Centrale di Roma fu inaugurata il 14 marzo 1876 in un'ala del monumentale Palazzo cinquecentesco del Collegio Romano, sede dell'antica Bibliotheca Secreta o Major dei Gesuiti, che costituì il nucleo originario della nuova istituzione, cui si aggiunsero i fondi manoscritti e a stampa di 69 biblioteche conventuali devolute al Regno d'Italia dopo la soppressione delle corporazioni religiose di Roma nel 1873. Cento anni dopo la Biblioteca venne trasferita nella nuova sede, all'interno della zona archeologica del Castro Pretorio, fra la Città universitaria e la Stazione Termini, realizzata su progetto degli architetti Massimo Castellazzi, Tullio Dell'Anese e Annibale Vitellozzi."""@it ; cis:hasAccessCondition <http://dati.beniculturali.it/cis/resource/OpeningHoursSpecification/Orari_di_apertura_di_Biblioteca_nazionale_centrale_di_Roma_giovedi> , <http://dati.beniculturali.it/cis/resource/OpeningHoursSpecification/Orari_di_apertura_di_Biblioteca_nazionale_centr… @en
description: Un esempio di utilizzo della classe "Istituto e Luogo della Cultura" è il seguente: cissite:Biblioteca_nazionale_centrale a cis:Library , cis:CulturalInstituteOrSite ; rdfs:comment "La Biblioteca Nazionale Centrale di Roma fu inaugurata il 14 marzo 1876 in un'ala del monumentale Palazzo cinquecentesco del Collegio Romano, sede dell'antica Bibliotheca Secreta o Major dei Gesuiti, che costituì il nucleo originario della nuova istituzione, cui si aggiunsero i fondi manoscritti e a stampa di 69 biblioteche conventuali devolute al Regno d'Italia dopo la soppressione delle corporazioni religiose di Roma nel 1873. Cento anni dopo la Biblioteca venne trasferita nella nuova sede, all'interno della zona archeologica del Castro Pretorio, fra la Città universitaria e la Stazione Termini, realizzata su progetto degli architetti Massimo Castellazzi, Tullio Dell'Anese e Annibale Vitellozzi."""@it ; rdfs:label "Biblioteca nazionale centrale"@it ; cis:ISILIdentifier "IT-RM0267"^^xsd:string ; cis:description ""La Biblioteca Nazionale Centrale di Roma fu inaugurata il 14 marzo 1876 in un'ala del monumentale Palazzo cinquecentesco del Collegio Romano, sede dell'antica Bibliotheca Secreta o Major dei Gesuiti, che costituì il nucleo originario della nuova istituzione, cui si aggiunsero i fondi manoscritti e a stampa di 69 biblioteche conventuali devolute al Regno d'Italia dopo la soppressione delle corporazioni religiose di Roma nel 1873. Cento anni dopo la Biblioteca venne trasferita nella nuova sede, all'interno della zona archeologica del Castro Pretorio, fra la Città universitaria e la Stazione Termini, realizzata su progetto degli architetti Massimo Castellazzi, Tullio Dell'Anese e Annibale Vitellozzi."""@it ; cis:hasAccessCondition <http://dati.beniculturali.it/cis/resource/OpeningHoursSpecification/Orari_di_apertura_di_Biblioteca_nazionale_centrale_di_Roma_giovedi> , <http://dati.beniculturali.it/cis/resource/OpeningHoursSpecification/Orari_di_apertura_di_Biblioteca_nazionale_cent…
version info: stabile
version info: stable @en

metodologia di georeferenziazione
type: DatatypeProperty
type: FunctionalProperty
comment: Questa proprietà è utilizzata per rappresentare il metodo della georeferenziazione. Essa può essere i valori "approssimata" ed "esatta".
comment: This property is used to represent the methodology used for the georeferentiation. @en
domain: Geometria
label: georeferentiation methodology @en
range: Literal
version info: stable @en
version info: stabile

ha collezione
type: ObjectProperty
comment: Proprietà che permette di associare l'istituto e luogo della cultura all'insieme delle opere in esso contenute.
comment: Property used to associate the Cultural Institute or Site with the set of cultural objects it contains. @en
domain: Istituto e Luogo Della Cultura
label: has collection @en
range: Collezione
version info: stable
version info: stabile

Punto di Contatto
type: Class
comment: It represents a contact point which consists of phone numbers, e-mail addresses, web sites and their availability where applicable. We recommend the domain experts to specify better during the data production phase which type of contact point is in use (administrative contact point, tourist contact point, etc,). @en
comment: Rappresenta un punto di contatto (racchiude numeri di telefono, fax, indirizzi e-mail, siti web e relative disponibilità ove applicabili). Si raccomanda agli esperti di dominio di aver cura in fase di utilizzo di distinguere ulteriormente il tipo di punto di contatto (turistico, amministrativo, ecc).
label: Contact Point @en
subclass of: Restriction
  all values from: anyURI
  on property: ha email
subclass of: Restriction
  all values from: Orari di Apertura
  on property: disponibile
subclass of: Restriction
  all values from: anyURI
  on property: ha fax
subclass of: Restriction
  all values from: anyURI
  on property: ha posta elettronica certificata (PEC)
subclass of: Restriction
  all values from: anyURI
  on property: ha sito web
subclass of: Restriction
  all values from: anyURI
  on property: ha telefono
description: Gli individui delle classi Istituto e Luogo della Cultura, Evento e Sede possono avere dei punti di contatto, i.e., un numero di telefono, un indirizzo email, un fax, ecc. che sono utilizzati come riferimenti. Inoltre, un pubto di contatto potrebbe essere dichiarato come operativo in alcune fasce orarie. Queste informazioni sono modellate attraverso l'uso della proprietà ha punto di contatto il cui dominio può essere un Istituto e Luogo della Cultura, un Evento o una Sede e il suo range qualsiasi individuo della classe Punto di Contatto. Per esempio, il fatto che la Biblioteca Nazionale Centrale di Roma ha un numero di telefono di riferimento, un numero di fax, un email come pure una PEC può essere descritto nel seguente modo in turtle: contactPoint:Contatti_di_Biblioteca_nazionale_centrale_di_Roma a cis:ContactPoint ; rdfs:label "Contatti di: Biblioteca nazionale centrale di Roma"@it ; cis:available openingHoursSpecification:Orari_di_apertura_di_Biblioteca_nazionale_centrale_di_Roma_giovedi ; cis:hasCertifiedEmail mailto:mbac-bnc-rm@mailcert.beniculturali.it ; cis:hasEmail mailto:bnc-rm@beniculturali.it ; cis:hasFax "+39064457635 " ; cis:hasTelephone "+390649891" . cissite:Biblioteca_nazionale_centrale a cis:Library , cis:CulturalInstituteOrSite ; cis:hasContactPoint contactPoint:Contatti_di_Biblioteca_nazionale_centrale_di_Roma .
description: Individuals of the classes CulturalInstituteOrSite, Event and Site may have a "contact point", i.e., a phone number, email address, fax, etc. that is used a reference contact. Additionally, a cantact point might be also declared to be operative with respect to specific hopening hours. This information is modelled into a knowledge base by using the object property hasContactPoint whose domain can be a CulturalInstituteOrSite, an Event or a Site, and its range is any indifvidual of the class ContactPoint. For example, the fact that the Biblioteca Nazionale Centrale of Rome has reference phone and fax number and a email as well as certified email contacts can be described in the following way by using turtle: contactPoint:Contatti_di_Biblioteca_nazionale_centrale_di_Roma a cis:ContactPoint ; rdfs:label "Contatti di: Biblioteca nazionale centrale di Roma"@it ; cis:available openingHoursSpecification:Orari_di_apertura_di_Biblioteca_nazionale_centrale_di_Roma_giovedi ; cis:hasCertifiedEmail mailto:mbac-bnc-rm@mailcert.beniculturali.it ; cis:hasEmail mailto:bnc-rm@beniculturali.it ; cis:hasFax "+39064457635 " ; cis:hasTelephone "+390649891" . cissite:Biblioteca_nazionale_centrale a cis:Library , cis:CulturalInstituteOrSite ; cis:hasContactPoint contactPoint:Contatti_di_Biblioteca_nazionale_centrale_di_Roma . @en
version info: stabile
version info: stable @en

ha contenitore fisico
type: TransitiveProperty
type: ObjectProperty
comment: Property which links a cultural institute or site to its own physical site(s). @en
comment: Proprietà che collega un istituto e luogo della cultura al proprio o ai propri siti fisici.
domain: Istituto e Luogo Della Cultura
label: ha sede
label: has site @en
range: Sede
version info: stable
version info: stabile

è ruolo in
type: ObjectProperty
comment: Proprietà inversa di "con ruolo"
comment: Inverse property of "with role" @en
domain: Ruolo
label: is role in @en
range: Ruolo Nel Tempo
inverse of: con ruolo

ha valore
type: DatatypeProperty
comment: Proprietà utilizzata per rappresentare un valore
comment: Property used to represent a value @en
domain: Valore quantitativo
label: has value @en
range: positiveInteger
version info: unstable @en
version info: non stabile

descrive
type: ObjectProperty
comment: Property used to associate the catalogue with the cultural heritage objects of a cultural institute or site that the catalogue describes. @en
comment: Proprietà che consente di associare il catalogo alle opere di un istituto e luogo della cultura che esso descrive.
domain: Catalogo
label: describes @en
range: Collezione
version info: stabile
version info: stable

disponibile
type: ObjectProperty
comment: Proprietà utilizzata per associare un punto di contatto a fasce orarie in cui il punto di contatto è disponibile.
comment: Property used to associate a contact point with hours specification in which the contact point is available. @en
domain: Punto di Contatto
label: available @en
range: Orari di Apertura
version info: stabile
version info: stable @en

ha descrizione della sede
type: ObjectProperty
comment: Proprietà che permette di associare una descrizione alla sede dell'istituto e luogo della cultura.
comment: Propery that permits to associate a site of a cultural institute or site with its description. @en
domain: Sede
label: has site description @en
range: Descrizione della sede
version info: stable
version info: stabile

chiude
type: DatatypeProperty
comment: Questa proprietà è utilizzata per rappresentare l'orario di chiusura.
comment: This property is used to represent the closing time @en
domain: Orari di Apertura
label: closes @en
range: time
version info: stable @en
version info: stabile

Ruolo
type: Class
comment: Rappresenta un ruolo. Esso può essere definito facendo riferimento a un vocabolario controlalto. Esempi di ruoli possono essere: ente genstore, ente competente per la tutela, proprietario, direttore, ecc.
comment: It represents a role. It can be modelled using a controlled vocabulary. Examples of roles include: ManagingAuthority, AccountableAuthority, Owner, Director, etc. @en
label: Role @en
subclass of: Restriction
  all values from: Literal
  on property: descrizione
subclass of: Restriction
  on property: nome
  some values from: Literal
subclass of: Restriction
  all values from: Ruolo Nel Tempo
  on property: è ruolo in
description: Un esempio di utilizzo della classe cis:Role è il seguente: role:Director a cis:Role ; rdfs:label "Director"@en ; rdfs:label "Direttore"@it ; cis:name "Direttore"@it ; cis:name ";Director"@en .
description: An example of usage of the class cis:Role is the following: role:Director a cis:Role ; rdfs:label "Director"@en ; rdfs:label "Direttore"@it ; cis:name "Direttore"@it ; cis:name ";Director"@en . @en
version info: stabile
version info: stable @en

ha membro
type: ObjectProperty
comment: Property that permits to specify the cultural heritage objects that form a specific collection or the entire cultural heritage included in a cultural institute or site @en
comment: Proprietà che consente di specificare le opere che formano una determinata collezione o l'intero patrimonio di un istituto e luogo della cultura
domain: Collezione
label: has member @en
range: Class
  union of: Collezione
  union of: Oggetto Culturale
inverse of: è membro di
version info: stable
version info: stabile

Cinema
type: Class
type: Tipo di Istituto e Luogo della Cultura
type: NamedIndividual
comment: Questa classe rappresenta un istituto e luogo della cultura di tipo Cinema
comment: This class represents a cultural institute or site of type Cinema @en
subclass of: Istituto e Luogo Della Cultura
description: An example of usage of the class cis:Cinema is the following: cissite:Cinema_Storico_Alberto_Sordi a cis:CulturalInstituteOrSite, cis:Cinema ; rdfs:label "Cinema storico Alberto Sordi" ; cis:institutionalName "Cinema storico Alberto Sordi" ; cis:ISILIdentifier "IT-EX0003" . @en
description: Un esempio di utilizzo della classe cis:Cinema è il seguente: cissite:Cinema_Storico_Alberto_Sordi a cis:CulturalInstituteOrSite, cis:Cinema ; rdfs:label "Cinema storico Alberto Sordi" ; cis:institutionalName "Cinema storico Alberto Sordi" ; cis:ISILIdentifier "IT-EX0003" .
equivalent class: Restriction
  has value: Cinema
  on property: ha tipo
version info: unstable @en
version info: non stabile

è nella sede
type: ObjectProperty
comment: Proprietà che consente di associare opere culturali al luogo fisico in cui sono conservate.
comment: Property that permits to associate cultural heritage objects with the site(s) which conserve(s) them @en
domain: Oggetto Culturale
label: is in site @en
range: Sede
property chain axiom: ha membro
version info: stable
version info: stabile

ha utente eligibile
type: ObjectProperty
comment: Proprietà che consente di associare un'offerta per l'accesso a un evento o a un istituto e luogo della cultura a una tipologia di utente
comment: Property used to associate the an offert for the access to an event or a cultural institute or site with the type of user @en
domain: Offerta
label: has eligible User @en
range: Tipo di utente
version info: stable
version info: stabile

ha tipo
type: ObjectProperty
comment: La proprietà è utilizzata per collegare un istituto e luogo della cultura alla sua tipologia.
comment: The property is used to link a cultural institure or site to its type. @en
domain: Istituto e Luogo Della Cultura
label: has type @en
label: Cultural-ON (Cultural ONtology): Ontologia dei Luoghi della Cultura e degli Eventi Culturali
range: Tipo di Istituto e Luogo della Cultura
version info: versione non definitiva
version info: unstable @en

ha codice ISTAT
type: DatatypeProperty
type: FunctionalProperty
comment: This property is used to represent a specific code used in the Italian context for the governamental administrative areas. @en
comment: Questa proprietà è utilizzata per rappresentare il codice ISTAT associato a un'area amministrativa statale.
domain: Area Amministrativa statale
label: has ISTAT code @en
range: Literal
version info: stable @en
version info: stabile

ha attribute
type: ObjectProperty
comment: Proprietà che permette di associare una descrizione del sito dell'istituto e luogo della cultura a un attributo, inteso come caratteristica del sito (metratura, scaffalatura, etc)
comment: Property used to associate the description of the site of the cultural institute or site an attribute (e.g., total space, shelving, etc.) @en
domain: Descrizione della sede
label: has attribute @en
range: Attributo
version info: stabile
version info: stable @en

ha fax
type: DatatypeProperty
comment: Proprietà utilizzata per rappresentare uno o più numeri di fax del punto di contatto
comment: Property used to represent one or more fax numbers for the contact point @en
domain: Punto di Contatto
label: has fax @en
range: anyURI
version info: stabile
version info: stable @en

Geometria
type: Class
comment: It represents a geometry which is typically described by using a coordinate system related to Earth such as WGS84. It is univocally identified by lat/long @en
comment: Rappresenta una geometria tipicamente descritto utilizzando un sistema di coordinate geografiche come per esempio WGS84. Univocamente identificato da Lat/Long
label: Geometry @en
subclass of: Restriction
  all values from: decimal
  on property: ha longitudine
subclass of: Restriction
  all values from: decimal
  on property: ha latitudine
subclass of: Restriction
  all values from: Literal
  on property: tipo di geometria
subclass of: Restriction
  all values from: Literal
  on property: metodologia di georeferenziazione
description: An example of usage of the class cis:Geometry is the following: geometry:Museo_di_Capodimonte_Geometry a cis:Geometry ; rdfs:label "Coordinate geografiche della sede di Museo di Capodimonte"@it; cis:hasLat "40.867424" ; cis:geometryType "Point"; cis:geoMethodology "Satellite data georeferentiation" ; cis:hasLong "14.249192". For a complete example refer to the class cis:GeographicalFeature @en
description: Un esempio di utilizzo della classe cis:Geomery è il seguente: geometry:Museo_di_Capodimonte_Geometry a cis:Geometry ; rdfs:label "Coordinate geografiche della sede di Museo di Capodimonte"@it; cis:hasLat "40.867424" ; cis:geometryType "Point"; cis:geoMethodology "Satellite data georeferentiation" ; cis:hasLong "14.249192". Per un esempio complete si veda la classe cis:GeographicalFeature
version info: stable @en
version info: stabile

Progetto
type: Class
comment: It represents a Project the Cultural Institute and Site can be involved in. @en
comment: Rappresenta un progetto nel quale l'istitutto della Cultura può essere coinvolto.
label: Project @en
subclass of: Restriction
  all values from: anyURI
  on property: ha sito web
subclass of: Restriction
  on property: nome
  some values from: Literal
description: Un esempio di uso della classe cis:Project è il seguente: cissite:Museo_di_Capodimonte a cis:CulturalInstituteOrSite, cis:Museum ; rdfs:label "Museo di Capodimonte" ; cis:InstitutionalName "Museo di Capodimonte" ; cis:ISILIdentifier "IT-EX0008" ; cis:isInvolvedInProject project:ProgettoEsempio ; cis:hasSite site:Museo_di_Capodimonte . project:ProgettoEsempio a cis:Project; rdfs:label "Example Project"@en ; rdfs:label "Progetto di Esempio";@it; cis:name "Example Project";@en ; cis:name "Progetto di Esempio"@it; cis:hasWebSite http://www.example-project.com/ .
description: An example of usage of the class cis:Project is the following: cissite:Museo_di_Capodimonte a cis:CulturalInstituteOrSite, cis:Museum ; rdfs:label "Museo di Capodimonte" ; cis:InstitutionalName "Museo di Capodimonte" ; cis:ISILIdentifier "IT-EX0008" ; cis:isInvolvedInProject project:ProgettoEsempio ; cis:hasSite site:Museo_di_Capodimonte . project:ProgettoEsempio a cis:Project; rdfs:label "Example Project"@en ; rdfs:label "Progetto di Esempio";@it; cis:name "Example Project";@en ; cis:name "Progetto di Esempio"@it; cis:hasWebSite http://www.example-project.com/ . @en
version info: stable @en
version info: stabile

ha condizioni di accesso
type: ObjectProperty
comment: Proprietà utilizzata per associare l'istituto e luogo della cultura o l'evento con le condizioni di accesso.
comment: Property used to associate the Cultural Institute or Site or the Event with its access condition information @en
domain: Class
  union of: Istituto e Luogo Della Cultura
  union of: Evento
label: has access condition @en
range: Condizioni di accesso
version info: stabile
version info: stable

Intervallo di Tempo
type: Class
comment: Rappresenta un intervallo temporale.
comment: It represents a temporal interval @en
label: Time Interval @en
subclass of: Restriction
  on property: data di fine
  some values from: dateTime
subclass of: Restriction
  all values from: dateTime
  on property: Data di inizio
description: Un esempio di utilizzo della classe cis:TimeInterval è il seguente: timeInteval:Andrea_De_Pasquale_DirectorOfBibliotecaNazionaleCentrale_20130101_20161231 a cis:TimeInterval ; rdfs:label "Andrea De Pasquale director of Biblioteca Nazionale from 2013-01-01 to 2016-12-31"@en ; cis:startDate "2013-01-01"^^xsd:dateTime ; cis:endDate "2016-12-31"^^xsd:dateTime .
description: An example of usage of the class cis:TimeInterval is the following: timeInteval:Andrea_De_Pasquale_DirectorOfBibliotecaNazionaleCentrale_20130101_20161231 a cis:TimeInterval ; rdfs:label "Andrea De Pasquale director of Biblioteca Nazionale from 2013-01-01 to 2016-12-31"@en ; cis:startDate "2013-01-01"^^xsd:dateTime ; cis:endDate "2016-12-31"^^xsd:dateTime . @en
version info: stable @en
version info: stabile

Mercoledì
type: Giorno della settimana
type: NamedIndividual
label: Wednesday @en

per l'accesso a
type: ObjectProperty
comment: Proprietà che consente di associare un biglietto a un evento o a un istituto e luogo della cultura.
comment: Property used to associate a ticket with an event or a cultural institute or site @en
domain: Biglietto
label: for access to @en
range: Class
  union of: Istituto e Luogo Della Cultura
  union of: Evento
version info: stable
version info: stabile

Tipo di utente
type: Class
comment: Rappresenta la tipologia di utenti relativa ai biglietti per accedere a un evento o a un istituto e luogo della cultura. Esempi includono: "maggiorenni over 25", oppure "over 65", "bambini", ecc.
comment: It represents the identified type of users related to the tickets used to access an event or a Cultural Institute or Site. Examples include: people over 25 years old, people over 65 years old, children, etc. @en
label: User Type @en
subclass of: Restriction
  all values from: Literal
  on property: nome
subclass of: Restriction
  all values from: Literal
  on property: descrizione
description: An example of usage of the class cis:UserType is the following: userType:Under18 a cis:UserType ; rdfs:label "Under 18" ; cis:name "Under 18"; ; cis:description "People under 18 years old";@en; cis:description "Persone con età inferiore ai 18 anni"@it . @en
description: Un esempio di utilizzo della classe cis:UserType è il seguente: userType:Under18 a cis:UserType ; rdfs:label "Under 18" ; cis:name "Under 18"; ; cis:description "People under 18 years old";@en; cis:description "Persone con età inferiore ai 18 anni"@it .
version info: stable @en
version info: stabile

è soggetto di
type: ObjectProperty
comment: Inverse propery of "is about". @en
comment: Proprietà inversa di "tratta di".
domain: Class
  union of: Entità culturale
  union of: Evento
  union of: Sede
label: is subject of @en
range: Lavoro Creativo
inverse of: tratta di
version info: stable @en
version info: stabile

Institutional Name
type: DatatypeProperty
comment: This data property identifies the institutional name of the Cultural Institute or Site. @en
comment: Questa proprietà identifica direttamente il nome istituzionale dell'Istituto e luogo della cultura
domain: Class
  union of: Istituto e Luogo Della Cultura
  union of: Nome Nel Tempo
label: Nome Istituzionale
range: Literal
sub property of: nome
version info: Stabile
version info: Stable @en

condizione di accesso per
type: ObjectProperty
comment: Proprietà inversa di "ha condizione di accesso"
comment: Inverse property of "has access condition" @en
domain: Condizioni di accesso
label: access condition for @en
range: Class
  union of: Istituto e Luogo Della Cultura
  union of: Evento
inverse of: ha condizioni di accesso

unità amministrativa di livello 1
type: DatatypeProperty
comment: Property used to represent the uppermost administrative unit for the address of the site of the cultural institute or site, almost always a country. @en
comment: Proprietà utilizzata per l'unità amministrativa di più alto livello dell'indirizzo della sede di un istituto e luogo della cultura.
domain: Indirizzo
label: administrative unit level 1 @en
range: Literal
version info: stabile
version info: stable

identificativo dell'indirizzo
type: FunctionalProperty
type: DatatypeProperty
comment: Proprietà utilizzata per rappresentare un identificatore univoco per ciascuna istanza di un indirizzo, Rappresenta un elemento cruciale delle specifiche INSPIRE. Sottoproprietà di identificativo.
comment: Property used to represent the globally unique identifier for each instance of an address. A crucial part of the INSPIRE data specifications. Subproperty of identifier. @en
domain: Indirizzo
label: address identifier @en
range: Literal
sub property of: identificativo
version info: unstable
version info: versione ancora non definitiva

è catalogo di
type: ObjectProperty
comment: Inverse property of "has catalogue". @en
comment: Proprietà inversa di "ha catalogo".
domain: Catalogo
label: is catalogue of @en
range: Istituto e Luogo Della Cultura
inverse of: catalogo
version info: versione non definitiva
version info: unstable @en

Domenica
type: Giorno della settimana
type: NamedIndividual
label: Sunday @en

ha giorno della settimana
type: ObjectProperty
comment: This property is used to specify the opening hours and in particular the days of the week. @en
comment: Questa proprietà è utilizzata per specificare gli orari di apertura e in particolare i giorni della settimana.
domain: Orari di Apertura
label: has day of week @en
range: Giorno della settimana
inverse of: è giorno della settimana di
version info: versione non definitiva
version info: unstable @en