JVC
type: BusinessEntity
comment: The business entity Victor Company of Japan, Limited.
legal name: Victor Company of Japan, limited
belongs to module: MP3Player, TV, Camcorder

YPbPr
type: Connectivity
comment: YPbPR is the analog video signal carried by component video cable in consumer electronics. The green cable carries Y, the blue cable carries PB and the red cable carries PR. (This description is partly based on or reuses content from the Wikipedia article "YPbPr" (http://en.wikipedia.org/wiki/YPbPr) and is licensed under the GNU Free Documentation License (http://www.gnu.org/copyleft/fdl.html).)
belongs to module: TV

optical zoom factor
type: ObjectProperty
comment: Defines the stages an object can be zoomed optically.
label: optischer Zoomfaktor @de
range: QuantitativeValueFloat
sub property of: quantitativeProductOrServiceProperty
belongs to module: DigitalCamera, Camcorder

Laser printer
type: Class
comment: A laser printer is a common type of computer printer that rapidly produces high quality text and graphics on plain paper. (This description is partly based on or reuses content from the Wikipedia article "Laser printer" (http://en.wikipedia.org/wiki/Laser_printer) and is licensed under the GNU Free Documentation License (http://www.gnu.org/copyleft/fdl.html).)
label: Laserdrucker @de
subclass of: Printer
belongs to module: Printer

Processor type
type: Class
comment: The type of central processing unit (CPU) as an electronic circuit that can execute printing tasks or programs.
label: Prozessorart @de
subclass of: QualitativeValue
belongs to module: Printer

NTSC
type: Signal format
comment: NTSC (National Television Standard Conversion) is the analog television system used in most of the Americas, Japan, South Korea, Taiwan, the Philippines, Burma, and some Pacific island nations and territories. (This description is partly based on or reuses content from the Wikipedia article "NTSC" (http://en.wikipedia.org/wiki/NTSC) and is licensed under the GNU Free Documentation License (http://www.gnu.org/copyleft/fdl.html).)
belongs to module: TV

MP3-Player
type: Class
comment: Playback equipment for certain data formats, especially audio data. Product is often equipped with some scope of delivery. Especially earphones, booklet, sotwareCD, charger and datacable.
subclass of: ProductOrService
belongs to module: MP3Player

Vivitar
type: BusinessEntity
comment: The business entity Vivitar Corporation.
legal name: Vivitar Corporation
belongs to module: DigitalCamera

LG
type: BusinessEntity
comment: The business entity LG Group.
legal name: LG Group
belongs to module: MP3Player, TV

digital frequency
type: ObjectProperty
comment: Digital frequency is the analogue for discrete signals as frequency is to continuous signals (Common unit of measurement hertz, HTZ). (This description is partly based on or reuses content from the Wikipedia article "Digital frequency" (http://en.wikipedia.org/wiki/Digital_frequency) and is licensed under the GNU Free Documentation License (http://www.gnu.org/copyleft/fdl.html).)
label: Digitale Frequenz @de
range: QuantitativeValueFloat
sub property of: quantitativeProductOrServiceProperty
belongs to module: TV

optical sensor resolution
type: ObjectProperty
comment: Describes the ability of an imaging system to resolve detail in the object that is being imaged.
label: Auflösung optischer Sensor @de
range: QuantitativeValueFloat
sub property of: quantitativeProductOrServiceProperty
belongs to module: Camcorder

MP4 Audio
type: Data Format Audio
comment: A collection of methods defining compression of audio digital data.
belongs to module: MP3Player, DigitalCamera, Camcorder

warmup time
type: ObjectProperty
comment: Defines the amount of time the device needs to be ready.
label: Warmlaufzeit @de
range: QuantitativeValueFloat
sub property of: quantitativeProductOrServiceProperty
belongs to module: Printer

Green
type: Color
comment: RGB Value 0,128,0
label: Grün @de
belongs to module: MP3Player, TV, Printer, DigitalCamera, Camcorder

storage media
type: ObjectProperty
comment: Defines the type of storage media the object uses to store data.
label: Speichermedium @de
range: Storage Media
sub property of: qualitativeProductOrServiceProperty
belongs to module: MP3Player, DigitalCamera, Camcorder

Radio
type: Features
comment: Ability to recieve radiosignal.
belongs to module: MP3Player

Navy
type: Color
comment: RGB Value 0,0,128
label: Marineblau @de
belongs to module: MP3Player, TV, Printer, DigitalCamera, Camcorder

Mac OS X Tiger
type: Compatible Operating Systems
comment: Mac OS is the trademarked name for a series of graphical user interface-based operating systems developed by Apple Inc. for their Macintosh line of computer systems.
belongs to module: MP3Player, Printer, DigitalCamera, Camcorder

number of hypertext pages
type: ObjectProperty
comment: Defines the number of hypertext pages that can be displayed on the main screen of a device.
label: Anzahl von Teletextseiten @de
range: QuantitativeValueInteger
sub property of: quantitativeProductOrServiceProperty
belongs to module: TV

IBM
type: BusinessEntity
comment: The business entity IBM.
legal name: International Business Machines Corporation
belongs to module: Printer

SmartSound control
type: Audio Features
comment: SmartSound’s technology benefits television producers and editors by giving enhanced creative options through special music technology that delivers multiple musical variations for different moods.
belongs to module: TV

depth with stand
type: ObjectProperty
comment: Defines the distance from side to side, measuring across the object with its stand at right angles to the width (Common unit of measurement centimetre, CMT). (This description is partly based on or reuses content from the Wikipedia article "Length" (http://en.wikipedia.org/wiki/Length) and is licensed under the GNU Free Documentation License (http://www.gnu.org/copyleft/fdl.html).)
label: Tiefe mit Standfuß @de
range: QuantitativeValueFloat
sub property of: quantitativeProductOrServiceProperty
belongs to module: TV

Xerox
type: BusinessEntity
comment: The business entity Xerox.
legal name: Xerox Corporation
belongs to module: Printer

TV
type: Class
comment: Television (TV) is a widely used telecommunication medium for transmitting and receiving moving images, either monochromatic ("black and white") or color, usually accompanied by sound. Is often deliverd with a remote control and a manual. (This description is partly based on or reuses content from the Wikipedia article "TV" (http://en.wikipedia.org/wiki/Tv) and is licensed under the GNU Free Documentation License (http://www.gnu.org/copyleft/fdl.html).)
subclass of: ProductOrService
belongs to module: Printer

Zoom
type: Class
comment: Zoom is a method of decreasing (narrowing) the apparent angle of view of a photographic or video image. (This description is partly based on or reuses content from the Wikipedia article "Digital zoom" (http://en.wikipedia.org/wiki/Digital_zoom) and is licensed under the GNU Free Documentation License (http://www.gnu.org/copyleft/fdl.html).)
subclass of: QualitativeValue
belongs to module: DigitalCamera, Camcorder

MSI
type: BusinessEntity
comment: The business entity Micro-Star Int'l Co., Ltd.
legal name: Micro-Star Int'l Co., Ltd.
belongs to module: MP3Player, TV

Data Format Video
type: Class
comment: A data format is a particular way to encode information for storage in a computer file (refers to video data). (This description is partly based on or reuses content from the Wikipedia article "File Format" (http://en.wikipedia.org/wiki/File_format) and is licensed under the GNU Free Documentation License (http://www.gnu.org/copyleft/fdl.html).)
label: Video Datenformat @de
subclass of: Data Format
belongs to module: MP3Player, DigitalCamera, Camcorder

CVBS out
type: Connectivity
comment: Composite video is often designated by the CVBS acronym, meaning any of "Color, Video, Blank and Sync", "Composite Video Baseband Signal", "Composite Video Burst Signal", or "Composite Video with Burst and Sync". Here the output is meant.
belongs to module: TV

B9
type: Media format
comment: Format of the german institute for standardization: 44 x 62 mm.
belongs to module: Printer

ASF
type: Data Format Audio
comment: Advanced Systems Format (formerly Advanced Streaming Format, Active Streaming Format) is Microsoft's proprietary digital audio/digital video container format, especially meant for streaming media. ASF is part of the Windows Media framework. (This description is partly based on or reuses content from the Wikipedia article "Advanced Systems Format" (http://en.wikipedia.org/wiki/Advanced_Systems_Format) and is licensed under the GNU Free Documentation License (http://www.gnu.org/copyleft/fdl.html).)
belongs to module: MP3Player, DigitalCamera, Camcorder

display resolution horizontal
type: ObjectProperty
comment: Defines the digital resolution of the horizontal axe (Common unit of measurement pixel, E37).
label: horizontale Bildschirmauflösung @de
range: QuantitativeValueInteger
sub property of: quantitativeProductOrServiceProperty
belongs to module: MP3Player, TV, DigitalCamera, Camcorder

filter size
type: ObjectProperty
comment: Size of a camera accessory consisting of an optical filter that can be inserted in the optical path. (This description is partly based on or reuses content from the Wikipedia article "Photographic filter" (http://en.wikipedia.org/wiki/Photographic_filter) and is licensed under the GNU Free Documentation License (http://www.gnu.org/copyleft/fdl.html).)
label: Filtergröße @de
range: QuantitativeValueFloat
sub property of: quantitativeProductOrServiceProperty
belongs to module: Camcorder

Anti-reflection coated screen
type: General Features
comment: The screen has a short persistence phosphor with an anti-reflection and anti-static coating.
label: Antireflektierende Bildschirmbeschichtung @de
belongs to module: TV

Dell
type: BusinessEntity
comment: The business entity Dell.
legal name: Dell Inc.
belongs to module: Printer

PictBridge
type: Data Interface Type
comment: Is an industry standard from the Camera & Imaging Products Association (CIPA) for direct printing.
belongs to module: Camcorder

Pendrive
type: BusinessEntity
comment: The business entity dynaTRON Electronics GmbH & Co KG.
legal name: dynaTRON Electronics GmbH & Co. KG
belongs to module: MP3Player, DigitalCamera

IEEE 802.11
type: Data Interface Type
comment: IEEE 802.11 is a set of standards for wireless local area network (WLAN) computer communication, developed by the IEEE LAN/MAN Standards Committee (IEEE 802) in the 5 GHz and 2.4 GHz public spectrum bands. (This description is partly based on or reuses content from the Wikipedia article "802.11" (http://en.wikipedia.org/wiki/802.11) and is licensed under the GNU Free Documentation License (http://www.gnu.org/copyleft/fdl.html).)
belongs to module: MP3Player, Printer, DigitalCamera, Camcorder

Video Features
type: Class
comment: Additional video equipment and abilities.
label: Video Eigenschaften @de
subclass of: Features
belongs to module: TV

Salora
type: BusinessEntity
comment: The business entity Salora.
legal name: SALORA
belongs to module: TV

sleep mode power consumption
type: ObjectProperty
comment: Defines the ability to use a mode that saves significant electrical consumption compared to leaving a device fully on and idle but allows the user to avoid having to reset programming codes (Common unit of measurement Watt, WTT). (This description is partly based on or reuses content from the Wikipedia article "Sleep mode" (http://en.wikipedia.org/wiki/Sleep_mode) and is licensed under the GNU Free Documentation License (http://www.gnu.org/copyleft/fdl.html).)
label: Stromverbrauch im Ruhezustand @de
range: QuantitativeValueFloat
sub property of: quantitativeProductOrServiceProperty
belongs to module: TV

A1
type: Media format
comment: Format of the german institute for standardization: 594 x 841 mm.
belongs to module: Printer

display size
type: ObjectProperty
comment: Defines the diagonal length from the upper left to the lower right angle (Common unit of measurement centimetre, CMT; or inch, INH).
label: Bildschirmgröße @de
range: QuantitativeValueFloat
sub property of: quantitativeProductOrServiceProperty
belongs to module: MP3Player, TV, Printer, DigitalCamera, Camcorder

speaker quantity
type: ObjectProperty
comment: Defines the number of integrated speakers an object includes.
label: Anzahl an Lautsprecher @de
range: QuantitativeValueInteger
sub property of: quantitativeProductOrServiceProperty
belongs to module: TV

operating time
type: ObjectProperty
comment: Average time the object operates (Common unit of measurement hour, HUR).
label: Betriebsdauer @de
range: QuantitativeValueFloat
sub property of: quantitativeProductOrServiceProperty
belongs to module: MP3Player, DigitalCamera, Camcorder

Pink
type: Color
comment: RGB Value 255,192,203
belongs to module: MP3Player, TV, Printer, DigitalCamera, Camcorder

RF
type: Connectivity
comment: An RF connector is an electrical connector designed to work at radio frequencies in the multi-megahertz range. RF connectors are typically used with coaxial cables and are designed to maintain the shielding that the coaxial design offers. Better models also minimize the change in transmission line impedance at the connection. Mechanically they provide a fastening mechanism (thread, bayonet, braces, push pull) and springs for a low ohmic electric contact while sparing the gold surface thus allowing above 1000 reconnects and reducing the insertion force. Research activity in the area of radio-frequency (RF) circuit design has surged in the last decade in direct response to the enormous market demand for inexpensive, high data rate wireless transceivers. (This description is partly based on or reuses content from the Wikipedia article "RF connector" (http://en.wikipedia.org/wiki/RF_connector) and is licensed under the GNU Free Documentation License (http://www.gnu.org/copyleft/fdl.html).)

print border right
type: ObjectProperty
comment: Defines the area which can not be printed on the right side of a paper (A4) (Common unit of measurement millimetre, MMT).
label: Druckgrenze rechts @de
range: QuantitativeValueFloat
sub property of: quantitativeProductOrServiceProperty
belongs to module: Printer

Equalizer
type: Audio Features
comment: Equalization, equalisation or EQ is the process of using passive or active electronic elements or digital algorithms for the purpose of altering (originally flattening) the frequency response characteristics of a system. (This description is partly based on or reuses content from the Wikipedia article "Equalization" (http://en.wikipedia.org/wiki/Equalization) and is licensed under the GNU Free Documentation License (http://www.gnu.org/copyleft/fdl.html).)
belongs to module: TV

Hyperband
type: Signal format
comment: Hyperband designates a range (band) of electromagnetic waves with frequencies between 300 MHz and 470 MHz. This is designated for kable TV especially to recieve digital TV normed for DVB-C.
belongs to module: TV

Component video out
type: Connectivity
comment: Component video is a video signal that has been split into two or more components. In popular use, it refers to a type of analog video information that is transmitted or stored as three separate signals. Component video can be contrasted with composite video (NTSC, PAL or SECAM) in which all the video information is combined into a single line-level signal. Like composite, component video cables do not carry audio and are often paired with audio cables. Here the output is meant. (This description is partly based on or reuses content from the Wikipedia article "Component video" (http://en.wikipedia.org/wiki/Component_video) and is licensed under the GNU Free Documentation License (http://www.gnu.org/copyleft/fdl.html).)

Light exposure control
type: Features
comment: Is the total amount of light allowed to fall on the photographic medium during the process of taking a photograph.
label: Belichtungsregelung @de
belongs to module: Camcorder

Postcard
type: Media type
comment: Rectangular piece of thick paper or thin cardboard intended for writing and mailing without an envelope.
label: Postkarte @de
belongs to module: Printer

iriver
type: BusinessEntity
comment: The business entity iriver Europe GmbH.
legal name: iriver Europe GmbH
belongs to module: MP3Player

Beach and snow
type: Scene mode
comment: Ability of the camcorder to adapt to special environments.
label: Strand und Schnee @de
belongs to module: Camcorder

viewing angle horizontal
type: ObjectProperty
comment: Defines the angle in a horizontal axe where a viewer is still able to see the picture on a screen (Common unit of measurement degree, DD).
label: horizontaler Betrachtungswinkel @de
range: QuantitativeValueFloat
sub property of: quantitativeProductOrServiceProperty
belongs to module: TV

draft printable resolution black white horizontal
type: ObjectProperty
comment: Defines the digital resolution of the horizontal axe (Common unit of measurement pixel, E37) for black/white prints for draft prints.
label: horizontale druckbare Auflösung Schwarz/Weiß Entwurf @de
range: QuantitativeValueInteger
sub property of: quantitativeProductOrServiceProperty
belongs to module: Printer

Document viewing
type: Features
comment: Ability to display documents.
label: Dokumentdarstellung @de
belongs to module: MP3Player, DigitalCamera, Camcorder

Data Format Office
type: Class
comment: A data format is a particular way to encode information for storage in a computer file (refers to office data). (This description is partly based on or reuses content from the Wikipedia article "File Format" (http://en.wikipedia.org/wiki/File_format) and is licensed under the GNU Free Documentation License (http://www.gnu.org/copyleft/fdl.html).)
label: Büro Datenformat @de
subclass of: Data Format
belongs to module: MP3Player, DigitalCamera

Computer display resolution
type: Class
comment: The display resolution of a computer display typically refers to the number of distinct pixels in each dimension that can be displayed. (This description is partly based on or reuses content from the Wikipedia article "Display resolution" (http://en.wikipedia.org/wiki/Display_resolution) and is licensed under the GNU Free Documentation License (http://www.gnu.org/copyleft/fdl.html).)
label: Computerbildschirmauflösung @de
subclass of: Unterstützte Auflösung
belongs to module: TV

Microsoft
type: BusinessEntity
comment: The business entity Microsoft Corporation.
legal name: Microsoft Corporation
belongs to module: MP3Player

Ambilight Spectra Active Frame
type: Video Features
comment: Active Frame is a single soft halo of light powered by 126 LEDs.
belongs to module: TV

DVB COFDM
type: Signal format
comment: Digital Video Broadcasting (DVB) is a suite of internationally accepted open standards for digital television. Coded OFDM (COFDM) and Discrete multi-tone modulation (DMT) is a frequency-division multiplexing (FDM) scheme utilized as a digital multi-carrier modulation method. A large number of closely-spaced orthogonal sub-carriers are used to carry data. The data is divided into several parallel data streams or channels, one for each sub-carrier. Each sub-carrier is modulated with a conventional modulation scheme (such as quadrature amplitude modulation or phase shift keying) at a low symbol rate, maintaining total data rates similar to conventional single-carrier modulation schemes in the same bandwidth. (This description is partly based on or reuses content from the Wikipedia article "Digital Video Broadcasting" (http://en.wikipedia.org/wiki/Digital_Video_Broadcasting) and is licensed under the GNU Free Documentation License (http://www.gnu.org/copyleft/fdl.html).)
belongs to module: TV

B4
type: Media format
comment: Format of the german institute for standardization: 250 x 353 mm.
belongs to module: Printer

Sensor type
type: Class
comment: Type of device that measures a physical quantity and converts it into a signal which can be read by an observer or by an instrument. (This description is partly based on or reuses content from the Wikipedia article "Sensor" (http://en.wikipedia.org/wiki/Sensor) and is licensed under the GNU Free Documentation License (http://www.gnu.org/copyleft/fdl.html).)
label: Sensorart @de
subclass of: QualitativeValue
belongs to module: Camcorder

Built in speakers
type: Audio Features
comment: Speakers that are integrated in the hull of a electronical device, that is able to play audio signals.
label: Eingebaute Lautsprecher @de
belongs to module: TV, Camcorder

Standby LED
type: General Features
comment: It is a semiconductor diode that emits light when an electric current is applied in the forward direction of the device used to show the standby status of an electrical device. (This description is partly based on or reuses content from the Wikipedia article "LED" (http://en.wikipedia.org/wiki/Led) and is licensed under the GNU Free Documentation License (http://www.gnu.org/copyleft/fdl.html).)
label: Standby Ledanzeige @de
belongs to module: TV

power requirements AC
type: ObjectProperty
comment: Defines the requirements of power an electronical device needs to operate (Common unit of measurement Ampere, AMP).
label: Strombedarf AC @de
range: QuantitativeValueFloat
sub property of: quantitativeProductOrServiceProperty
belongs to module: TV

SIGMA
type: BusinessEntity
comment: The business entity SIGMA GmbH.
legal name: SIGMA GmbH
belongs to module: DigitalCamera

SCART
type: Connectivity
comment: SCART (from Syndicat des Constructeurs d'Appareils Radiorécepteurs et Téléviseurs, Radio and Television Receiver Manufacturer's Association) is a French-originated standard and associated 21-pin connector for connecting audio-visual (AV) equipment together. (This description is partly based on or reuses content from the Wikipedia article "SCART" (http://en.wikipedia.org/wiki/SCART) and is licensed under the GNU Free Documentation License (http://www.gnu.org/copyleft/fdl.html).)
belongs to module: TV

Subwoofer out
type: Connectivity
comment: A connection port for a subwoover. Subwoofer is a woofer, or a complete loudspeaker dedicated to the reproduction of bass audio frequencies, from perhaps 150 Hz down as far as 20 Hz, or in rare cases lower. (This description is partly based on or reuses content from the Wikipedia article "Subwoofer" (http://en.wikipedia.org/wiki/Subwoofer) and is licensed under the GNU Free Documentation License (http://www.gnu.org/copyleft/fdl.html).)
belongs to module: TV

Yusmart
type: BusinessEntity
comment: The business entity Yusmart.
legal name: Yusmart B.V.
belongs to module: TV

body color
type: ObjectProperty
comment: Defines the major color of an objects body.
label: Farbe @de
range: Color
sub property of: qualitativeProductOrServiceProperty
belongs to module: MP3Player, TV, Printer, DigitalCamera, Camcorder

Archos
type: BusinessEntity
comment: The business entity Archos GmbH.
legal name: Archos GmbH
belongs to module: MP3Player, Camcorder

Lenco
type: BusinessEntity
comment: The business entity Lenco Audio-Video.
legal name: Lenco Audio-Video
belongs to module: MP3Player, TV

Mac OS X Snow Leopard
type: Compatible Operating Systems
comment: Mac OS is the trademarked name for a series of graphical user interface-based operating systems developed by Apple Inc. for their Macintosh line of computer systems.
belongs to module: MP3Player, Printer, DigitalCamera, Camcorder

Differo
type: BusinessEntity
comment: The business entity Differo Ltd.
legal name: Differo Ltd.
belongs to module: MP3Player

35mm camera lens equivalent range
type: DatatypeProperty
comment: Defines an optical lens or assembly of lenses used in conjunction with a camera body and mechanism to make images of objects either on photographic film or on other media capable of storing an image chemically or electronically.
label: 35mm Kameraobjektiv @de
range: boolean
sub property of: datatypeProductOrServiceProperty
belongs to module: Camcorder

Auto white balance
type: White balance
comment: Ability to adapt of different adjustments of the intensities of the colors.
label: Automatischer Weißabgleich @de
belongs to module: Camcorder

Kyocera
type: BusinessEntity
comment: The business entity Kyocera.
legal name: Kyocera Corporation
belongs to module: Printer

Kodak
type: BusinessEntity
comment: The business entity Eastman Kodak Company.
legal name: Eastman Kodak Company
belongs to module: DigitalCamera, Camcorder

Focus fixed
type: Focus
comment: A photographic lens for which the focus is not adjustable is called a fixed-focus lens. (This description is partly based on or reuses content from the Wikipedia article "Fixed focus" (http://en.wikipedia.org/wiki/Fixed_focus) and is licensed under the GNU Free Documentation License (http://www.gnu.org/copyleft/fdl.html).)
label: Starrer Fokus @de
belongs to module: DigitalCamera, Camcorder

Epson
type: BusinessEntity
comment: The business entity Seiko Epson Corporation.
legal name: Seiko Epson Corporation
belongs to module: MP3Player, Printer, DigitalCamera

Bitmap
type: Data Format Image
comment: In computer graphics, a bitmap or pixmap is a type of memory organization or image file format used to store digital images. (This description is partly based on or reuses content from the Wikipedia article "Bitmap" (http://en.wikipedia.org/wiki/Bitmap) and is licensed under the GNU Free Documentation License (http://www.gnu.org/copyleft/fdl.html).)
belongs to module: MP3Player, DigitalCamera, Camcorder

Sagem
type: BusinessEntity
comment: The business entity Sagem.
legal name: Sagem Télécommunications
belongs to module: TV, Printer

media weight tray 2
type: ObjectProperty
comment: Describes the weight of the media format (Common unit of measurement gram per square metre, GM) hold in tray 2.
label: Mediengewicht Kassette 1 @de
range: QuantitativeValueFloat
sub property of: quantitativeProductOrServiceProperty
belongs to module: Printer

TallyGenicom
type: BusinessEntity
comment: The business entity TallyGenicom.
legal name: TallyGenicom
belongs to module: Printer

Gembird
type: BusinessEntity
comment: The business entity GEMBIRD ® Deutschland GmbH.
legal name: GEMBIRD ® Deutschland GmbH
belongs to module: MP3Player

focus
type: ObjectProperty
comment: A focus, also called an image point, is the point where light rays originating from a point on the object converge. (This description is partly based on or reuses content from the Wikipedia article "Focus (optics)" (http://en.wikipedia.org/wiki/Focus_(optics)) and is licensed under the GNU Free Documentation License (http://www.gnu.org/copyleft/fdl.html).)
label: Fokus @de
range: Focus
sub property of: qualitativeProductOrServiceProperty
belongs to module: DigitalCamera, Camcorder

HDTV 1080i
type: TV display resolution
comment: 1080i is the shorthand name of a format of high-definition video modes. 1080 denotes the number of horizontal scan lines - also known as vertical resolution - and the letter i stands for interlaced. (This description is partly based on or reuses content from the Wikipedia article "1080i" (http://en.wikipedia.org/wiki/1080i) and is licensed under the GNU Free Documentation License (http://www.gnu.org/copyleft/fdl.html).)
belongs to module: TV

Hyundai
type: BusinessEntity
comment: The business entity Hyundai.
legal name: Hyundai IT Europe GmbH
belongs to module: TV

SD
type: Storage Media
comment: A flash memory card format used in portable device.
belongs to module: MP3Player, DigitalCamera, Camcorder

iDream
type: BusinessEntity
comment: The business entity iDream Production Pvt. Ltd.
legal name: iDream Production Pvt. Ltd.
belongs to module: MP3Player

SDTV 576i
type: TV display resolution
comment: 576i is a standard-definition video mode used in (former) PAL and SECAM countries. In digital applications it's usually referred to as "576i", in analogue contexts it's often quoted as "625 lines". The 576 identifies a vertical resolution of 576 lines (usually with a horizontal resolution of 720 or 704 pixels), and the i identifies it as an interlaced resolution. (This description is partly based on or reuses content from the Wikipedia article "576ii" (http://en.wikipedia.org/wiki/576i) and is licensed under the GNU Free Documentation License (http://www.gnu.org/copyleft/fdl.html).)
belongs to module: TV

Gold
type: Color
comment: RGB Value 255,215,0
belongs to module: MP3Player, TV, Printer, DigitalCamera, Camcorder

ViewSonic
type: BusinessEntity
comment: The business entity ViewSonic.
legal name: ViewSonic Corporation
belongs to module: TV

Polaroid
type: BusinessEntity
comment: The business entity Polaroid.
legal name: Polaroid Corporation
belongs to module: TV, DigitalCamera

RoHS
type: Certificate
comment: The Directive on the restriction of the use of certain hazardous substances in electrical and electronic equipment 2002/95/EC. (This description is partly based on or reuses content from the Wikipedia article "ROHS" (http://en.wikipedia.org/wiki/ROHS) and is licensed under the GNU Free Documentation License (http://www.gnu.org/copyleft/fdl.html).)
belongs to module: TV

Auto volume leveller
type: Audio Features
comment: Levels the audio volume of televisions automatically so that undesired peaks in the sound can be reduced.
label: Automatische Lautstärkenanpassung @de
belongs to module: TV

Accessory
type: Class
comment: A subordinate or supplementary item; an adjunct.
label: Zubehör @de
subclass of: QualitativeValue
belongs to module: Camcorder

Video recording
type: Features
comment: Ability to record videos.
label: Videoaufnahme @de
belongs to module: DigitalCamera

UHF
type: Signal format
comment: Ultra high frequency (UHF) designates a range (band) of electromagnetic waves with frequencies between 300 MHz and 3 GHz (3,000 MHz). (This description is partly based on or reuses content from the Wikipedia article "UHF" (http://en.wikipedia.org/wiki/UHF) and is licensed under the GNU Free Documentation License (http://www.gnu.org/copyleft/fdl.html).)
label: VHF @de
belongs to module: TV

Yuraku
type: BusinessEntity
comment: The business entity Yuraku.
legal name: YURAKU Pte Ltd.
belongs to module: TV

A8
type: Media format
comment: Format of the german institute for standardization: 52 x 74 mm.
belongs to module: Printer

Playlist
type: Features
comment: Ability to put audiofiles in a playlist.
label: Wiedergabeliste @de
belongs to module: MP3Player

min relative humidity
type: ObjectProperty
comment: Defines the minimum level of relative humidity, non-condensing, within which the product can operate.
label: minimale Luftfeuchtigkeit @de
range: QuantitativeValueFloat
sub property of: quantitativeProductOrServiceProperty
belongs to module: TV, Printer

AOC
type: BusinessEntity
comment: The business entity AOC.
legal name: AOC

package depth
type: ObjectProperty
comment: Defines the distance from side to side, measuring across the object with its package at right angles to the width (Common unit of measurement centimetre, CMT). (This description is partly based on or reuses content from the Wikipedia article "Length" (http://en.wikipedia.org/wiki/Length) and is licensed under the GNU Free Documentation License (http://www.gnu.org/copyleft/fdl.html).)
label: Verpackungstiefe @de
range: QuantitativeValueFloat
sub property of: quantitativeProductOrServiceProperty
belongs to module: TV

TechniSat
type: BusinessEntity
comment: The business entity TechniSat.
legal name: TechniSat Digital GmbH
belongs to module: MP3Player, TV

standard output capacity for envelopes
type: ObjectProperty
comment: Defines the maximum amount of envelopes the product is able to print.
label: Standard Ausgabekapazität für Briefkuvert @de
range: QuantitativeValueInteger
sub property of: quantitativeProductOrServiceProperty
belongs to module: Printer

Full HD
type: Video Features
comment: Usually assumes a widescreen aspect ratio of 16:9, implying a horizontal resolution of 1920 pixels. This creates a frame resolution of 1920×1080, or 2,073,600 pixels in total. (This description is partly based on or reuses content from the Wikipedia article "1080p" (http://en.wikipedia.org/wiki/1080p) and is licensed under the GNU Free Documentation License (http://www.gnu.org/copyleft/fdl.html).)
belongs to module: TV

Axago
type: BusinessEntity
comment: The business entity Axago.
legal name: Axago
belongs to module: MP3Player

Media format postcard
type: Media format
comment: Media format that is able to assume different shapes.
label: Medienformat Postkarte @de
belongs to module: Printer

Pacific Digital
type: BusinessEntity
comment: The business entity Pacific Digital Home.
legal name: Pacific Digital Home
belongs to module: MP3Player

RISC
type: Processor type
comment: Reduced instruction set computing, represents a CPU design strategy emphasizing the insight that simplified instructions that "do less" may still provide for higher performance if this simplicity can be utilized to make instructions execute very quickly.
belongs to module: Printer

Computer display resolution 800x600 60 72 75 85Hz
type: Computer display resolution
comment: Display resolution specified as the width and height in pixels, color depth measured in bits, and refresh rate expressed in hertz; here Super Video Graphics Array. (This description is partly based on or reuses content from the Wikipedia article "Display resolution" (http://en.wikipedia.org/wiki/Display_resolution) and is licensed under the GNU Free Documentation License (http://www.gnu.org/copyleft/fdl.html).)
label: Computerbildschirmauflösung 800x600 60 72 75 85Hz @de
belongs to module: TV

Features
type: Class
comment: Additional equipment and abilities.
label: Eigenschaften @de
subclass of: QualitativeValue
belongs to module: MP3Player, TV, DigitalCamera, Camcorder

package width
type: ObjectProperty
comment: Defines the distance between the ends of an object, its linear extent as measured from end to end with its package (Common unit of measurement centimetre, CMT).
label: Verpackungsbreite @de
range: QuantitativeValueFloat
sub property of: quantitativeProductOrServiceProperty
belongs to module: TV

Windows 98
type: Compatible Operating Systems
comment: A version of a Microsoft operating system.
belongs to module: MP3Player, Printer, DigitalCamera, Camcorder

normal printable resolution color vertical
type: ObjectProperty
comment: Defines the digital resolution of the vertical axe (Common unit of measurement pixel, E37) for color prints for normal prints.
label: vertikale durckbare Aufslösung Farbe normal @de
range: QuantitativeValueInteger
sub property of: quantitativeProductOrServiceProperty
belongs to module: Printer

Composite video in
type: Connectivity
comment: Composite video is the format of an analog television (picture only) signal before it is combined with a sound signal and modulated onto an RF carrier. It is usually in a standard format such as NTSC, PAL, or SECAM. It is a composite of three source signals called Y, U and V (together referred to as YUV) with sync pulses. Here the input is meant. (This description is partly based on or reuses content from the Wikipedia article "Composite video" (http://en.wikipedia.org/wiki/Composite_video) and is licensed under the GNU Free Documentation License (http://www.gnu.org/copyleft/fdl.html).)
belongs to module: TV

PAL-B G
type: Signal format
comment: PAL, short for Phase Alternating Line, is a colour-encoding system used in broadcast television systems in large parts of the world. This is used in western europe. (This description is partly based on or reuses content from the Wikipedia article "PAL" (http://en.wikipedia.org/wiki/PAL) and is licensed under the GNU Free Documentation License (http://www.gnu.org/copyleft/fdl.html).)
belongs to module: TV

Ambilight Spectra 3
type: Video Features
comment: Enlarges the screen further by projecting a glow of light from the back of the screen onto the surrounding wall. Ambilight adjusts automatically the colour and brightness of the light surrounding the TV to match with the picture.
belongs to module: TV

SECAM
type: Signal format
comment: SECAM, also written SÉCAM (Séquentiel couleur à mémoire, French for "Sequential Color with Memory"), is an analog color television system first used in France. (This description is partly based on or reuses content from the Wikipedia article "SECAM" (http://en.wikipedia.org/wiki/SECAM) and is licensed under the GNU Free Documentation License (http://www.gnu.org/copyleft/fdl.html).)
belongs to module: TV

XDPictureCard
type: Storage Media
comment: The xD-Picture Card is a type of flash memory card.
belongs to module: MP3Player, DigitalCamera, Camcorder

Palm
type: BusinessEntity
comment: The business entity Palm Inc.
legal name: Palm Inc
belongs to module: MP3Player

Digital audio optical out
type: Connectivity
comment: Digital audio uses digital signals for sound reproduction. This includes analog-to-digital conversion, digital-to-analog conversion, storage, and transmission. TOSLINK or Optical Cable is a standardized optical fiber connection system. (This description is partly based on or reuses content from the Wikipedia article "Digital audio" (http://en.wikipedia.org/wiki/Digital_audio) and is licensed under the GNU Free Documentation License (http://www.gnu.org/copyleft/fdl.html).)
belongs to module: TV

NIH2
type: Rechargeable Energy Source
comment: A nickel hydrogen battery (NIH2 or Ni-H2) is a rechargeable electrochemical power source based on nickel and hydrogen.
belongs to module: MP3Player, DigitalCamera, Camcorder

Harwa
type: BusinessEntity
comment: The business entity Harwa.
legal name: Harwa Electronics GmbH
belongs to module: TV

Memorex
type: BusinessEntity
comment: The business entity Memorex Products, Inc.
legal name: Memorex Products, Inc.
belongs to module: MP3Player, TV

max print capacity
type: ObjectProperty
comment: Describes the maximum printed sites per month.
label: maximale Druckkapazität @de
range: QuantitativeValueInteger
sub property of: quantitativeProductOrServiceProperty
belongs to module: Printer

PQI
type: BusinessEntity
comment: The business entity Power Quotient International Co., Ltd.
legal name: Power Quotient International Co., Ltd.
belongs to module: MP3Player

Orion
type: BusinessEntity
comment: The business entity Orion.
legal name: ORION - ISP Kommanditgesellschaft Dieter Lather
belongs to module: TV

SECAM-L
type: Signal format
comment: SECAM, also written SÉCAM (Séquentiel couleur à mémoire, French for "Sequential Color with Memory"), is an analog color television system first used in France. French SECAM (SECAM-L) is used only in France, Luxembourg (only RTL9 on CH 21 from Dudelange) and Tele Monte-Carlo Transmitters in the south of France. (This description is partly based on or reuses content from the Wikipedia article "SECAM" (http://en.wikipedia.org/wiki/SECAM) and is licensed under the GNU Free Documentation License (http://www.gnu.org/copyleft/fdl.html).)
belongs to module: TV

PNG
type: Data Format Image
comment: The PNG (Portable Network Graphics) file format was created as the free, open-source successor to the GIF. (This description is partly based on or reuses content from the Wikipedia article "Graphics file format" (http://en.wikipedia.org/wiki/Graphics_file_format) and is licensed under the GNU Free Documentation License (http://www.gnu.org/copyleft/fdl.html).)
belongs to module: MP3Player, DigitalCamera, Camcorder

channel quantity
type: ObjectProperty
comment: Defines the number of channels of a television that can be used to save specific transmitted signals.
label: Anzahl von Kanäle @de
range: QuantitativeValueInteger
sub property of: quantitativeProductOrServiceProperty
belongs to module: TV

PC in
type: Connectivity
comment: Port to connect a PC with the electronical device.
belongs to module: TV

draft printable resolution color horizontal
type: ObjectProperty
comment: Defines the digital resolution of the horizontal axe (Common unit of measurement pixel, E37) for black/white prints for draft prints.
label: horizontale druckbare Auflösung Farbe Entwurf @de
range: QuantitativeValueInteger
sub property of: quantitativeProductOrServiceProperty
belongs to module: Printer

Mac OS X Jaguar
type: Compatible Operating Systems
comment: Mac OS is the trademarked name for a series of graphical user interface-based operating systems developed by Apple Inc. for their Macintosh line of computer systems.
belongs to module: MP3Player, Printer, DigitalCamera, Camcorder

Yellow
type: Color
comment: RGB Value 255,255,0
label: Gelb @de
belongs to module: MP3Player, TV, Printer, DigitalCamera, Camcorder

HP
type: BusinessEntity
comment: The business entity Hewlett-Packard Company.
legal name: Hewlett-Packard Company
belongs to module: MP3Player, Printer, DigitalCamera

A3
type: Media format
comment: Format of the german institute for standardization: 297 x 420 mm.
belongs to module: Printer

paper format
type: ObjectProperty
comment: Defines the supported paper formats.
label: Papierformat @de
range: Media format
sub property of: qualitativeProductOrServiceProperty
belongs to module: Printer

USB 3.0
type: Data Interface Type
comment: Maximum speed of 4,8 Gbit/s.
belongs to module: MP3Player, TV, Printer, DigitalCamera, Camcorder

max relative humidity
type: ObjectProperty
comment: Defines the maximum level of relative humidity, non-condensing, within which the product can operate.
label: maximale Luftfeuchtigkeit @de
range: QuantitativeValueFloat
sub property of: quantitativeProductOrServiceProperty
belongs to module: TV, Printer

RGB
type: Connectivity
comment: The RGB color model is an additive color model in which red, green, and blue light are added together in various ways to reproduce a broad array of colors. The name of the model comes from the initials of the three additive primary colors, red, green, and blue. Typical RGB input devices are color TV and video cameras, image scanners, and digital cameras. Typical RGB output devices are TV sets of various technologies (CRT, LCD, plasma, etc.), computer and mobile phone displays, video projectors, multicolor LED displays, and large screens as JumboTron, etc. Color printers, on the other hand, are usually not RGB devices, but subtractive color devices (typically CMYK color model). (This description is partly based on or reuses content from the Wikipedia article "RGB" (http://en.wikipedia.org/wiki/RGB) and is licensed under the GNU Free Documentation License (http://www.gnu.org/copyleft/fdl.html).)
belongs to module: TV

Memup
type: BusinessEntity
comment: The business entity Modul Burotic SAS.
legal name: Modul Burotic SAS
belongs to module: MP3Player

Asus
type: BusinessEntity
comment: The business entity Asus.
legal name: ASUSTeK Computer Inc.
belongs to module: TV

Clock
type: Features
comment: Can display the current time.
label: Uhr @de
belongs to module: MP3Player

Pixel Plus HD
type: Video Features
comment: Pixel Plus HD is a picture processing technology that enables viewers to watch content that is vivid, natural and real.
belongs to module: TV

TV display resolution
type: Class
comment: The display resolution of a digital television or display typically refers to the number of distinct pixels in each dimension that can be displayed. (This description is partly based on or reuses content from the Wikipedia article "Display resolution" (http://en.wikipedia.org/wiki/Display_resolution) and is licensed under the GNU Free Documentation License (http://www.gnu.org/copyleft/fdl.html).)
label: Fernsehbildschirmauflösung @de
subclass of: Unterstützte Auflösung
belongs to module: TV

Packard Bell
type: BusinessEntity
comment: The business entity Packard Bell.
legal name: Packard Bell
belongs to module: MP3Player, TV

Nokia
type: BusinessEntity
comment: The business entity Nokia Corporation.
legal name: Nokia Corporation
belongs to module: DigitalCamera

max color print speed best quality
type: ObjectProperty
comment: Amount of pages per minute the product is able to print in the mode of color-printig best quality.
label: maximale Druckgeschwindigkeit Farbe beste Qualität @de
range: QuantitativeValueFloat
sub property of: quantitativeProductOrServiceProperty
belongs to module: Printer

NiCd
type: Rechargeable Energy Source
comment: A type of rechargeable battery using nickel oxide hydroxide and metallic cadmium as electrodes. (This description is partly based on or reuses content from the Wikipedia article "Nickel-cadmium battery" (http://en.wikipedia.org/wiki/Nickel-cadmium_battery) and is licensed under the GNU Free Documentation License (http://www.gnu.org/copyleft/fdl.html).)
belongs to module: MP3Player, DigitalCamera, Camcorder

MP3
type: Data Format Audio
comment: A digital audio encoding format using a form of lossy data compression.
belongs to module: MP3Player, DigitalCamera, Camcorder

DVB-T
type: General Features
comment: DVB-T is an abbreviation for Digital Video Broadcasting - Terrestrial; it is the DVB European-based consortium standard for the broadcast transmission of digital terrestrial television. This system transmits compressed digital audio, video and other data in an MPEG transport stream, using COFDM modulation. (This description is partly based on or reuses content from the Wikipedia article "DVB-T" (http://en.wikipedia.org/wiki/DVB-T) and is licensed under the GNU Free Documentation License (http://www.gnu.org/copyleft/fdl.html).)
belongs to module: TV

Teletext function
type: General Features
comment: Teletext (or "broadcast Teletext") is a television information retrieval service developed in the United Kingdom in the early 1970s. It offers a range of text-based information, typically including national, international and sporting news, weather and TV schedules. (This description is partly based on or reuses content from the Wikipedia article "Teletext" (http://en.wikipedia.org/wiki/Teletext) and is licensed under the GNU Free Documentation License (http://www.gnu.org/copyleft/fdl.html).)
label: Teletext Funktion @de
belongs to module: TV

Spotlight
type: Scene mode
comment: Ability of the camcorder to adapt to special environments.
belongs to module: Camcorder

Hitachi
type: BusinessEntity
comment: The business entity Hitachi.
legal name: HITACHI Digital Media
belongs to module: TV, DigitalCamera, Camcorder

self-timer
type: DatatypeProperty
comment: Defines whether the product is able to give a delay between the pressing of the shutter release and the shutter firing.
label: Selbstauslöser @de
range: boolean
sub property of: datatypeProductOrServiceProperty
belongs to module: DigitalCamera

Sharp
type: BusinessEntity
comment: The business entity Sharp.
legal name: Sharp Corporation
belongs to module: TV

Yukai
type: BusinessEntity
comment: The business entity Yukai.
legal name: Mustek Optic-Computer and Communication International GmbH
belongs to module: Camcorder

Voicerecorder
type: Features
comment: Ability to record sounds with a micro.
label: Voicerekorder @de
belongs to module: MP3Player, DigitalCamera

Pioneer
type: BusinessEntity
comment: The business entity Pioneer.
legal name: Pioneer Corporation
belongs to module: TV

HDTV 1080p
type: TV display resolution
comment: 1080p is the shorthand name for a category of HDTV video modes. The number "1080" represents 1,080 lines of vertical resolution (1080 horizontal scan lines), while the letter p stands for progressive scan (meaning the image is not interlaced). 1080p can be referred to as full HD or full high definition to differentiate it from other HDTV video modes. (This description is partly based on or reuses content from the Wikipedia article "1080p" (http://en.wikipedia.org/wiki/1080p) and is licensed under the GNU Free Documentation License (http://www.gnu.org/copyleft/fdl.html).)
belongs to module: TV

B6
type: Media format
comment: Format of the german institute for standardization: 125 x 176 mm.
belongs to module: Printer

max output capacity
type: ObjectProperty
comment: Maximum number of sheets the product can hold in all available standard and optional output trays.
label: maximale Größe Ausgabefach @de
range: QuantitativeValueInteger
sub property of: quantitativeProductOrServiceProperty
belongs to module: Printer

Rechargeable Energy Source
type: Class
comment: A rechargeable battery is a kind of energy source that is able to be reused by refilling it with a charger.
label: Wiederaufladbare Energiequelle @de
subclass of: Energy Source
belongs to module: MP3Player, DigitalCamera, Camcorder

processor type
type: ObjectProperty
comment: The type of central processing unit (CPU) as an electronic circuit that can execute printing tasks or programs.
label: Prozessorart @de
range: Processor type
sub property of: qualitativeProductOrServiceProperty
belongs to module: Printer

FLAC
type: Data Format Audio
comment: Free Lossless Audio Codec (FLAC) is a file format for lossless audio data compression. (This description is partly based on or reuses content from the Wikipedia article "Free Lossless Audio Codec" (http://en.wikipedia.org/wiki/Free_Lossless_Audio_Codec) and is licensed under the GNU Free Documentation License (http://www.gnu.org/copyleft/fdl.html).)
belongs to module: MP3Player, DigitalCamera, Camcorder

Face identification
type: Features
comment: Ability to identify the face and to justify the picture to it.
label: Gesichtserkennung @de
belongs to module: DigitalCamera, Camcorder

zoom
type: ObjectProperty
comment: Zoom is a method of decreasing (narrowing) the apparent angle of view of a photographic or video image. (This description is partly based on or reuses content from the Wikipedia article "Digital zoom" (http://en.wikipedia.org/wiki/Digital_zoom) and is licensed under the GNU Free Documentation License (http://www.gnu.org/copyleft/fdl.html).)
label: Zoom @de
range: Zoom
sub property of: qualitativeProductOrServiceProperty
belongs to module: DigitalCamera, Camcorder

Linux
type: Compatible Operating Systems
comment: Linux is a generic term commonly used to refer to Unix-like computer operating systems which use the Linux kernel.
belongs to module: MP3Player, Printer, DigitalCamera, Camcorder

DV in
type: Data Interface Type
comment: A digital video format created by Sony, JVC, Panasonic and other video camera producers.
belongs to module: Camcorder

Internal HDD
type: Storage Media
comment: Hard disk drive, a computer device which stores digitally encoded data.
label: Interne HDD @de
belongs to module: MP3Player, DigitalCamera, Camcorder

Sapphire
type: BusinessEntity
comment: The business entity Sapphire Technology Limited
legal name: Sapphire Technology Limited
belongs to module: MP3Player

package weight
type: ObjectProperty
comment: Defines the measurement of the gravitational force acting on an object with its package (Common unit of measurement gramm, GRM).
label: Verpackungsgewicht @de
range: QuantitativeValueFloat
sub property of: quantitativeProductOrServiceProperty
belongs to module: TV

Mac OS X Panther
type: Compatible Operating Systems
comment: Mac OS is the trademarked name for a series of graphical user interface-based operating systems developed by Apple Inc. for their Macintosh line of computer systems.
belongs to module: MP3Player, Printer, DigitalCamera, Camcorder

multicolored
type: Color
comment: The body of the Product has more than one color.
label: Mehrfarbig @de
belongs to module: MP3Player, TV, Printer, DigitalCamera, Camcorder

max black white print speed draft
type: ObjectProperty
comment: Amount of pages per minute the product is able to print in the mode of black-printig normal quality.
label: maximale Druckgeschwindigkeit Schwarz/Weiß normal @de
range: QuantitativeValueFloat
sub property of: quantitativeProductOrServiceProperty
belongs to module: Printer

LCD
type: Display Type
comment: A liquid crystal display (LCD) is an electronically-modulated optical device shaped into a thin, flat panel made up of any number of color or monochrome pixels filled with liquid crystals and arrayed in front of a light source (backlight) or reflector. (This description is partly based on or reuses content from the Wikipedia article "Liquid crystal display" (http://en.wikipedia.org/wiki/Liquid_crystal_display) and is licensed under the GNU Free Documentation License (http://www.gnu.org/copyleft/fdl.html).)
belongs to module: TV, Camcorder

economic print mode
type: DatatypeProperty
comment: Describes whether or not the product is equipped with features that allow economical printing.
label: Energiespardruckmodus @de
range: boolean
sub property of: datatypeProductOrServiceProperty
belongs to module: Printer

V7
type: BusinessEntity
comment: The business entity Videoseven.
legal name: V7
belongs to module: TV

number of on screen languages
type: ObjectProperty
comment: Defines the available languages that can be chosen to be displayed on the main screen of a device.
label: Anzahl von verfügbaren Sprachen @de
range: QuantitativeValueInteger
sub property of: quantitativeProductOrServiceProperty
belongs to module: TV

Orange
type: Color
comment: RGB Value 255,165,0
belongs to module: MP3Player, TV, Printer, DigitalCamera, Camcorder

Windows ME
type: Compatible Operating Systems
comment: A version of a Microsoft operating system.
belongs to module: MP3Player, Printer, DigitalCamera, Camcorder

Acuity
type: Video Features
comment: Is acuteness or clearness of vision, especially form vision, which is dependent on the sharpness of the retinal focus within the eye and the sensitivity of the interpretative faculty of the brain. (This description is partly based on or reuses content from the Wikipedia article "Visual acuity" (http://en.wikipedia.org/wiki/Visual_acuity) and is licensed under the GNU Free Documentation License (http://www.gnu.org/copyleft/fdl.html).)
belongs to module: TV

Incredible Surround
type: Audio Features
comment: Psycho-acoustic method of widening the stereo spatial image especially suited for applications with limited separation of left and right speakers.
belongs to module: TV

CompactFlash
type: Storage Media
comment: CompactFlash (CF) is a mass storage device format used in portable electronic devices. For storage, CompactFlash typically uses flash memory in a standardized enclosure. (This description is partly based on or reuses content from the Wikipedia article "CompactFlash" (http://en.wikipedia.org/wiki/CompactFlash) and is licensed under the GNU Free Documentation License (http://www.gnu.org/copyleft/fdl.html).)
belongs to module: MP3Player, DigitalCamera, Camcorder

Mac OS X Cheetah
type: Compatible Operating Systems
comment: Mac OS is the trademarked name for a series of graphical user interface-based operating systems developed by Apple Inc. for their Macintosh line of computer systems.
belongs to module: MP3Player, Printer, DigitalCamera, Camcorder

Auto channel search
type: General Features
comment: Gives an indication of preprogrammed channels for the user of a television so that he does not need to programm it himself.
label: Automatischer Sendersuchlauf @de
belongs to module: TV

Display Type
type: Class
comment: A display device is an output device for presentation of information for visual, tactile or auditive reception, acquired, stored, or transmitted in various forms. (This description is partly based on or reuses content from the Wikipedia article "Display device" (http://en.wikipedia.org/wiki/Display_device) and is licensed under the GNU Free Documentation License (http://www.gnu.org/copyleft/fdl.html).)
label: Bildschirmtyp @de
subclass of: QualitativeValue
belongs to module: MP3Player, TV, Printer, Camcorder

Silver
type: Color
comment: RGB Value 192,192,192
label: Silber @de
belongs to module: MP3Player, TV, Printer, DigitalCamera, Camcorder

SECAM-B G
type: Signal format
comment: SECAM, also written SÉCAM (Séquentiel couleur à mémoire, French for "Sequential Color with Memory"), is an analog color television system first used in France. SECAM-B/G is used in the Middle East, former East Germany and Greece. (This description is partly based on or reuses content from the Wikipedia article "SECAM" (http://en.wikipedia.org/wiki/SECAM) and is licensed under the GNU Free Documentation License (http://www.gnu.org/copyleft/fdl.html).)
belongs to module: TV

battery size
type: DatatypeProperty
comment: Defines the size of used energy source. (Use ASIN code here. For more information we refer to http://en.wikipedia.org/wiki/List_of_battery_sizes)
label: Batteriegröße @de
range: string
sub property of: datatypeProductOrServiceProperty
belongs to module: MP3Player, DigitalCamera, Camcorder

Media format
type: Class
comment: Sizes and shapes of the paper.
label: Medienformat @de
subclass of: QualitativeValue
belongs to module: Printer

Focus
type: Class
comment: A focus, also called an image point, is the point where light rays originating from a point on the object converge. (This description is partly based on or reuses content from the Wikipedia article "Focus (optics)" (http://en.wikipedia.org/wiki/Focus_(optics)) and is licensed under the GNU Free Documentation License (http://www.gnu.org/copyleft/fdl.html).)
label: Fokus @de
subclass of: QualitativeValue
belongs to module: DigitalCamera, Camcorder

B1
type: Media format
comment: Format of the german institute for standardization: 707 x 1000 mm.
belongs to module: Printer

SMS
type: BusinessEntity
comment: The business entity SMS.
legal name: SMS Printing Graphics
belongs to module: Printer

Agfa
type: BusinessEntity
comment: The business entity Agfa-Gevaert N.V.
legal name: Agfa-Gevaert N.V.
belongs to module: DigitalCamera

Ricatech
type: BusinessEntity
comment: The business entity Ricatech B.V.
legal name: Ricatech B.V.
belongs to module: MP3Player

Equalizer
type: DatatypeProperty
comment: Defines the possibility to vary the audio presentation of sound.
range: boolean
sub property of: datatypeProductOrServiceProperty
belongs to module: MP3Player

Acer
type: BusinessEntity
comment: The business entity Acer, Inc.
legal name: Acer, Inc
belongs to module: MP3Player, TV, DigitalCamera

PAL-L
type: Signal format
comment: PAL, short for Phase Alternating Line, is a colour-encoding system used in broadcast television systems in large parts of the world. PAL L is used on some hotel internal distribution systems, as well as other public display and plant television systems. (This description is partly based on or reuses content from the Wikipedia article "PAL" (http://en.wikipedia.org/wiki/PAL) and is licensed under the GNU Free Documentation License (http://www.gnu.org/copyleft/fdl.html).)
belongs to module: TV

Color print
type: Features
comment: The reproduction of an image or text in color on a paper.
label: Farbdruck @de
belongs to module: Printer

Techsolo
type: BusinessEntity
comment: The business entity Techsolo Europe B.V.
legal name: Techsolo Europe B.V.
belongs to module: MP3Player

TXT
type: Data Format Office
comment: Is a filename extension for files consisting of text usually contain very little formatting.
belongs to module: MP3Player, DigitalCamera

takeMS
type: BusinessEntity
comment: The business entity takeMS International AG.
legal name: takeMS International AG
belongs to module: MP3Player

Line in recorder
type: Features
comment: Ability to record sounds via cable connection.
label: Audioaufnahme @de
belongs to module: MP3Player

network ability
type: DatatypeProperty
comment: Ability to connect the product to a network.
label: Netzwerkfähigkeit @de
range: boolean
sub property of: datatypeProductOrServiceProperty

envelope feeder
type: DatatypeProperty
comment: Indicates wheter this feature is available on this product.
label: Kuvertzuführeinrichtung @de
range: boolean
sub property of: datatypeProductOrServiceProperty
belongs to module: Printer

Audio Interface Type
type: Class
comment: Interface generally refers to an abstraction that an entity provides of itself to the outside (refers to audio output). (This description is partly based on or reuses content from the Wikipedia article "Interface (computer science)" (http://en.wikipedia.org/wiki/Interface_(computer_science)) and is licensed under the GNU Free Documentation License (http://www.gnu.org/copyleft/fdl.html).)
label: Audioschnittstellentyp @de
subclass of: QualitativeValue
belongs to module: MP3Player

on screen display
type: General Features
comment: An on-screen display (abbreviated OSD) is an image superimposed on a screen picture, commonly used by modern televisions, VCRs, and DVD players to display information such as volume, channel, and time. (This description is partly based on or reuses content from the Wikipedia article "On-screen display" (http://en.wikipedia.org/wiki/On-screen_display) and is licensed under the GNU Free Documentation License (http://www.gnu.org/copyleft/fdl.html).)
label: Bildschirmanzeige @de
belongs to module: TV

Bluetooth
type: Data Interface Type
comment: Bluetooth is a wireless protocol utilizing short-range communications technology facilitating data transmission over short distances from fixed and mobile devices, creating wireless personal area networks.
belongs to module: MP3Player, Printer, DigitalCamera, Camcorder

normal printable resolution color horizontal
type: ObjectProperty
comment: Defines the digital resolution of the horizontal axe (Common unit of measurement pixel, E37) for color prints for normal prints.
label: horizontale druckbare Auflösung Farbe normal @de
range: QuantitativeValueInteger
sub property of: quantitativeProductOrServiceProperty
belongs to module: Printer

Esselte
type: BusinessEntity
comment: The business entity Esselte.
legal name: Esselte Corporation
belongs to module: Printer

Digital Crystal Clear
type: Video Features
comment: Digital Crystal Clear is a package of picture innovations that digitally adjusts and optimises picture quality to optimal contrast, colour and sharpness levels.
belongs to module: TV

GNR
type: BusinessEntity
comment: The business entity GNR.
legal name: GNR
belongs to module: TV

Focus auto
type: Focus
comment: Autofocus (or AF) is a feature of some optical systems that allows them to obtain (and in some systems to also continuously maintain) correct focus on a subject, instead of requiring the operator to adjust focus manually. (This description is partly based on or reuses content from the Wikipedia article "Autofocus" (http://en.wikipedia.org/wiki/Autofocus) and is licensed under the GNU Free Documentation License (http://www.gnu.org/copyleft/fdl.html).)
label: Autofokus @de
belongs to module: DigitalCamera, Camcorder

USB 1.0
type: Data Interface Type
comment: Specified data rates of 1.5 Mbit/s and 12 Mbit/s.
belongs to module: MP3Player, TV, Printer, DigitalCamera, Camcorder

weight with stand
type: ObjectProperty
comment: Defines the measurement of the gravitational force acting on an object with its stand (Common unit of measurement gramm, GRM).
label: Gewicht mit Standfuß @de
range: QuantitativeValueFloat
sub property of: quantitativeProductOrServiceProperty
belongs to module: TV

Difrnce
type: BusinessEntity
comment: The business entity DIFRNCE B.V.
legal name: DIFRNCE B.V.
belongs to module: MP3Player

number of input paper trays
type: ObjectProperty
comment: Counts the trays which feed the printer with paper.
label: Anzahl an Papierkassetten Zuführung @de
range: QuantitativeValueInteger
sub property of: quantitativeProductOrServiceProperty
belongs to module: Printer

VIVOTEK
type: BusinessEntity
comment: The business entity VIVOTEK Inc.
legal name: VIVOTEK Inc.
belongs to module: DigitalCamera

Lit-Ion
type: Rechargeable Energy Source
comment: Type of rechargeable battery in which a lithium ion moves between the anode and cathode. (This description is partly based on or reuses content from the Wikipedia article "Lithium ion battery" (http://en.wikipedia.org/wiki/Lithium_ion_battery) and is licensed under the GNU Free Documentation License (http://www.gnu.org/copyleft/fdl.html).)
belongs to module: MP3Player, DigitalCamera, Camcorder

Creative Labs
type: BusinessEntity
comment: The business entity Creative Technology Limited.
legal name: Creative Technology Limited
belongs to module: MP3Player, DigitalCamera, Camcorder

Compatible Operating Systems
type: Class
comment: Ability to communicate with different kinds of operating systems.
label: Kompatible Betriebssyteme @de
subclass of: QualitativeValue
belongs to module: MP3Player, Printer, DigitalCamera, Camcorder

Comb filter
type: Video Features
comment: In signal processing, a comb filter adds a delayed version of a signal to itself, causing constructive and destructive interference. The frequency response of a comb filter consists of a series of regularly-spaced spikes, giving the appearance of a comb. (This description is partly based on or reuses content from the Wikipedia article "Comb filter" (http://en.wikipedia.org/wiki/Comb_filter) and is licensed under the GNU Free Documentation License (http://www.gnu.org/copyleft/fdl.html).)
label: Comb Filter @de
belongs to module: TV

USB energy interface
type: USB
comment: USB-interface used to provide power to low-consumption devices without the need for an external power supply.
label: USB Stromschnittstelle @de
belongs to module: MP3Player, Printer, DigitalCamera

MPAN
type: BusinessEntity
comment: The business entity MPMAN Europe.
legal name: MPMAN Europe
belongs to module: MP3Player

Sports
type: Scene mode
comment: Ability of the camcorder to adapt to special environments.
label: Sport
belongs to module: Camcorder

Power Supply Unit
type: Class
comment: A Power Supply Adapter is used to convert 120 or 240 volt AC supplied by a utility company to a well-regulated lower voltage DC for electronic devices. (This description is partly based on or reuses content from the Wikipedia article "Power supply" (http://en.wikipedia.org/wiki/Power_supply) and is licensed under the GNU Free Documentation License (http://www.gnu.org/copyleft/fdl.html).)
label: Netzgerät @de
subclass of: Energy Source
belongs to module: MP3Player, Printer, DigitalCamera, Camcorder

Audio input
type: Features
comment: Defines the support of a computer soundcard driver protocol for digital audio specified by Steinberg, providing a low-latency and high fidelity interface between a software application and a computer's sound card.
label: Audioeingang @de
belongs to module: Camcorder

Transcend
type: BusinessEntity
comment: The business entity Transcend Information, Inc.
legal name: Transcend Information, Inc.
belongs to module: MP3Player

ATEC
type: BusinessEntity
comment: The business entity ATEC.
legal name: ATEC
belongs to module: TV

number of standard input trays
type: ObjectProperty
comment: Defines the number of trays able to hold sheets of paper to be printed.
label: Anzahl an Standard Papierkassetten @de
range: QuantitativeValueInteger
sub property of: quantitativeProductOrServiceProperty
belongs to module: Printer

Sony
type: BusinessEntity
comment: The business entity Sony Corporation
legal name: Sony Corporation
belongs to module: MP3Player, TV, DigitalCamera, Camcorder

Economical mode
type: Features
comment: Equipment that allows economical printing.
label: Energiesparmodus @de
belongs to module: Printer

Data Interface Type
type: Class
comment: Interface generally refers to an abstraction that an entity provides of itself to the outside. (This description is partly based on or reuses content from the Wikipedia article "Interface (computer science)" (http://en.wikipedia.org/wiki/Interface_(computer_science)) and is licensed under the GNU Free Documentation License (http://www.gnu.org/copyleft/fdl.html).)
label: Datenschnittstellentyp @de
subclass of: QualitativeValue
belongs to module: MP3Player, Printer, DigitalCamera, Camcorder

Video component cable
type: Accessory
comment: A video signal that has been split into two or more components.
label: Videokomponentenkabel @de
belongs to module: Camcorder

max black white print speed draft
type: ObjectProperty
comment: Amount of pages per minute the product is able to print in the mode of black-printig of drafts.
label: maximale Druckgeschwindigkeit schwarz/weiß Entwurf @de
range: QuantitativeValueFloat
sub property of: quantitativeProductOrServiceProperty
belongs to module: Printer

TIFF
type: Data Format Image
comment: The TIFF (Tagged Image File Format) is a flexible format that normally saves 8 bits or 16 bits per color (red, green, blue) for 24-bit and 48-bit totals, respectively, using either the TIFF or the TIF filenames. (This description is partly based on or reuses content from the Wikipedia article "Graphics file format" (http://en.wikipedia.org/wiki/Graphics_file_format) and is licensed under the GNU Free Documentation License (http://www.gnu.org/copyleft/fdl.html).)
belongs to module: MP3Player, DigitalCamera, Camcorder

expansion slot
type: DatatypeProperty
comment: Defines the ability to add devices (e.g. cards) to maximize the storage capacity.
label: Erweiterungsplätze @de
range: boolean
sub property of: datatypeProductOrServiceProperty
belongs to module: Camcorder

max printable resolution color horizontal
type: ObjectProperty
comment: Defines the maximum digital resolution of the horizontal axe (Common unit of measurement pixel, E37) for color prints.
label: maximale horizontale druckbare Auflösung Farbe @de
range: QuantitativeValueInteger
sub property of: quantitativeProductOrServiceProperty
belongs to module: Printer

Typhoon
type: BusinessEntity
comment: The business entity COS Distribution GmbH
legal name: COS Distribution GmbH
belongs to module: MP3Player

A5
type: Media format
comment: Format of the german institute for standardization: 148 x 210 mm.
belongs to module: Printer

focus size
type: ObjectProperty
comment: Focus, also called an image point, is the point where light rays originating from a point on the object converge. (This description is partly based on or reuses content from the Wikipedia article "Focus (optics)" (http://en.wikipedia.org/wiki/Focus_(optics)) and is licensed under the GNU Free Documentation License (http://www.gnu.org/copyleft/fdl.html).)
label: Fokusgröße @de
range: QuantitativeValueFloat
sub property of: quantitativeProductOrServiceProperty
belongs to module: Camcorder

Lavod
type: BusinessEntity
comment: The business entity LAVOD CORPORATION.
legal name: LAVOD CORPOPATION
belongs to module: MP3Player

max internal memory capacity
type: ObjectProperty
comment: Defines the maximum amount of memory that can be installed in the systems hardware (common unit of measurement: megabyte(MB): 4L).
label: maximaler interner Speicherplatz @de
range: QuantitativeValueFloat
sub property of: quantitativeProductOrServiceProperty
belongs to module: Printer

Haier
type: BusinessEntity
comment: The business entity Haier.
legal name: Haier Group
belongs to module: TV

Verbatim
type: BusinessEntity
comment: The business entity Verbatim Corporation.
legal name: Verbatim Corporation
belongs to module: MP3Player

Video play back
type: Features
comment: Ability to display video files.
label: Videowiedergabe @de
belongs to module: MP3Player

Windows NT
type: Compatible Operating Systems
comment: A version of a Microsoft operating system.
belongs to module: MP3Player, Printer, DigitalCamera, Camcorder

Akai
type: BusinessEntity
comment: The business entity Akai.
legal name: Akai
belongs to module: MP3Player, TV

Vestel
type: BusinessEntity
comment: The business entity Vestel.
legal name: Vestel Electronics
belongs to module: TV

max media format
type: ObjectProperty
comment: Defines the maximum size of the printed media format.
label: maximale Mediengröße @de
range: Media format
sub property of: qualitativeProductOrServiceProperty
belongs to module: Printer

Sleep timer
type: General Features
comment: A sleep timer is a function on many modern televisions that shut off the power after a preset amount of time. The setting is usually made either from the remote control or the television menus. They are intended to allow viewers to watch as they fall asleep. (This description is partly based on or reuses content from the Wikipedia article "Sleep timer" (http://en.wikipedia.org/wiki/Sleep_timer) and is licensed under the GNU Free Documentation License (http://www.gnu.org/copyleft/fdl.html).)
label: Schlafzeitgeber @de
belongs to module: TV

power requirements HTZ
type: ObjectProperty
comment: Defines the power requirements of an electronical device (Common unit of measurement hertz, HTZ).
label: Strombedarf HTZ @de
range: QuantitativeValueFloat
sub property of: quantitativeProductOrServiceProperty

draft printable resolution black white vertical
type: ObjectProperty
comment: Defines the digital resolution of the vertical axe (Common unit of measurement pixel, E37) for black/white prints for draft prints.
label: vertikale druckbare Auflösung Schwarz/Weiß Entwurf @de
range: QuantitativeValueInteger
sub property of: quantitativeProductOrServiceProperty
belongs to module: Printer

Blue
type: Color
comment: RGB Value 0,0,255
label: Blau @de
belongs to module: MP3Player, TV, Printer, DigitalCamera, Camcorder

JPEG
type: Data Format Image
comment: JPEG compression is used in a number of image file formats. JPEG/Exif is the most common image format used by digital cameras and other photographic image capture devices; along with JPEG/JFIF, it is the most common format for storing and transmitting photographic images on the World Wide Web. (This description is partly based on or reuses content from the Wikipedia article "JPEG" (http://en.wikipedia.org/wiki/JPEG) and is licensed under the GNU Free Documentation License (http://www.gnu.org/copyleft/fdl.html).)
belongs to module: MP3Player, DigitalCamera, Camcorder

resolution
type: ObjectProperty
comment: Defines the type of resolution a screen is able to display.
label: Auflösung @de
range: Unterstützte Auflösung
sub property of: qualitativeProductOrServiceProperty
belongs to module: TV

Windows 95
type: Compatible Operating Systems
comment: A version of a Microsoft operating system.
belongs to module: MP3Player, Printer, DigitalCamera, Camcorder

TV Tuner
type: Class
comment: A television tuner converts an RF television transmission into audio and video signals which can be further processed to produce sound and a picture. (This description is partly based on or reuses content from the Wikipedia article "Tuner (electronics)" (http://en.wikipedia.org/wiki/Tuner_(electronics)) and is licensed under the GNU Free Documentation License (http://www.gnu.org/copyleft/fdl.html).)
subclass of: QualitativeValue
belongs to module: TV

accessory
type: ObjectProperty
comment: Defines subordinate or supplementary items.
label: Zubehör @de
range: Accessory
sub property of: qualitativeProductOrServiceProperty
belongs to module: Camcorder

Canon
type: BusinessEntity
comment: The business entity Canon.
legal name: Canon Inc.
belongs to module: Printer, DigitalCamera, Camcorder

aperture range
type: ObjectProperty
comment: Defines the hole or an opening through which light is admitted.
label: Blendenbereich @de
range: QuantitativeValueFloat
sub property of: quantitativeProductOrServiceProperty
belongs to module: Camcorder

Plain paper
type: Media type
comment: Thin material mainly used for writing upon, printing upon or packaging.
label: Normalpapier @de
belongs to module: Printer

max printable resolution color vertical
type: ObjectProperty
comment: Defines the maximum digital resolution of the vertical axe (Common unit of measurement pixel, E37) for color prints.
label: maximale vertikale druckbare Auflösung Farbe @de
range: QuantitativeValueInteger
sub property of: quantitativeProductOrServiceProperty
belongs to module: Printer

Red
type: Color
comment: RGB Value 255,0,0
label: Rot @de
belongs to module: MP3Player, TV, Printer, DigitalCamera, Camcorder

Ricoh
type: BusinessEntity
comment: The business entity Ricoh.
legal name: Ricoh Company, Ltd.
belongs to module: Printer, DigitalCamera

Data Format Audio
type: Class
comment: A data format is a particular way to encode information for storage in a computer file (refers to audiodata). (This description is partly based on or reuses content from the Wikipedia article "File Format" (http://en.wikipedia.org/wiki/File_format) and is licensed under the GNU Free Documentation License (http://www.gnu.org/copyleft/fdl.html).)
label: Audio Datenformat @de
subclass of: Data Format
belongs to module: MP3Player, DigitalCamera, Camcorder

Wind filter
type: Features
comment: Ability to filter out wind noises.
label: Windfilter @de
belongs to module: Camcorder

Samsung
type: BusinessEntity
comment: The business entity Samsung Group.
legal name: Samsung Group
belongs to module: MP3Player, TV, Printer, DigitalCamera, Camcorder

B8
type: Media format
comment: Format of the german institute for standardization: 62 x 88 mm.
belongs to module: Printer

WMA
type: Data Format Audio
comment: An audio data compression technology developed by Microsoft.
belongs to module: MP3Player, DigitalCamera, Camcorder

Belkin
type: BusinessEntity
comment: The business entity Belkin International Inc.
legal name: Belkin International Inc
belongs to module: MP3Player

Finlux
type: BusinessEntity
comment: The business entity Finlux.
legal name: Finlux Inc.
belongs to module: TV

A0
type: Media format
comment: Format of the german institute for standardization: 841 x 1189 mm.
belongs to module: Printer

NiMH
type: Rechargeable Energy Source
comment: A nickel-metal hydride battery, abbreviated NiMH, is a type of rechargeable battery similar to a nickel-cadmium (NiCd) battery but using a hydrogen-absorbing alloy for the negative electrode instead of cadmium. (This description is partly based on or reuses content from the Wikipedia article "Nickel metal hydride battery" (http://en.wikipedia.org/wiki/Nickel_metal_hydride_battery) and is licensed under the GNU Free Documentation License (http://www.gnu.org/copyleft/fdl.html).)
belongs to module: MP3Player, DigitalCamera, Camcorder

Solar
type: Rechargeable Energy Source
comment: Solar cell or photovoltaic cell is a wide area electronic device that converts solar energy into electricity by the photovoltaic effect. (This description is partly based on or reuses content from the Wikipedia article "Solar cell" (http://en.wikipedia.org/wiki/Solar_cell) and is licensed under the GNU Free Documentation License (http://www.gnu.org/copyleft/fdl.html).)
belongs to module: MP3Player, DigitalCamera, Camcorder

SDTV 480i
type: TV display resolution
comment: 480i is the shorthand name for a video mode, namely the U.S. NTSC television system or digital television systems with the same characteristics. The i, which is sometimes uppercase, stands for interlaced, the 480 for a vertical frame resolution of 480 lines containing picture information; while NTSC has a total of 525 lines, only 480 of these are used to display the image. (This description is partly based on or reuses content from the Wikipedia article "480i" (http://en.wikipedia.org/wiki/480i) and is licensed under the GNU Free Documentation License (http://www.gnu.org/copyleft/fdl.html).)
belongs to module: TV

Pixelplus 2
type: Video Features
comment: Pixelplus 2 is a technology which allows motion reinterpolation on 480p and 576p material.
belongs to module: TV

Lexmark.
type: BusinessEntity
comment: The business entity Lexmark.
legal name: Lexmark International, Inc.
belongs to module: Printer

max input capacity
type: ObjectProperty
comment: Maximum number of sheets the device can hold in all available standard and optional output trays.
label: maximale Medienkapazität @de
range: QuantitativeValueInteger
sub property of: quantitativeProductOrServiceProperty
belongs to module: Printer

print border left
type: ObjectProperty
comment: Defines the area which can not be printed on the left side of a paper (DIN A4) (Common unit of measurement millimetre, MMT).
label: Druckgrenze links @de
range: QuantitativeValueFloat
sub property of: quantitativeProductOrServiceProperty

GE
type: BusinessEntity
comment: The business entity General Electric Company.
legal name: General Electric Company
belongs to module: DigitalCamera

Disposable battery
type: Disposable Energy Source
comment: Is any kind of electrochemical cell in which the electrochemical reaction of interest is not reversible.
label: Batterie @de
belongs to module: MP3Player, DigitalCamera, Camcorder

Data Format
type: Class
comment: A data format is a particular way to encode information for storage in a computer file. (This description is partly based on or reuses content from the Wikipedia article "File Format" (http://en.wikipedia.org/wiki/File_format) and is licensed under the GNU Free Documentation License (http://www.gnu.org/copyleft/fdl.html).)
label: Datenformat @de
subclass of: QualitativeValue
belongs to module: MP3Player, DigitalCamera, Camcorder

Microphon
type: Features
comment: Ability to record voices and sounds.
label: Mikrofon @de
belongs to module: DigitalCamera, Camcorder

CMOS
type: Sensor type
comment: Complementary metal-oxide-semiconductor (CMOS) (pronounced "see-moss", IPA: /ˈsiːmɒs/), is a major class of integrated circuits. CMOS technology is used in microprocessors, microcontrollers, static RAM, and other digital logic circuits. CMOS technology is also used for a wide variety of analog circuits such as image sensors, data converters, and highly integrated transceivers for many types of communication. Frank Wanlass successfully patented CMOS in 1967 (US Patent 3,356,858). (This description is partly based on or reuses content from the Wikipedia article "CMOS" (http://en.wikipedia.org/wiki/CMOS) and is licensed under the GNU Free Documentation License (http://www.gnu.org/copyleft/fdl.html).)
belongs to module: Camcorder

max operating temperatur
type: ObjectProperty
comment: Defines the maximum temperature the product is able to operate (Common unit of measurement grad celsius, CEL).
label: maximale Betriebstemperatur @de
range: QuantitativeValueFloat
sub property of: quantitativeProductOrServiceProperty
belongs to module: TV, Printer

Mustek
type: BusinessEntity
comment: The business entity Mustek Ltd.
legal name: Mustek Ltd.
belongs to module: MP3Player, Camcorder

max printable resolution black white horizontal
type: ObjectProperty
comment: Defines the maximum digital resolution of the horizontal axe (Common unit of measurement pixel, E37) for black/white prints.
label: maximale horizontale druckbare Auflösung Schwarz/Weiß @de
range: QuantitativeValueInteger
sub property of: quantitativeProductOrServiceProperty
belongs to module: Printer

Picture viewing
type: Features
comment: Ability to display digital pictures.
label: Bildbetrachtung @de
belongs to module: MP3Player

Connectivity
type: Class
comment: A generic term for linking devices to each other and allow sending data in one or both directions.
label: Verbindungsmöglichkeit @de
subclass of: QualitativeValue
belongs to module: TV

Component video in
type: Connectivity
comment: Component video is a video signal that has been split into two or more components. In popular use, it refers to a type of analog video information that is transmitted or stored as three separate signals. Component video can be contrasted with composite video (NTSC, PAL or SECAM) in which all the video information is combined into a single line-level signal. Like composite, component video cables do not carry audio and are often paired with audio cables. Here the input is meant. (This description is partly based on or reuses content from the Wikipedia article "Component video" (http://en.wikipedia.org/wiki/Component_video) and is licensed under the GNU Free Documentation License (http://www.gnu.org/copyleft/fdl.html).)
belongs to module: TV

DC cable
type: Accessory
comment: The mean amplitude of a waveform.
label: DC Kabel @de
belongs to module: Camcorder

Pentax
type: BusinessEntity
comment: The business entity Pentax Corporation.
legal name: Pentax Corporation
belongs to module: DigitalCamera

Focus manual
type: Focus
comment: A manual focus allows the operator to adjust the focus of the lens by hand. (This description is partly based on or reuses content from the Wikipedia article "Manual focus" (http://en.wikipedia.org/wiki/Manual_focus) and is licensed under the GNU Free Documentation License (http://www.gnu.org/copyleft/fdl.html).)
label: Manueller Fokus @de
belongs to module: DigitalCamera, Camcorder

DOC
type: Data Format Office
comment: A file extension for word processing documents.
belongs to module: MP3Player, DigitalCamera

analog video signal
type: DatatypeProperty
comment: Defines whether an analog video signal is supported.
label: analoges Videosignal @de
range: boolean
sub property of: datatypeProductOrServiceProperty
belongs to module: DigitalCamera

Tatung
type: BusinessEntity
comment: The business entity Tatung Co.
legal name: Tatung Co.
belongs to module: MP3Player, TV

Dynamic bass enhancement
type: Audio Features
comment: Dynamic settlement of bass audiosignals.
label: Dynamischer Bass @de
belongs to module: TV

Black
type: Color
comment: RGB Value 0,0,0
label: Schwarz @de
belongs to module: MP3Player, TV, Printer, DigitalCamera, Camcorder

Three-CCD
type: Sensor type
comment: 3CCD is a term used to describe an imaging system employed by some still cameras, video cameras, telecine and camcorders. (This description is partly based on or reuses content from the Wikipedia article "Three-CCD" (http://en.wikipedia.org/wiki/Three-CCD) and is licensed under the GNU Free Documentation License (http://www.gnu.org/copyleft/fdl.html).)
belongs to module: Camcorder

standby power consumption
type: ObjectProperty
comment: Defines the amount of consumed energy while the device is in the standby mode (Common unit of measurement Watt, WTT).
label: Standby Stromverbrauch @de
range: QuantitativeValueFloat
sub property of: quantitativeProductOrServiceProperty
belongs to module: TV, Printer

Apacer
type: BusinessEntity
comment: The business entity Apacer Technology, Inc.
legal name: Apacer Technology, Inc.
belongs to module: MP3Player

wall mountability
type: DatatypeProperty
comment: Defines if an object can be installed at a wall.
label: Wandmontagemöglichkeit @de
range: boolean
sub property of: datatypeProductOrServiceProperty
belongs to module: TV

Perfect Pixel HD
type: Video Features
comment: Perfect Pixel HD Engine offers the unique combination of ultimate sharpness, natural detail, vivid colours and smooth natural motion on all qualities of HD, standard TV signals and multimedia content, for high definition displays. Each pixel of the incoming picture is enhanced to better match the surrounding pixels, resulting in a more natural picture.
belongs to module: TV

B3
type: Media format
comment: Format of the german institute for standardization: 353 x 500 mm.
belongs to module: Printer

Data Format Image
type: Class
comment: A data format is a particular way to encode information for storage in a computer file (refers to image data). (This description is partly based on or reuses content from the Wikipedia article "File Format" (http://en.wikipedia.org/wiki/File_format) and is licensed under the GNU Free Documentation License (http://www.gnu.org/copyleft/fdl.html).)
label: Graphik Datenformat @de
subclass of: Data Format
belongs to module: MP3Player, DigitalCamera, Camcorder

digital zoom
type: DatatypeProperty
comment: Zoom is a method of decreasing (narrowing) the apparent angle of view of a photographic or video image. (This description is partly based on or reuses content from the Wikipedia article "Digital zoom" (http://en.wikipedia.org/wiki/Digital_zoom) and is licensed under the GNU Free Documentation License (http://www.gnu.org/copyleft/fdl.html).)
label: digitaler Zoom @de
range: boolean
sub property of: datatypeProductOrServiceProperty
belongs to module: DigitalCamera, Camcorder

SDHC
type: Storage Media
comment: SDHC (Secure Digital High Capacity, SD 2.0) is an extension of the SD standard that appeared in June 2006. (This description is partly based on or reuses content from the Wikipedia article "Secure Digital card" (http://en.wikipedia.org/wiki/Secure_Digital_card) and is licensed under the GNU Free Documentation License (http://www.gnu.org/copyleft/fdl.html).)
belongs to module: Camcorder

battery recharge time
type: ObjectProperty
comment: Total time needed to fully recharge a completely discharged rechargeable energy source for this mp3 player (Common unit of measurement hour, HUR).
label: Akkuladezeit @de
range: QuantitativeValueFloat
sub property of: quantitativeProductOrServiceProperty
belongs to module: MP3Player, DigitalCamera, Camcorder

Oppo
type: BusinessEntity
comment: The business entity Oppo.
legal name: Elmarc BV
belongs to module: TV

data format
type: ObjectProperty
comment: Defines the supported data formats.
label: Datenformat @de
range: Data Format
sub property of: qualitativeProductOrServiceProperty
belongs to module: MP3Player, DigitalCamera, Camcorder

feature
type: ObjectProperty
comment: Defines the type of special functions the object is capable of.
label: Eigenschaft @de
range: Features
sub property of: qualitativeProductOrServiceProperty
belongs to module: MP3Player, TV, DigitalCamera, Camcorder

ID3 support
type: DatatypeProperty
comment: Defines the support of information such as the title, artist, album, track number, or other information about the file to be stored in the file itself.
label: ID3 Unterstützung @de
range: boolean
sub property of: datatypeProductOrServiceProperty
belongs to module: MP3Player @de

IR remote control
type: Accessory
comment: Remote control with a electromagnetic radiation whose wavelength is longer than that of visible light (400-700 nm), but shorter than that of terahertz radiation (3-300 µm) and microwaves (~30,000 µm). Infrared radiation spans roughly three orders of magnitude (750 nm and 1000 µm)
label: Infrarotfernbedienung @de
belongs to module: Camcorder

CE Mark
type: Certificate
comment: The CE marking (also known as CE mark) is a mandatory conformity mark on many products placed on the single market in the European Economic Area (EEA). (This description is partly based on or reuses content from the Wikipedia article "CE mark" (http://en.wikipedia.org/wiki/CE_mark) and is licensed under the GNU Free Documentation License (http://www.gnu.org/copyleft/fdl.html).)
belongs to module: TV

response time
type: ObjectProperty
comment: Defines the time an electronical device needs to react on a signal (Common unit of measurement millisecond, C26).
label: Reaktionszeit @de
range: QuantitativeValueFloat
sub property of: quantitativeProductOrServiceProperty
belongs to module: TV

AC cable
type: Accessory
comment: A net transfer of energy over a complete cycle of the alternating current waveform.
label: AC Kabel @de
belongs to module: Camcorder

Yakumo
type: BusinessEntity
comment: The business entity Yakumo GmbH.
legal name: Yakumo GmbH
belongs to module: DigitalCamera

Flash
type: Features
comment: Is a device used in photography that produces an instantaneous flash of artificial light.
label: Blitz @de
belongs to module: Camcorder

lens system
type: ObjectProperty
comment: Defines the perfect or approximate axial symmetry which transmits and refracts light.
label: Objektivsystem @de
range: Lens system
sub property of: qualitativeProductOrServiceProperty
belongs to module: Camcorder

Certificate
type: Class
comment: A certificate is an official document affirming some fact like quality standards. (This description is partly based on or reuses content from the Wikipedia article "Certificate" (http://en.wikipedia.org/wiki/Certificate) and is licensed under the GNU Free Documentation License (http://www.gnu.org/copyleft/fdl.html).)
label: Zertifikat @de
subclass of: QualitativeValue
belongs to module: TV

TEAC
type: BusinessEntity
comment: The business entity TEAC Europe GmbH.
legal name: TEAC Europe GmbH
belongs to module: MP3Player, TV

Fujitsu Siemens
type: BusinessEntity
comment: The business entity Fujitsu Siemens.
legal name: Fujitsu Siemens Computers
belongs to module: TV, Printer, DigitalCamera

energy source
type: ObjectProperty
comment: Defines the used energy source.
label: Energiequelle @de
range: Energy Source
sub property of: qualitativeProductOrServiceProperty
belongs to module: MP3Player, Printer, DigitalCamera, Camcorder

picture in picture
type: DatatypeProperty
comment: Defines that an electronical screen can display minimum two pictures on one screen.
label: Bild-in-Bild Funktion @de
range: boolean
sub property of: datatypeProductOrServiceProperty
belongs to module: TV

NEC
type: BusinessEntity
comment: The business entity NEC Corporation.
legal name: NEC Corporation
belongs to module: MP3Player, TV

Mini USB
type: Data Interface Type
comment: The non-standard Mini-USB's, official Mini-B, Micro-A, and Micro-B connectors are used for smaller devices such as PDAs, mobile phones or digital cameras. The Standard-A plug is approximately 4 by 12 mm, the Standard-B approximately 7 by 8 mm, and the Mini-A and Mini-B plugs approximately 2 by 7 mm. (This description is partly based on or reuses content from the Wikipedia article "Universial Serial Bus" (http://en.wikipedia.org/wiki/Universal_Serial_Bus) and is licensed under the GNU Free Documentation License (http://www.gnu.org/copyleft/fdl.html).)
belongs to module: MP3Player, Printer, DigitalCamera, Camcorder

ALE
type: Data Format Audio
comment: Apple Lossless (also known as Apple Lossless Encoder, ALE, or Apple Lossless Audio Codec, ALAC) is an audio codec developed by Apple Inc. for lossless data compression of digital music. (This description is partly based on or reuses content from the Wikipedia article "Apple Lossless" (http://en.wikipedia.org/wiki/Apple_Lossless) and is licensed under the GNU Free Documentation License (http://www.gnu.org/copyleft/fdl.html).)
belongs to module: MP3Player, DigitalCamera, Camcorder

G4 Class Processor
type: Processor type
comment: A designation used by Apple Computer to describe a fourth generation of 32-bit PowerPC microprocessors. (This description is partly based on or reuses content from the Wikipedia article "PowerPC_G4" (http://en.wikipedia.org/wiki/PowerPC_G4) and is licensed under the GNU Free Documentation License (http://www.gnu.org/copyleft/fdl.html).)
belongs to module: Printer

media weight tray 1
type: ObjectProperty
comment: Describes the weight of the media format (Common unit of measurement gram per square metre, GM) hold in tray 1.
label: Mediengewicht Kassette 1 @de
range: QuantitativeValueFloat
sub property of: quantitativeProductOrServiceProperty
belongs to module: Printer

Alert
type: Features
comment: Has wakeup-function.
label: Alarm @de
belongs to module: MP3Player

SECAM-D K
type: Signal format
comment: SECAM, also written SÉCAM (Séquentiel couleur à mémoire, French for "Sequential Color with Memory"), is an analog color television system first used in France. SECAM D/K is used in the Commonwealth of Independent States and Eastern Europe (this is simply SECAM used with the D and K monochrome TV transmission standards). (This description is partly based on or reuses content from the Wikipedia article "SECAM" (http://en.wikipedia.org/wiki/SECAM) and is licensed under the GNU Free Documentation License (http://www.gnu.org/copyleft/fdl.html).)
belongs to module: TV

Nintendo
type: BusinessEntity
comment: The business entity Nintendo Company Ltd.
legal name: Nintendo Company Ltd.
belongs to module: MP3Player

PC Audio out
type: Connectivity
comment: Port to connect the audio cables for a PC with the electronical device.
label: PC Audio in @de
belongs to module: TV

aspect ratio vertical
type: DatatypeProperty
comment: The aspect ratio of a shape is the ratio of its longer dimension to its shorter dimension. The vertical dimension is the shorter one. (This description is partly based on or reuses content from the Wikipedia article "Aspect ratio" (http://en.wikipedia.org/wiki/Aspect_ratio) and is licensed under the GNU Free Documentation License (http://www.gnu.org/copyleft/fdl.html).)
label: vertikales Bildseitenverhältnis @de
range: float
sub property of: datatypeProductOrServiceProperty
belongs to module: TV

EPG
type: General Features
comment: An electronic program(me) guide (EPG) or interactive program(me) guide (IPG) or electronic service guide (ESG) is an digital guide to scheduled broadcast television or radio programs, typically displayed on-screen with functions allowing a viewer to navigate, select, and discover content by time, title, channel, genre, etc. by use of their remote control, a keyboard, or other input devices such as a phone keypad. (This description is partly based on or reuses content from the Wikipedia article "Electronic program guide" (http://en.wikipedia.org/wiki/Electronic_program_guide) and is licensed under the GNU Free Documentation License (http://www.gnu.org/copyleft/fdl.html).)
belongs to module: TV

Viewfinder
type: Class
comment: A viewfinder is what the photographer looks through to compose, and in many cases to focus, the picture. (This description is partly based on or reuses content from the Wikipedia article "Viewfinder" (http://en.wikipedia.org/wiki/Viewfinder) and is licensed under the GNU Free Documentation License (http://www.gnu.org/copyleft/fdl.html).)
label: Bildsucher @de
subclass of: QualitativeValue
belongs to module: DigitalCamera, Camcorder

Disposable Energy Source
type: Class
comment: Disposable batteries are non-rechargeable batteries. When they are out of power you have to dispose them.
label: Einweg-Energiequelle @de
subclass of: Energy Source
belongs to module: MP3Player, DigitalCamera, Camcorder

Purple
type: Color
comment: RGB Value 128,0,128
label: Purpurrot @de
belongs to module: MP3Player, TV, Printer, DigitalCamera, Camcorder

Plug and Play
type: General Features
comment: Describes any hardware specification that alleviates the need for user configuration of device resources. (This description is partly based on or reuses content from the Wikipedia article "Legacy Plug and Play" (http://en.wikipedia.org/wiki/Legacy_Plug_and_Play) and is licensed under the GNU Free Documentation License (http://www.gnu.org/copyleft/fdl.html).)

Audio 2.5mm
type: Audio Interface Type
comment: Audio interface type of a specific diameter.
belongs to module: MP3Player

Victory
type: BusinessEntity
comment: The business entity Victory Niederland B.V.
legal name: Victory Niederland B.V.
belongs to module: MP3Player

Olympus
type: BusinessEntity
comment: The business entity Olympus Europa Holding GmbH.
legal name: Olympus Europa Holding GmbH Corporate Communications
belongs to module: MP3Player, DigitalCamera

PAL-I
type: Signal format
comment: PAL, short for Phase Alternating Line, is a colour-encoding system used in broadcast television systems in large parts of the world. This is only used in Ireland, the UK, Hongkong and Macau. (This description is partly based on or reuses content from the Wikipedia article "PAL" (http://en.wikipedia.org/wiki/PAL) and is licensed under the GNU Free Documentation License (http://www.gnu.org/copyleft/fdl.html).)
label: PAL-L @de
belongs to module: TV

Casio
type: BusinessEntity
comment: The business entity Casio Computer Co., Ltd.
legal name: Casio Computer Co., Ltd
belongs to module: DigitalCamera

WAV
type: Data Format Audio
comment: WAV (or WAVE), short for Waveform audio format, is a Microsoft and IBM audio file format standard for storing an audio bitstream on PCs. (This description is partly based on or reuses content from the Wikipedia article "WAV" (http://en.wikipedia.org/wiki/WAV) and is licensed under the GNU Free Documentation License (http://www.gnu.org/copyleft/fdl.html).)
belongs to module: MP3Player, DigitalCamera, Camcorder

processor clock speed
type: ObjectProperty
comment: Defines the frequency of the clock in any synchronous circuit (common unit of measurement: hertz, HTZ).
label: Prozessortaktrate @de
range: QuantitativeValueFloat
sub property of: quantitativeProductOrServiceProperty
belongs to module: Printer

Hisense
type: BusinessEntity
comment: The business entity Hisense.
legal name: Hisense Group
belongs to module: TV

display resolution vertical
type: ObjectProperty
comment: Defines the digital resolution of the vertical axe (Common unit of measurement pixel, E37).
label: vertikale Bildschirmauflösung @de
range: QuantitativeValueInteger
sub property of: quantitativeProductOrServiceProperty
belongs to module: MP3Player, TV, DigitalCamera, Camcorder

MicroDrive
type: Storage Media
comment: A miniature, 1-inch hard disk designed to fit in a CompactFlash (CF) Type II slot.
belongs to module: MP3Player, DigitalCamera, Camcorder

draft printable resolution color vertical
type: ObjectProperty
comment: Defines the digital resolution of the vertical axe (Common unit of measurement pixel, E37) for black/white prints for draft prints.
label: vertikale druckbare Auflösung Farbe Entwurf @de
range: QuantitativeValueInteger
sub property of: quantitativeProductOrServiceProperty
belongs to module: Printer

AV cable
type: Accessory
comment: A cable to carry video and audio signals from a device, to a tv; in digital or analog format.
label: AV Kabel @de
belongs to module: Camcorder

output power
type: ObjectProperty
comment: Defines the rate of energy conversion (Common unit of Measurement milliwatt, C31).
label: Ausgangsleistung @de
range: QuantitativeValueFloat
sub property of: quantitativeProductOrServiceProperty
belongs to module: MP3Player, Printer

Laser printing paper
type: Media type
comment: Special sort of paper used in laser printers.
label: Laserdruckpapier @de
belongs to module: Printer

usage power consumption
type: ObjectProperty
comment: Defines the necessary power for an electronical object while the device is used (Common unit of measurement Watt, WTT).
label: Stromverbrauch in Betrieb @de
range: QuantitativeValueFloat
sub property of: quantitativeProductOrServiceProperty
belongs to module: TV, Printer

Red eye reduction
type: Features
comment: Defines the ability to precede the flash with a series of short, low-power flashes, or a continuous piercing bright light triggering the iris to contract.
label: Rote-Augen-Effekt Reduktion @de
belongs to module: Camcorder

swivel
type: ObjectProperty
comment: Defines the possibilty to rotate or turn an object into different directions (Common unit of measurement degree, DD).
label: Schwenkarm @de
range: QuantitativeValueFloat
sub property of: quantitativeProductOrServiceProperty
belongs to module: TV

Energy Source
type: Class
comment: Methods of energy storage have been developed, which transform electrical energy into forms of potential energy. (This description is partly based on or reuses content from the Wikipedia article "Energy development" (http://en.wikipedia.org/wiki/Energy_development) and is licensed under the GNU Free Documentation License (http://www.gnu.org/copyleft/fdl.html).)
label: Energiequelle @de
subclass of: QualitativeValue
belongs to module: MP3Player, Printer, DigitalCamera, Camcorder

width
type: ObjectProperty
comment: Defines the distance between the ends of an object, its linear extent as measured from end to end (Common unit of measurement centimetre, CMT).
label: Breite @de
range: QuantitativeValueFloat
sub property of: quantitativeProductOrServiceProperty
belongs to module: MP3Player, TV, Printer, DigitalCamera, Camcorder

max printable resolution black white vertical
type: ObjectProperty
comment: Defines the maximum digital resolution of the vertical axe (Common unit of measurement pixel, E37) for black/white prints.
label: maximale vertikale druckbare Auflösung Schwarz/Weiß @de
range: QuantitativeValueInteger
sub property of: quantitativeProductOrServiceProperty
belongs to module: Printer

Firmware upgradable
type: General Features
comment: The term upgrade refers to the replacement of a product with a newer version of that same product, here it is the replacement of the firmware with a newer version of it.
label: Firmware aufrüstbar @de
belongs to module: TV

HDMI
type: Connectivity
comment: HDMI (High-Definition Multimedia Interface) is a compact audio/video interface for transmitting uncompressed digital data. It represents a digital alternative to consumer analog standards such as Radio Frequency (RF) coaxial cable, composite video, S-Video, SCART, component video, D-Terminal, and VGA. HDMI connects digital audio/video sources such as set-top boxes, Blu-ray Disc players, personal computers (PCs), video game consoles, and AV receivers to compatible digital audio devices, computer monitors, and digital televisions. (This description is partly based on or reuses content from the Wikipedia article "HDMI" (http://en.wikipedia.org/wiki/HDMI) and is licensed under the GNU Free Documentation License (http://www.gnu.org/copyleft/fdl.html).)
belongs to module: TV

audio interface type
type: ObjectProperty
comment: Defines the type of interfaces used to transfer audio signals.
label: Audioschnittstellentyp @de
range: Audio Interface Type
sub property of: qualitativeProductOrServiceProperty
belongs to module: MP3Player

Signal format
type: Class
comment: Type of the transmitted video format signal that is displayed by a monitor or TV panel.
label: Signalformat @de
subclass of: TV Tuner
belongs to module: TV

Automatic picture stabilizer
type: Features
comment: A device used to stabilize a picture in order to keep it in a steady position.
label: Automatischer Bildstabilisator @de
belongs to module: DigitalCamera, Camcorder

A7
type: Media format
comment: Format of the german institute for standardization: 74 x 105 mm.
belongs to module: Printer

ATMT
type: BusinessEntity
comment: ATMT
legal name: ATMT Group
belongs to module: MP3Player

Netgear
type: BusinessEntity
comment: The business entity NETGEAR, Inc.
legal name: NETGEAR, Inc.
belongs to module: MP3Player

width with stand
type: ObjectProperty
comment: Defines the distance between the ends of an object, its linear extent as measured from end to end with its stand (Common unit of measurement centimetre, CMT).
label: Breite mit Standfuß @de
range: QuantitativeValueFloat
sub property of: quantitativeProductOrServiceProperty
belongs to module: TV

height with stand
type: ObjectProperty
comment: Defines the measurement of vertical distance of an object with its stand (Common unit of measurement centimetre, CMT).
label: Höhe mit Standfuß @de
range: QuantitativeValueFloat
sub property of: quantitativeProductOrServiceProperty
belongs to module: TV

Nikon
type: BusinessEntity
comment: The business entity Nikon Corporation.
legal name: Nikon Corporation
belongs to module: DigitalCamera

viewfinder
type: ObjectProperty
comment: A viewfinder is what the photographer looks through to compose, and in many cases to focus, the picture. (This description is partly based on or reuses content from the Wikipedia article "Viewfinder" (http://en.wikipedia.org/wiki/Viewfinder) and is licensed under the GNU Free Documentation License (http://www.gnu.org/copyleft/fdl.html).)
label: Bildsucher @de
range: Viewfinder
sub property of: qualitativeProductOrServiceProperty
belongs to module: DigitalCamera, Camcorder

Computer display resolution 640x480 60 72 75 85Hz
type: Computer display resolution
comment: Display resolution specified as the width and height in pixels, color depth measured in bits, and refresh rate expressed in hertz; here Video Graphics Array. (This description is partly based on or reuses content from the Wikipedia article "Display resolution" (http://en.wikipedia.org/wiki/Display_resolution) and is licensed under the GNU Free Documentation License (http://www.gnu.org/copyleft/fdl.html).)
label: Computerbildschirmauflösung 640x480 60 72 75 85Hz @de
belongs to module: TV

Label printer
type: Class
comment: A label printer is a computer peripheral that prints on self-adhesive label material and sometimes card-stock (also called tags).
label: Etikettendrucker @de
subclass of: Printer
belongs to module: Printer

Thomson
type: BusinessEntity
comment: The business entity The Thomson Corporation.
legal name: The Thomson Corporation
belongs to module: MP3Player, TV

Viewpia
type: BusinessEntity
comment: The business entity Viewpia.
legal name: Global-Tech 24 Ltd.
belongs to module: TV

ODYS
type: BusinessEntity
comment: The business entity ODYS.
legal name: ODYS
belongs to module: MP3Player, TV, DigitalCamera, Camcorder

MOV
type: Data Format Video
comment: The QuickTime (.mov) file format functions as a multimedia container file that contains one or more tracks, each of which stores a particular type of data: audio, video, effects, or text (e.g. for subtitles). (This description is partly based on or reuses content from the Wikipedia article "QuickTime" (http://en.wikipedia.org/wiki/QuickTime) and is licensed under the GNU Free Documentation License (http://www.gnu.org/copyleft/fdl.html).)
belongs to module: MP3Player, DigitalCamera, Camcorder

MP4 Video
type: Data Format Video
comment: A collection of methods defining compression of video digital data.
belongs to module: MP3Player, DigitalCamera, Camcorder

Photo printer
type: Class
comment: A photo printer is a printer that is specifically designed to print high quality digital photos on photo paper. (This description is partly based on or reuses content from the Wikipedia article "Photo printer" (http://en.wikipedia.org/wiki/Photo_printer) and is licensed under the GNU Free Documentation License (http://www.gnu.org/copyleft/fdl.html).)
label: Fotodrucker @de
subclass of: Printer
belongs to module: Printer

VHF
type: Signal format
comment: VHF (Very high frequency) is the radio frequency range from 30 MHz to 300 MHz. (This description is partly based on or reuses content from the Wikipedia article "VHF" (http://en.wikipedia.org/wiki/VHF) and is licensed under the GNU Free Documentation License (http://www.gnu.org/copyleft/fdl.html).)
belongs to module: TV

Power LED
type: General Features
comment: It is a semiconductor diode that emits light when an electric current is applied in the forward direction of the device used to show the power status of an electrical device. (This description is partly based on or reuses content from the Wikipedia article "LED" (http://en.wikipedia.org/wiki/Led) and is licensed under the GNU Free Documentation License (http://www.gnu.org/copyleft/fdl.html).)
label: In-Betrieb Ledanzeige @de
belongs to module: TV, Camcorder

Windows 2003
type: Compatible Operating Systems
comment: A version of a Microsoft operating system.
belongs to module: MP3Player, Printer, DigitalCamera, Camcorder

Printer
type: Class
comment: A peripheral which produces a hard copy (permanent human-readable text and/or graphics) of documents stored in electronic form, usually on physical print media such as paper or transparencies. (This description is partly based on or reuses content from the Wikipedia article "Printer" (http://en.wikipedia.org/wiki/Computer_printer) and is licensed under the GNU Free Documentation License (http://www.gnu.org/copyleft/fdl.html).)
label: Drucker @de
subclass of: ProductOrService
belongs to module: Printer

Prestigio
type: BusinessEntity
comment: The business entity Prestigio.
legal name: Prestigio Plaza Ltd.
belongs to module: TV

DPOF
type: Data Format Image
comment: DPOF (Digital Print Order format) is a format which allows the user of a digital camera or other device such as a Mobile Phone or PDA to define which captured images on the storage card are to be printed, together with information on the number of copies or other image information such as paper size, image title text, image orientation, contact information and more. (This description is partly based on or reuses content from the Wikipedia article "DPOF" (http://en.wikipedia.org/wiki/DPOF) and is licensed under the GNU Free Documentation License (http://www.gnu.org/copyleft/fdl.html).)
belongs to module: DigitalCamera, Camcorder

Ambilight Spectra 2
type: Video Features
comment: Ambilight Spectra 2 generates reactive ambient lighting on both sides of a Flat TV.
belongs to module: TV

digital video capture speed
type: ObjectProperty
comment: Speed of the process of converting an analog video signal—such as that produced by a video camera or DVD player—to digital form.
label: digitale Videoaufnahmgeschwindigkeit @de
range: QuantitativeValueFloat
sub property of: quantitativeProductOrServiceProperty
belongs to module: Camcorder

Phillar
type: BusinessEntity
comment: The business entity Phillar.
legal name: Phillar electronics b. V.
belongs to module: TV

Envelope
type: Media type
comment: Is a packaging product, usually made of flat material such as paper or cardboard.
label: Briefkuvert @de
belongs to module: Printer

Shuffle
type: Features
comment: Ability to play files in random order.
label: Zufällige Wiedergabe @de
belongs to module: MP3Player

Actebis
type: BusinessEntity
comment: The business entity Actebis Peacock GmbH.
legal name: Actebis Peacock GmbH
belongs to module: MP3Player

Brother
type: BusinessEntity
comment: The business entity Brother.
legal name: Brother International GmbH
belongs to module: Printer

AVI
type: Data Format Video
comment: A multimedia container format introduced by Microsoft.
belongs to module: MP3Player, DigitalCamera, Camcorder

Child safety lock
type: General Features
comment: A child safety lock is a special-purpose lock that is designed to help prevent children from getting at any dangerous contents. (This description is partly based on or reuses content from the Wikipedia article "Child safety lock" (http://en.wikipedia.org/wiki/Child_safety_lock) and is licensed under the GNU Free Documentation License (http://www.gnu.org/copyleft/fdl.html).)
label: Kindersicherung @de
belongs to module: TV

Media format Envelope
type: Media format
comment: Media format that is able to assume different shapes.
label: Medienformat Briefkuvert @de
belongs to module: Printer

PAL
type: Signal format
comment: PAL, short for Phase Alternating Line, is a colour-encoding system used in broadcast television systems in large parts of the world. (This description is partly based on or reuses content from the Wikipedia article "PAL" (http://en.wikipedia.org/wiki/PAL) and is licensed under the GNU Free Documentation License (http://www.gnu.org/copyleft/fdl.html).)
belongs to module: TV

sound emission
type: ObjectProperty
comment: Level of sound power during the printing (Common unit of measurement decibel, 2N).
label: Geräuschentwicklung @de
range: QuantitativeValueFloat
sub property of: quantitativeProductOrServiceProperty
belongs to module: Printer

Audio 3.5mm
type: Audio Interface Type
comment: Audio interface type of a specific diameter.
belongs to module: MP3Player

DVI out
type: Data Interface Type
comment: A digital video format created by Sony, JVC, Panasonic and other video camera producers.
belongs to module: Camcorder

Night mode
type: Scene mode
comment: Ability of the camcorder to adapt to special environments.
label: Nachtmodus @de
belongs to module: Camcorder

max input capacity for envelopes
type: ObjectProperty
comment: Defines the maximum ability to hold for envelopes.
label: maximale Menge an Briefkuvert @de
range: QuantitativeValueInteger
sub property of: quantitativeProductOrServiceProperty
belongs to module: Printer

Storage Media
type: Class
comment: A data storage device is a device for recording (storing) information (data). (This description is partly based on or reuses content from the Wikipedia article "Data Storage Device" (http://en.wikipedia.org/wiki/Data_storage_device) and is licensed under the GNU Free Documentation License (http://www.gnu.org/copyleft/fdl.html).)
label: Speichermedium @de
subclass of: QualitativeValue
belongs to module: MP3Player, DigitalCamera, Camcorder

equalizer bands qunatity
type: ObjectProperty
comment: Defines the number of supported equalizers.
label: Anzahl von Equalizer @de
range: QuantitativeValueInteger
sub property of: quantitativeProductOrServiceProperty
belongs to module: MP3Player, TV

A2
type: Media format
comment: Format of the german institute for standardization: 420 x 594 mm.
belongs to module: Printer

AIFF
type: Data Format Audio
comment: Audio Interchange File Format (AIFF) is an audio file format standard used for storing sound data for personal computers and other electronic audio devices. (This description is partly based on or reuses content from the Wikipedia article "Audio Interchange File Format" (http://en.wikipedia.org/wiki/Audio_Interchange_File_Format) and is licensed under the GNU Free Documentation License (http://www.gnu.org/copyleft/fdl.html).)
belongs to module: MP3Player, DigitalCamera, Camcorder

Chimei
type: BusinessEntity
comment: The business entity Chimei.
legal name: CHIE MEI Optoelectronics Corp(CMO)
belongs to module: TV

Konica Minolta
type: BusinessEntity
comment: The business entity Konica Minolta.
legal name: Konica Minolta Holdings, Inc.
belongs to module: Printer, DigitalCamera

Cowon
type: BusinessEntity
comment: The business entity COWON SYSTEMS, Inc.
legal name: COWON SYSTEMS, Inc.
belongs to module: MP3Player

video resolution
type: DatatypeProperty
comment: Defines the digital resolution of the videos (Common unit of measurement pixel, E37). (Example: 1024x768)
label: Videoauflösung @de
range: string
sub property of: datatypeProductOrServiceProperty
belongs to module: DigitalCamera, Camcorder

AC Adapter
type: Power Supply Unit
comment: A linear or switched-mode power supply (or in some cases just a transformer) that is built into the top of a plug and needed for the conversion of one form of electrical power to another desired form and voltage. (This description is partly based on or reuses content from the Wikipedia article "Power supply" (http://en.wikipedia.org/wiki/Power_supply) and is licensed under the GNU Free Documentation License (http://www.gnu.org/copyleft/fdl.html).)
belongs to module: MP3Player, Printer, DigitalCamera, Camcorder

NICAM
type: Signal format
comment: NICAM stands for Near Instantaneous Companded Audio Multiplex. It is an early form of lossy compression for digital audio. (This description is partly based on or reuses content from the Wikipedia article "NICAM" (http://en.wikipedia.org/wiki/NICAM) and is licensed under the GNU Free Documentation License (http://www.gnu.org/copyleft/fdl.html).)
belongs to module: TV

Game mode
type: General Features
comment: A special mode providing more performance of the television to optimize pictures when games are played on a LCD or plasma panel.
label: Spielemodus @de
belongs to module: TV

Outdoor white balance
type: White balance
comment: Ability to adapt of different adjustments of the intensities of the colors.
label: Weißabgleich außen @de
belongs to module: Camcorder

RS-232
type: Connectivity
comment: In telecommunications, RS-232 (Recommended Standard 232) is a standard for serial binary data signals connecting between a DTE (Data Terminal Equipment) and a DCE (Data Circuit-terminating Equipment). It is commonly used in computer serial ports. (This description is partly based on or reuses content from the Wikipedia article "RS-232" (http://en.wikipedia.org/wiki/RS-232) and is licensed under the GNU Free Documentation License (http://www.gnu.org/copyleft/fdl.html).)
belongs to module: TV

Daewoo
type: BusinessEntity
comment: The business entity Daewoo.
legal name: Daewoo Electronics
belongs to module: TV

DRM support
type: DatatypeProperty
comment: Defines the support of a generic term that refers to access control technologies used by hardware manufacturers.
label: DRM Unterstützung @de
range: boolean
sub property of: datatypeProductOrServiceProperty
belongs to module: MP3Player

Scene mode
type: Class
comment: A projection of information from any physical environment into any sensory system.
label: Szenenmodus @de
subclass of: QualitativeValue
belongs to module: Camcorder

Sandisk
type: BusinessEntity
comment: The business entity SanDisk Corporation.
legal name: SanDisk Corporation
belongs to module: MP3Player

Picture in Picture
type: Video Features
comment: Picture in Picture (PiP) is a feature of some television receivers and similar devices. One program (channel) is displayed on the full TV screen at the same time as one or more other programs are displayed in inset windows. Sound is usually from the main program only. (This description is partly based on or reuses content from the Wikipedia article "Picture in picture" (http://en.wikipedia.org/wiki/Picture-in-picture) and is licensed under the GNU Free Documentation License (http://www.gnu.org/copyleft/fdl.html).)
label: Bild in Bild Funktion @de
belongs to module: TV

Media type
type: Class
comment: The type of paper a device is able to handle.
label: Mediumart
subclass of: QualitativeValue
belongs to module: Printer

Panasonic
type: BusinessEntity
comment: The business entity Panasonic Corporation.
legal name: Panasonic Corporation
belongs to module: MP3Player, TV, Printer, DigitalCamera, Camcorder

AVCH
type: Data Format Video
comment: A high-definition and standard-definition recording format for use in digital tapeless camcorders. The format is comparable to other handheld video camera recording formats, particularly HDV and TOD. (This description is partly based on or reuses content from the Wikipedia article "HDV" (http://en.wikipedia.org/wiki/HDV) and is licensed under the GNU Free Documentation License (http://www.gnu.org/copyleft/fdl.html).)
belongs to module: Camcorder

color balance
type: DatatypeProperty
comment: In photography and image processing, color balance is the global adjustment of the intensities of the colors (typically red, green, and blue primary colors). (This description is partly based on or reuses content from the Wikipedia article "White balance" (http://en.wikipedia.org/wiki/White_balance) and is licensed under the GNU Free Documentation License (http://www.gnu.org/copyleft/fdl.html).)
label: Farbabgleich @de
range: boolean
sub property of: datatypeProductOrServiceProperty
belongs to module: DigitalCamera

Beige
type: Color
comment: RGB Value 245,245,220
belongs to module: MP3Player, TV, Printer, DigitalCamera, Camcorder

White
type: Color
comment: RGB Value 255,255,255
label: Weiß @de
belongs to module: MP3Player, TV, Printer, DigitalCamera, Camcorder

DV
type: Data Format Video
comment: Digital Video (DV) is a digital video format created by Sony, JVC, Panasonic and other video camera producers, and launched in 1995. The DV specification (originally known as the Blue Book, current official name IEC 61834) defines both the codec and the tape format. (This description is partly based on or reuses content from the Wikipedia article "DV" (http://en.wikipedia.org/wiki/DV) and is licensed under the GNU Free Documentation License (http://www.gnu.org/copyleft/fdl.html).)
belongs to module: DigitalCamera, Camcorder

Digital camera
type: Class
comment: A digital camera (or digicam for short) is a camera that takes video or still photographs, or both, digitally by recording images via an electronic image sensor. (This description is partly based on or reuses content from the Wikipedia article "Digital camera" (http://en.wikipedia.org/wiki/Digital_camera) and is licensed under the GNU Free Documentation License (http://www.gnu.org/copyleft/fdl.html).)
label: Digitalkamera @de
subclass of: ProductOrService
belongs to module: DigitalCamera

Bluetooth audio
type: Audio Interface Type
comment: Bluetooth is a wireless protocol utilizing short-range communications technology facilitating data transmission over short distances from fixed and mobile devices, creating wireless personal area networks (refers to audio).
label: Bluetooth Audio @de
belongs to module: MP3Player

B5
type: Media format
comment: Format of the german institute for standardization: 176 x 250 mm.
belongs to module: Printer

S-Video in
type: Data Interface Type
comment: Is an analog video signal that carries the video data as two separate signals, lumen (luminance) and chroma (color). (This description is partly based on or reuses content from the Wikipedia article "S-Video" (http://en.wikipedia.org/wiki/S-Video) and is licensed under the GNU Free Documentation License (http://www.gnu.org/copyleft/fdl.html).)
belongs to module: TV, Camcorder

S-Video out
type: Data Interface Type
comment: Is an analog video signal that carries the video data as two separate signals, lumen (luminance) and chroma (color). (This description is partly based on or reuses content from the Wikipedia article "S-Video" (http://en.wikipedia.org/wiki/S-Video) and is licensed under the GNU Free Documentation License (http://www.gnu.org/copyleft/fdl.html).)
belongs to module: Camcorder

TV Tuner
type: ObjectProperty
comment: Defines the type of included TV tuner.
domain: TV
range: TV Tuner
sub property of: qualitativeProductOrServiceProperty
belongs to module: TV

Lexar
type: BusinessEntity
comment: The business entity Lexar Media, Inc.
legal name: Lexar Media, Inc.
belongs to module: MP3Player

BenQ
type: BusinessEntity
comment: The business entity BenQ Corporation.
legal name: BenQ Corporation
belongs to module: MP3Player, TV, DigitalCamera

Timer
type: General Features
comment: A timer is a specialized type of clock counting backwards to a predefined end. (This description is partly based on or reuses content from the Wikipedia article "Timer" (http://en.wikipedia.org/wiki/Timer) and is licensed under the GNU Free Documentation License (http://www.gnu.org/copyleft/fdl.html).)
label: Zeitgeber @de
belongs to module: TV

TRS connector
type: Connectivity
comment: A TRS connector (tip, ring, sleeve) also called an audio jack, phone plug, jack plug, stereo plug, mini-jack, or mini-stereo, is a common audio connector. It is cylindrical in shape, typically with three contacts, although sometimes with two (a TS connector) or four (a TRRS connector). (This description is partly based on or reuses content from the Wikipedia article "TRS connector" (http://en.wikipedia.org/wiki/TRS_connector) and is licensed under the GNU Free Documentation License (http://www.gnu.org/copyleft/fdl.html).)
label: TRS Verbindungsstecker @de
belongs to module: TV

MemoryStick
type: Storage Media
comment: Memory Stick is a removable flash memory card format.
belongs to module: MP3Player, DigitalCamera, Camcorder

print border top
type: ObjectProperty
comment: Defines the area which can not be printed on the top side of a paper (A4) (Common unit of measurement millimetre, MMT).
label: Druckgrenze oben @de
range: QuantitativeValueFloat
sub property of: quantitativeProductOrServiceProperty
belongs to module: Printer

Photo mode
type: Scene mode
comment: Ability of the camcorder to adapt to special environments.
label: Photo modus @de
belongs to module: Camcorder

Internal flash memory
type: Storage Media
comment: Flash memory is non-volatile computer memory that can be electrically erased and reprogrammed.
label: Interner Flashspeicher @de
belongs to module: MP3Player, DigitalCamera, Camcorder

SVG
type: Data Format Image
comment: SVG (Scalable Vector Graphics) is an open standard created and developed by the World Wide Web Consortium to address the need (and attempts of several corporations) for a versatile, scriptable and all-purpose vector format for the web and otherwise. (This description is partly based on or reuses content from the Wikipedia article "Vector graphics" (http://en.wikipedia.org/wiki/Vector_graphics) and is licensed under the GNU Free Documentation License (http://www.gnu.org/copyleft/fdl.html).)
belongs to module: MP3Player, , DigitalCamera, Camcorder

Label
type: Media type
comment: Media type that can be printed on one side and has a glued area on the other side.
label: Etikett @de
belongs to module: Printer

Iiyama
type: BusinessEntity
comment: The business entity Iiyama.
legal name: Iiyama
belongs to module: TV

New Universe
type: BusinessEntity
comment: The business entity New Universe B.V.
legal name: New Universe B.V.
belongs to module: MP3Player, TV

white balance
type: ObjectProperty
comment: Defines the global adjustment of the intensities of the colors.
label: Weißabgleich @de
range: White balance
sub property of: qualitativeProductOrServiceProperty
belongs to module: Camcorder

MPIO
type: BusinessEntity
comment: The business entity MPIO Inc.
legal name: MPIO Inc.
belongs to module: MP3Player

Dane-Elec
type: BusinessEntity
comment: The business entity Dane-Elec GmbH.
legal name: Dane-Elec GmbH
belongs to module: MP3Player

Oki
type: BusinessEntity
comment: The business entity Oki.
legal name: Oki Electric Industry Co., Ltd.
belongs to module: TV, Printer

Hannspree
type: BusinessEntity
comment: The business entity Hannspree.
legal name: Hannspree Inc.
belongs to module: TV

Digital Image Scaling Technology
type: Video Features
comment: Seamlessly up-scales any video source to display at full high definition 1080p.
belongs to module: TV

sensor type
type: ObjectProperty
comment: Defines type of device that measures a physical quantity and converts it into a signal which can be read by an observer or by an instrument.
label: Sensorart @de
range: Sensor type
sub property of: qualitativeProductOrServiceProperty
belongs to module: Camcorder

Aigo
type: BusinessEntity
comment: The business entity Beijing Huaqi Information Digital Technology Co., Ltd.
legal name: Beijing Huaqi Information Digital Technology Co., Ltd.
belongs to module: MP3Player

aspect ratio horizontal
type: DatatypeProperty
comment: The aspect ratio of a shape is the ratio of its longer dimension to its shorter dimension. The vertical dimension is the longer one. (This description is partly based on or reuses content from the Wikipedia article "Aspect ratio" (http://en.wikipedia.org/wiki/Aspect_ratio) and is licensed under the GNU Free Documentation License (http://www.gnu.org/copyleft/fdl.html).)
label: horizontales Bildseitenverhältnis @de
range: float
sub property of: datatypeProductOrServiceProperty
belongs to module: TV

Tuner type
type: Class
comment: Type of TV tuner that is used to convert RF television transmissions into audio and video signals. (This description is partly based on or reuses content from the Wikipedia article "Tuner (electronics)" (http://en.wikipedia.org/wiki/Tuner_(electronics)) and is licensed under the GNU Free Documentation License (http://www.gnu.org/copyleft/fdl.html).)
label: Tuner Typ @de
subclass of: TV Tuner
belongs to module: TV

focal length
type: ObjectProperty
comment: Defines a measure of how strongly it converges (focuses) or diverges (diffuses) light. (This description is partly based on or reuses content from the Wikipedia article "Focal length" (http://en.wikipedia.org/wiki/Focal_length) and is licensed under the GNU Free Documentation License (http://www.gnu.org/copyleft/fdl.html).)
label: Brennweite @de
range: QuantitativeValueFloat
sub property of: quantitativeProductOrServiceProperty
belongs to module: Camcorder

min media weight
type: ObjectProperty
comment: Describes the minimum weight of the media format (Common unit of measurement gram per square metre, GM).
label: minimales Mediengewicht @de
range: QuantitativeValueFloat
sub property of: quantitativeProductOrServiceProperty
belongs to module: Printer

Duplex print
type: Features
comment: A feature of computer printers and MFPs that allows the automatic printing of a sheet of paper on both sides.
label: Duplexdruck @de
belongs to module: Printer

Fujifilm
type: BusinessEntity
comment: The business entity Fujifilm Holdings Corporation.
legal name: Fujifilm Holdings Corporation
belongs to module: DigitalCamera

CEO: Consumer Electronics Ontology - An Ontology for Consumer Electronics Products and Services
type: Ontology
comment: The CEO: Consumer Electronics Ontology is a vocabulary for describing typical consumer electronics products and services and their features, e.g. digital cameras, camcorders, etc. It can be used in combination with GoodRelations, http://purl.org/goodrelations/ for making your e-commerce offerings available in the new Web of Data. Several descriptions of conceptual elements in this ontology are partly based on or reuse content from respective Wikipedia articles in the English Wikipedia http://en.wikipedia.org/wiki/. Thus, this ontology is also licensed under the GNU Free Documentation License, http://www.gnu.org/copyleft/fdl.html.
creator: Xaver Brandl, Christian Deckert, Felix Frommer, Daniel Karl, Daniel Koslowski, Daniel Schley, David Sonntag, Andreas Wechselberger, and Martin Hepp
rights: http://creativecommons.org/licenses/by/3.0/
subject: E-Commerce, E-Business, GoodRelations, Ontology, MP3 player, TV, Printer, DigitalCamera, Camcorder
imports: v1

HDTV 720p
type: TV display resolution
comment: 720p is the shorthand name for a category of HDTV video modes. The number 720 stands for the 720 vertical scan lines of display resolution (also known as 720 pixels of vertical resolution), while the letter p stands for progressive scan or non-interlaced. (This description is partly based on or reuses content from the Wikipedia article "720p" (http://en.wikipedia.org/wiki/720p) and is licensed under the GNU Free Documentation License (http://www.gnu.org/copyleft/fdl.html).)
belongs to module: TV

AIPTEK
type: BusinessEntity
comment: The business entity AIPTEK, Inc.
legal name: AIPTEK, Inc.
belongs to module: DigitalCamera, Camcorder

B0
type: Media format
comment: Format of the german institute for standardization: 1000 x 1414 mm.
belongs to module: Printer

touch screen
type: DatatypeProperty
comment: Defines the ability to operate an object by touching its screen.
label: Sensorbildschirm @de
range: boolean
sub property of: datatypeProductOrServiceProperty
belongs to module: MP3Player, Printer, DigitalCamera, Camcorder

cardstock
type: Media type
comment: A paper stock that is thicker and more durable than normal writing or printing paper, but thinner and more flexible than other forms of paperboard. (This description is partly based on or reuses content from the Wikipedia article "Cardstock" (http://en.wikipedia.org/wiki/Card_stock) and is licensed under the GNU Free Documentation License (http://www.gnu.org/copyleft/fdl.html).)
label: Fotokarton @de
belongs to module: Printer

optical zoom
type: DatatypeProperty
comment: Defines a method of decreasing (narrowing) the apparent angle of view of a digital photographic or video image with a higher optical resolution than the digital zoom.
label: optischer Zoom @de
range: boolean
sub property of: datatypeProductOrServiceProperty
belongs to module: DigitalCamera

Sitecom
type: BusinessEntity
comment: The business entity Sitecom
legal name: Sitecom
belongs to module: MP3Player

General Features
type: Class
comment: Additional general equipment and abilities.
label: Allgemeine Eigenschaften @de
subclass of: Features
belongs to module: TV

PowerPC 32 bit
type: Processor type
comment: A RISC instruction set architecture created by the 1991 Apple-IBM-Motorola alliance, known as AIM. Originally intended for personal computers, PowerPC CPUs have since become popular embedded and high-performance processors.
belongs to module: Printer

Headphone line out 2.5mm
type: Connectivity
comment: Port to connect headphones with an electronical device. Here the port has the diameter of 2,5 millimetres.
label: Kopfhörerausgang 2.5 mm @de
belongs to module: TV

Brown
type: Color
comment: RGB Value 165,42,42
label: Braun @de
belongs to module: MP3Player, TV, Printer, DigitalCamera, Camcorder

White balance
type: Class
comment: Is the global adjustment of the intensities of the colors (typically red, green, and blue primary colors). An important goal of this adjustment is to render specific colors - particularly neutral colors - correctly; hence, the general method is sometimes called gray balance, neutral balance, or white balance. (This description is partly based on or reuses content from the Wikipedia article "White Balance" (http://en.wikipedia.org/wiki/White_Balance) and is licensed under the GNU Free Documentation License (http://www.gnu.org/copyleft/fdl.html).)
label: Weißabgleich @de
subclass of: QualitativeValue
belongs to module: Camcorder

Canyon
type: BusinessEntity
comment: The business entity Canyon.
legal name: Canyon
belongs to module: MP3Player

frequency range
type: ObjectProperty
comment: Defines the range of supported frequency signals (Common unit of measurement megahertz, MHZ).
label: Frequenzberich @de
range: QuantitativeValueFloat
sub property of: quantitativeProductOrServiceProperty
belongs to module: MP3Player

number of display colors
type: ObjectProperty
comment: Defines the number of colors an electronical device is able to display on a screen.
label: Anzahl von Bildschirmfarben @de
range: QuantitativeValueInteger
sub property of: quantitativeProductOrServiceProperty
belongs to module: MP3Player, TV, Printer, DigitalCamera, Camcorder

Headphones
type: Accessory
comment: A pair of small loudspeakers, or less commonly a single speaker, with a way of holding them close to a user's ears and a means of connecting them to a signal source such as an audio amplifier, radio or CD player.
label: Kopfhörer @de
belongs to module: Camcorder

Griffin
type: BusinessEntity
comment: The business entity Griffin Technology.
legal name: Griffin Technology
belongs to module: MP3Player

Guillemot
type: BusinessEntity
comment: The business entity Guillemot Corporation.
legal name: Guillemot Corporation
belongs to module: MP3Player

Medion
type: BusinessEntity
comment: The business entity Medion AG.
legal name: Medion AG
belongs to module: MP3Player, TV

belongsToModule
type: AnnotationProperty
comment: Describes to which product categories the property or concept belongs (comma seperated, e.g. "MP3Player, TV").

On off timer
type: General Features
comment: Describes the possibility to maintain a designated time when the television or electrical device should be switched off or on automatically.
label: Ein- und Ausschalttimer @de
belongs to module: TV

internal memory capacity
type: ObjectProperty
comment: Defines the capacity to store data on internal memory (Common unit of measurement Megabyte, 4L).
label: interner Speicherplatz @de
range: QuantitativeValueFloat
sub property of: quantitativeProductOrServiceProperty
belongs to module: MP3Player, Printer, DigitalCamera, Camcorder

A9
type: Media format
comment: Format of the german institute for standardization: 37 x 52 mm.
belongs to module: Printer

flash
type: DatatypeProperty
comment: Device for instantaneous illumination for picture taking.
label: Blitz @de
range: boolean
sub property of: datatypeProductOrServiceProperty
belongs to module: DigitalCamera

max media weight
type: ObjectProperty
comment: Describes the maximum weight of the media format (Common unit of measurement gram per square metre, GM).
label: maximales Mediengewicht @de
range: QuantitativeValueFloat
sub property of: quantitativeProductOrServiceProperty
belongs to module: Printer

CGM
type: Data Format Image
comment: CGM (Computer Graphics Metafile) is a file format for 2D vector graphics, raster graphics, and text, and is defined by ISO/IEC 8632. (This description is partly based on or reuses content from the Wikipedia article "Computer Graphics Metafile" (http://en.wikipedia.org/wiki/Computer_Graphics_Metafile) and is licensed under the GNU Free Documentation License (http://www.gnu.org/copyleft/fdl.html).)
belongs to module: MP3Player, DigitalCamera, Camcorder

Trekstor
type: BusinessEntity
comment: The business entity TrekStore GmbH & Co. KG
legal name: TrekStor GmbH & Co. KG
belongs to module: MP3Player

Seiko
type: BusinessEntity
comment: The business entity Seiko.
legal name: Seiko Holdings Corporation
belongs to module: Printer

number of HDMI ports
type: ObjectProperty
comment: Number of compact audio/video interface ports for transmitting uncompressed digital data.
label: Anzahl HDMI Anschlussmöglichkeiten @de
range: QuantitativeValueInteger
sub property of: quantitativeProductOrServiceProperty
belongs to module: Camcorder

Audio Features
type: Class
comment: Additional audio equipment and abilities.
label: Audio Eigenschaften @de
subclass of: Features
belongs to module: TV

weight
type: ObjectProperty
comment: Defines the measurement of the gravitational force acting on an object (Common unit of measurement gramm, GRM).
label: Gewicht @de
range: QuantitativeValueFloat
sub property of: quantitativeProductOrServiceProperty
belongs to module: MP3Player, TV, Printer, DigitalCamera, Camcorder

Logitech
type: BusinessEntity
comment: The business entity Logitech International S.A.
legal name: Logitech International S.A.
belongs to module: DigitalCamera

Windows XP
type: Compatible Operating Systems
comment: A version of a Microsoft operating system.
belongs to module: MP3Player, Printer, DigitalCamera, Camcorder

DL
type: Media format
comment: Format of the german institute for standardization: 110 x 220 mm.
belongs to module: Printer

TwinMOS
type: BusinessEntity
comment: The business entity TwinMOS Technologies Inc
legal name: TwinMOS Technologies Inc
belongs to module: MP3Player

display type
type: ObjectProperty
comment: Defines the type of the display like LCD or Plasma.
label: Bildschirmtyp @de
range: Display Type
sub property of: qualitativeProductOrServiceProperty
belongs to module: MP3Player, TV, Printer, Camcorder

Freecom
type: BusinessEntity
comment: The business entity Freecom Technologies GmbH.
legal name: Freecom Technologies GmbH
belongs to module: MP3Player

Progressive Scan
type: Video Features
comment: Progressive or noninterlaced scanning is a method for displaying, storing or transmitting moving images in which all the lines of each frame are drawn in sequence. (This description is partly based on or reuses content from the Wikipedia article "Progressive scan" (http://en.wikipedia.org/wiki/Progressive_scan) and is licensed under the GNU Free Documentation License (http://www.gnu.org/copyleft/fdl.html).)
belongs to module: TV

Snapshot
type: Features
comment: Is a shot that is aimed and fired very quickly at a target that appears suddenly and for a very short period of time.
belongs to module: Camcorder

max color print speed draft
type: ObjectProperty
comment: Amount of pages per minute the product is able to print in the mode of color-printig of drafts.
label: maximale Druckgeschwindigkeit Farbe Entwurf @de
range: QuantitativeValueFloat
sub property of: quantitativeProductOrServiceProperty
belongs to module: Printer

Eaconn
type: BusinessEntity
comment: The business entity EACONN B.V.
legal name: EACONN B.V.
belongs to module: MP3Player

maximale memory capacity
type: ObjectProperty
comment: Defines the maxium capacity that can be provided by using external memory (Common unit of measurement megabyte, 4L).
label: maximale Speicherkapazität @de
range: QuantitativeValueFloat
sub property of: quantitativeProductOrServiceProperty
belongs to module: MP3Player, DigitalCamera, Camcorder

Print resolution
type: Class
comment: Defines the maximum digital resolution the device is able to print.
label: Druckauflösung @de
subclass of: Unterstützte Auflösung
belongs to module: Printer

number of component video ports
type: DatatypeProperty
comment: Defines the number of component video ports a device offers.
label: Anzahl an Component Vido Ports @de
range: int
sub property of: datatypeProductOrServiceProperty
belongs to module: Camcorder

Noise reduction
type: Audio Features
comment: Noise reduction is the process of removing noise from a signal.
label: Geräuschunterdrückung @de
belongs to module: TV

min operating temperature
type: ObjectProperty
comment: Defines the minimum temperature the product is able to operate (Common unit of measurement grad celsius, CEL).
label: minimale Betriebstemperatur @de
range: QuantitativeValueFloat
sub property of: quantitativeProductOrServiceProperty
belongs to module: TV, Printer

CTX
type: BusinessEntity
comment: The business entity CTX.
legal name: CTX Technology Corporation
belongs to module: TV

Integrated clock
type: General Features
comment: Clock integrated in a device.
label: Integrierte Uhr @de
belongs to module: TV

Digital
type: Tuner type
comment: A digital system uses discrete (discontinuous) values, usually but not always symbolized numerically (hence called "digital") to represent information for input, processing, transmission, storage. (This description is partly based on or reuses content from the Wikipedia article "Digital" (http://en.wikipedia.org/wiki/Digital) and is licensed under the GNU Free Documentation License (http://www.gnu.org/copyleft/fdl.html).)
belongs to module: TV

Mac OS X Leopard
type: Compatible Operating Systems
comment: Mac OS is the trademarked name for a series of graphical user interface-based operating systems developed by Apple Inc. for their Macintosh line of computer systems.
belongs to module: MP3Player, Printer, DigitalCamera, Camcorder

standard output capacity
type: ObjectProperty
comment: Number of sheets the product can hold in all available output trays as a standard.
label: Standard Ausgabkapazität @de
range: QuantitativeValueInteger
sub property of: quantitativeProductOrServiceProperty

Sanyo
type: BusinessEntity
comment: The business entity Sanyo.
legal name: SANYO Electric Co., Ltd.
belongs to module: TV, DigitalCamera, Camcorder

Screen format adjustments
type: Video Features
comment: Includes the possibility to switch between different screen formats.
label: Bildschirmformatanpassung @de
belongs to module: TV

Photo paper
type: Media type
comment: Kind of paper that is specifically designed to print high quality digital photos.
label: Fotopapier @de
belongs to module: Printer

Color
type: Class
comment: Color derives from the spectrum of light interacting in the eye with the spectral sensitivities of the light receptors. (This description is partly based on or reuses content from the Wikipedia article "Color" (http://en.wikipedia.org/wiki/Color) and is licensed under the GNU Free Documentation License (http://www.gnu.org/copyleft/fdl.html).)
label: Farbe @de
subclass of: QualitativeValue
belongs to module: MP3Player, TV, Printer, DigitalCamera, Camcorder

USB 2.0
type: Data Interface Type
comment: Maximum speed of 480 Mbit/s.
belongs to module: MP3Player, TV, Printer, DigitalCamera, Camcorder

EDTV 480p
type: TV display resolution
comment: 480p is the shorthand name for a video display resolution. The p stands for progressive scan, i.e. non-interlaced. The 480 denotes a vertical resolution of 480 vertically scanning lines, usually with a horizontal resolution of 640 pixels and 4:3 aspect ratio or a horizontal resolution of 854 pixels and 16:9 aspect ratio. (This description is partly based on or reuses content from the Wikipedia article "480p" (http://en.wikipedia.org/wiki/480p) and is licensed under the GNU Free Documentation License (http://www.gnu.org/copyleft/fdl.html).)
belongs to module: TV

picture resolution
type: ObjectProperty
comment: Defines the digital resolution of the pictures (Common unit of measurement pixel, E37).
label: Fotoauflösung @de
range: QuantitativeValueFloat
sub property of: quantitativeProductOrServiceProperty
belongs to module: DigitalCamera, Camcorder

PDP
type: Display Type
comment: A plasma display panel (PDP) is a type of flat panel display common to large TV displays (37in. [940mm]). Many tiny cells between two panels of glass hold an inert mixture of noble gases. The gas in the cells is electrically turned into a plasma which then excites phosphors to emit light. (This description is partly based on or reuses content from the Wikipedia article "Digital newspaper technology - Plasma" (http://en.wikipedia.org/wiki/Digital_newspaper_technology#Plasma) and is licensed under the GNU Free Documentation License (http://www.gnu.org/copyleft/fdl.html).)

DVB
type: Signal format
comment: Digital Video Broadcasting (DVB) is a suite of internationally accepted open standards for digital television. DVB systems distribute data using a variety of approaches, including by satellite (DVB-S, DVB-S2 and DVB-SH; also DVB-SMATV for distribution via SMATV); cable (DVB-C); terrestrial television (DVB-T, DVB-T2) and digital terrestrial television for handhelds (DVB-H,DVB-SH); and via microwave using DTT (DVB-MT), the MMDS (DVB-MC), and/or MVDS standards (DVB-MS). (This description is partly based on or reuses content from the Wikipedia article "Digital Video Broadcasting" (http://en.wikipedia.org/wiki/Digital_Video_Broadcasting) and is licensed under the GNU Free Documentation License (http://www.gnu.org/copyleft/fdl.html).)
belongs to module: TV

Viewfinder optical
type: Viewfinder
comment: An optical viewfinder is simply a reversed telescope mounted to see what the camera will see. (This description is partly based on or reuses content from the Wikipedia article "Viewfinder" (http://en.wikipedia.org/wiki/Viewfinder) and is licensed under the GNU Free Documentation License (http://www.gnu.org/copyleft/fdl.html).)
label: Optischer Bildsucher @de
belongs to module: DigitalCamera

optical sensor size
type: ObjectProperty
comment: Size of the device that measures a physical quantity and converts it into a signal which can be read by an observer or by an instrument (common unit of measurement: inch; INH).
label: optischer Sensorgröße @de
range: QuantitativeValueFloat
sub property of: quantitativeProductOrServiceProperty
belongs to module: Camcorder

USB
type: Class
comment: Universal Serial Bus (USB) is a serial bus standard to connect devices to a host computer. (This description is partly based on or reuses content from the Wikipedia article "Universal Serial Bus" (http://en.wikipedia.org/wiki/Universal_Serial_Bus) and is licensed under the GNU Free Documentation License (http://www.gnu.org/copyleft/fdl.html).)
subclass of: Energy Source
belongs to module: MP3Player, Printer, DigitalCamera, Camcorder

Portrait
type: Scene mode
comment: Ability of the camcorder to adapt to special environments.
belongs to module: Camcorder

contrast ratio
type: DatatypeProperty
comment: The contrast ratio is a measure of a display system, defined as the ratio of the luminance of the brightest color (white) to that of the darkest color (black) that the system is capable of producing. (This description is partly based on or reuses content from the Wikipedia article "Contrast ratio" (http://en.wikipedia.org/wiki/Contrast_ratio) and is licensed under the GNU Free Documentation License (http://www.gnu.org/copyleft/fdl.html).)
label: Kontrastverhältnis @de
range: string
sub property of: datatypeProductOrServiceProperty
belongs to module: TV

Computer display resolution 1024x768 60 70 75 85Hz
type: Computer display resolution
comment: Display resolution specified as the width and height in pixels, color depth measured in bits, and refresh rate expressed in hertz; here Extended Graphics Array. (This description is partly based on or reuses content from the Wikipedia article "Display resolution" (http://en.wikipedia.org/wiki/Display_resolution) and is licensed under the GNU Free Documentation License (http://www.gnu.org/copyleft/fdl.html).)
label: Computerbildschirmauflösung 1024x768 60 70 75 85Hz @de
belongs to module: TV

Mirai
type: BusinessEntity
comment: The business entity Mirai.
legal name: Mirai
belongs to module: TV

PSD
type: Data Format Image
comment: The .PSD (Photoshop Document) format stores an image with support for most imaging options available in Photoshop. These include layers with masks, color spaces, ICC profiles, transparency, text, alpha channels and spot colors, clipping paths, and duotone settings. (This description is partly based on or reuses content from the Wikipedia article "Adobe Photoshop" (http://en.wikipedia.org/wiki/Adobe_Photoshop) and is licensed under the GNU Free Documentation License (http://www.gnu.org/copyleft/fdl.html).)
belongs to module: MP3Player, DigitalCamera, Camcorder

Olivetti
type: BusinessEntity
comment: The business entity Olivetti.
legal name: Olivetti Tecnost
belongs to module: Printer

Headphone line out 3,5 mm
type: Connectivity
comment: Port to connect headphones with an electronical device. Here the port has the diameter of 3,5 millimetres.
label: Kopfhörerausgang 3,5 mm @de
belongs to module: TV

Aiwa
type: BusinessEntity
comment: The business entity Sony Corporation.
legal name: Sony Corporation
belongs to module: MP3Player

A4
type: Media format
comment: Format of the german institute for standardization: 210 x 297 mm.
belongs to module: Printer

AAC-LC
type: Data Format Audio
comment: Advanced Audio Coding (AAC) is a standardized, lossy compression and encoding scheme for digital audio. (This description is partly based on or reuses content from the Wikipedia article "Advanced Audio Coding" (http://en.wikipedia.org/wiki/Advanced_Audio_Coding) and is licensed under the GNU Free Documentation License (http://www.gnu.org/copyleft/fdl.html).)
belongs to module: MP3Player, DigitalCamera, Camcorder

print border bottom
type: ObjectProperty
comment: Defines the area which can not be printed on the bottom side of a paper (A4) (Common unit of measurement millimetre, MMT).
label: Druckgrenze unten @de
range: QuantitativeValueFloat
sub property of: quantitativeProductOrServiceProperty
belongs to module: Printer

H.264
type: Data Format Video
comment: H.264 is a standard for video compression, and is equivalent to MPEG-4 Part 10, or MPEG-4 AVC (for Advanced Video Coding). As of 2008, it is the latest block-oriented motion-compensation-based codec standard developed by the ITU-T Video Coding Experts Group (VCEG) together with the ISO/IEC Moving Picture Experts Group (MPEG), and it was the product of a partnership effort known as the Joint Video Team (JVT). (This description is partly based on or reuses content from the Wikipedia article "H.264" (http://en.wikipedia.org/wiki/H.264) and is licensed under the GNU Free Documentation License (http://www.gnu.org/copyleft/fdl.html).)
belongs to module: MP3Player, DigitalCamera, Camcorder

Apple
type: BusinessEntity
comment: The business entity Apple, Inc.
legal name: Apple Inc.
belongs to module: MP3Player

Mac OS X Puma
type: Compatible Operating Systems
comment: Mac OS is the trademarked name for a series of graphical user interface-based operating systems developed by Apple Inc. for their Macintosh line of computer systems.
belongs to module: MP3Player, Printer, DigitalCamera, Camcorder

WMV
type: Data Format Video
comment: A compressed video file format for several proprietary codecs developed by Microsoft.
belongs to module: MP3Player, DigitalCamera, Camcorder

number of print cartridges
type: ObjectProperty
comment: Number of replaceable components of a printer that contains the ink that is spread on paper during printing.
label: Anzahl von Druckerkassetten @de
range: QuantitativeValueInteger
sub property of: quantitativeProductOrServiceProperty
belongs to module: Printer

Windows 2000
type: Compatible Operating Systems
comment: A version of a Microsoft operating system.
belongs to module: MP3Player, Printer, DigitalCamera, Camcorder

package height
type: ObjectProperty
comment: Defines the measurement of vertical distance of an object with its package (Common unit of measurement centimetre, CMT).
label: Verpackungshöhe @de
range: QuantitativeValueFloat
sub property of: quantitativeProductOrServiceProperty
belongs to module: TV

max black white print speed best quality
type: ObjectProperty
comment: Amount of pages per minute the product is able to print in the mode of black-printig best quality.
label: maximale Druckgeschwindigkeit Schwarz/Weiß beste Qualität @de
range: QuantitativeValueFloat
sub property of: quantitativeProductOrServiceProperty
belongs to module: Printer

Coby
type: BusinessEntity
comment: The business entity Coby Electronics Corporation.
legal name: Coby Electronics Corporation
belongs to module: MP3Player, TV

Decktron
type: BusinessEntity
comment: The business entity Decktron Europe GmbH.
legal name: Decktron Europe GmbH
belongs to module: MP3Player

display
type: DatatypeProperty
comment: Defines if object includes a screen.
label: Bildschirm @de
range: boolean
sub property of: datatypeProductOrServiceProperty
belongs to module: MP3Player, Printer, DigitalCamera, Camcorder

Humax
type: BusinessEntity
comment: The business entity Humax.
legal name: HUMAX Electronics Co Ltd.
belongs to module: TV

red eye reduction
type: DatatypeProperty
comment: The red-eye effect in photography is the common appearance of red pupils in color photographs of eyes. The red-eye reduction feature reduces the red-eye effect.
label: Rote-Augen-Effekt Reduktion @de
range: boolean
sub property of: datatypeProductOrServiceProperty
belongs to module: DigitalCamera

Multicolor
type: Display Type
comment: Ability to display more than two different kinds of color.
label: Mehrfarbig @de
belongs to module: MP3Player

Eizo
type: BusinessEntity
comment: The business entity Eizo.
legal name: Eizo Nano Technologies Inc.
belongs to module: TV

Zoom digital
type: Zoom
comment: Zoom is a method of decreasing (narrowing) the apparent angle of view of a photographic or video image. (This description is partly based on or reuses content from the Wikipedia article "Digital zoom" (http://en.wikipedia.org/wiki/Digital_zoom) and is licensed under the GNU Free Documentation License (http://www.gnu.org/copyleft/fdl.html).)
label: Digitaler Zoom @de
belongs to module: DigitalCamera

data interface type
type: ObjectProperty
comment: Defines the type of interfaces used to exchange data.
label: Datenschnittstellentyp @de
range: Data Interface Type
sub property of: qualitativeProductOrServiceProperty
belongs to module: MP3Player, DigitalCamera, Camcorder

B7
type: Media format
comment: Format of the german institute for standardization: 88 x 125 mm.
belongs to module: Printer

AV
type: Connectivity
comment: Audio connectors and video connectors are electrical connectors for carrying an audio signal or video signal, either in an analog or digital format. Analog A/V connectors often use shielded cable to inhibit RF interference and noise. (This description is partly based on or reuses content from the Wikipedia article "Audio and video connector" (http://en.wikipedia.org/wiki/Audio_and_video_connector) and is licensed under the GNU Free Documentation License (http://www.gnu.org/copyleft/fdl.html).)
belongs to module: TV

MMC
type: Storage Media
comment: A solid state disk or flash memory data storage device.
belongs to module: MP3Player, DigitalCamera, Camcorder

Kye Genius
type: BusinessEntity
comment: The business entity Genius, KYE Systems Corp.
legal name: Genius, KYE Systems Corp.
belongs to module: MP3Player, Camcorder

connectivity
type: ObjectProperty
comment: Defines the possibilities to connect different kinds of electronical devices.
label: Verbindungsmöglichkeit @de
range: Connectivity
sub property of: qualitativeProductOrServiceProperty
belongs to module: TV

Olive
type: Color
comment: RGB Value 128,128,0
label: Olivgrün @de
belongs to module: MP3Player, TV, Printer, DigitalCamera, Camcorder

audio output power
type: ObjectProperty
comment: Defines the rate of energy conversion (Common unit of Measurement milliwatt, C31).
label: Audioausgangsleistung @de
sub property of: output power
belongs to module: TV

normal printable resolution black white vertical
type: ObjectProperty
comment: Defines the digital resolution of the vertical axe (Common unit of measurement pixel, E37) for black/white prints for normal prints.
label: vertikale druckbare Auflösung Schwarz/Weiß normal @de
range: QuantitativeValueInteger
sub property of: quantitativeProductOrServiceProperty
belongs to module: Printer

Li-ion Polymer
type: Rechargeable Energy Source
comment: Lithium polymer batteries (abbreviated Li-poly, Li-Pol, LiPo, LIP, PLI or LiP) are rechargeable batteries which have technologically evolved from lithium-ion batteries. (This description is partly based on or reuses content from the Wikipedia article "Lithium-polymer" (http://en.wikipedia.org/wiki/Lithium-polymer) and is licensed under the GNU Free Documentation License (http://www.gnu.org/copyleft/fdl.html).)
belongs to module: MP3Player, DigitalCamera, Camcorder

Backlight mode
type: Features
comment: Ability to photograph against a light source.
label: Hintergrundbeleuchtungsmodus @de
belongs to module: DigitalCamera, Camcorder

duration to print first page
type: ObjectProperty
comment: Amount of time the printer needs to start printing the first page.
label: Zeitspanne bis Druck erster Seite @de
range: QuantitativeValueFloat
sub property of: quantitativeProductOrServiceProperty
belongs to module: Printer

light exposure control
type: DatatypeProperty
comment: Defines the total amount of light allowed to fall on the photographic medium (photographic film or image sensor) during the process of taking a photograph.
label: Belichtungsregelung @de
range: boolean
sub property of: datatypeProductOrServiceProperty
belongs to module: Camcorder

normal printable resolution black white horizontal
type: ObjectProperty
comment: Defines the digital resolution of the horizontal axe (Common unit of measurement pixel, E37) for black/white prints for normal prints.
label: horizontale druckbare Auflösung Schwarz/Weiß normal @de
range: QuantitativeValueInteger
sub property of: quantitativeProductOrServiceProperty
belongs to module: Printer

Grundig
type: BusinessEntity
comment: The business entity GRUNDIG Intermedia GmbH.
legal name: GRUNDIG Intermedia GmbH
belongs to module: MP3Player, TV

OGG
type: Data Format Audio
comment: Ogg is a free, open standard container format maintained by the Xiph.Org Foundation.
belongs to module: MP3Player, DigitalCamera, Camcorder

Contrast Plus
type: Video Features
comment: Ensures that, according to the scene, the screen always displays the best possible contrast. This results in a depth of focus, which lends an extraordinary power to the television image, making it appear almost touchable.
belongs to module: TV

DolbyDigital
type: Data Format Audio
comment: The marketing name for a series of lossy audio compression technologies developed by Dolby Laboratories. (This description is partly based on or reuses content from the Wikipedia article "Dolby Digital" (http://en.wikipedia.org/wiki/Dolby_Digital) and is licensed under the GNU Free Documentation License (http://www.gnu.org/copyleft/fdl.html).)
belongs to module: Camcorder

Pixel Plus 3 HD
type: Video Features
comment: Pixel Plus 3 HD offers the unique combination of ultimate sharpness, natural detail, vivid colours and smooth natural motion on all qualities of HD, standard TV signals and multimedia content for high definition displays. Each pixel of the incoming picture is enhanced to better match the surrounding pixels, resulting in a more natural picture. Artefacts and noise in all sources from multimedia to standard TV and also in highly compressed HD are detected and reduced.
belongs to module: TV

USB cable
type: Accessory
comment: A serial bus standard to connect devices to a host computer.
label: USB Kabel @de
belongs to module: Camcorder

Zoom optical
type: Zoom
comment: An optical zoom is a mechanical assembly of lens elements with the ability to vary its focal length (and thus angle of view), as opposed to a fixed focal length (FFL) lens (see prime lens). (This description is partly based on or reuses content from the Wikipedia article "Zoom lens" (http://en.wikipedia.org/wiki/Zoom_lens) and is licensed under the GNU Free Documentation License (http://www.gnu.org/copyleft/fdl.html).)
label: Optischer Zoom @de
belongs to module: DigitalCamera

InfoPrint
type: BusinessEntity
comment: The business entity InfoPrint.
legal name: InfoPrint Solutions Company
belongs to module: Printer

Intenso
type: BusinessEntity
comment: The business entity Intenso GmbH.
legal name: Intenso GmbH
belongs to module: MP3Player

standard input capacity
type: ObjectProperty
comment: Amount of sheets the product can hold as standard.
label: Standard Eingabekapazität @de
range: QuantitativeValueInteger
sub property of: quantitativeProductOrServiceProperty
belongs to module: Printer

Ambilight 1
type: Video Features
comment: Ambilight, which is short for Ambient Lighting Technology, is a feature invented by Philips Electronics, generating light effects around the TV that correspond to the video content. (This description is partly based on or reuses content from the Wikipedia article "Ambilight" (http://en.wikipedia.org/wiki/Ambilight) and is licensed under the GNU Free Documentation License (http://www.gnu.org/copyleft/fdl.html).)
belongs to module: TV

MPEG
type: Data Format Video
comment: Includes all kinds of MPEG formats.
belongs to module: MP3Player, DigitalCamera, Camcorder

standard output capacity for transperancies
type: ObjectProperty
comment: Defines the maximum amount of transparancies the product is able to print.
label: Standard Ausgabekapazität für Folien @de
range: QuantitativeValueInteger
sub property of: quantitativeProductOrServiceProperty
belongs to module: Printer

PDF
type: Data Format Office
comment: Portable Document Format (PDF) is a file format created by Adobe Systems in 1993 for document exchange. (This description is partly based on or reuses content from the Wikipedia article "Pdf" (http://en.wikipedia.org/wiki/Pdf) and is licensed under the GNU Free Documentation License (http://www.gnu.org/copyleft/fdl.html).)
belongs to module: MP3Player, DigitalCamera

InFocus
type: BusinessEntity
comment: The business entity InFocus.
legal name: InFocus Co
belongs to module: TV

PCMCIA
type: Connectivity
comment: The Personal Computer Memory Card International Association is an international standards body that defines and promotes the PC Card (formerly known as "PCMCIA card") and ExpressCard standards. Although the organization's name refers to memory cards, their standards are not limited to memory devices. These cards can be used for wireless connectivity, modem and other functions in laptop/notebook PCs that may be lacking them natively. (This description is partly based on or reuses content from the Wikipedia article "PCMCIA" (http://en.wikipedia.org/wiki/PCMCIA) and is licensed under the GNU Free Documentation License (http://www.gnu.org/copyleft/fdl.html).)
belongs to module: TV

DLNA Ethernet
type: Connectivity
comment: The Digital Living Network Alliance is an international, cross-industry collaboration of consumer electronics, computing industry and mobile device companies. Members of DLNA develop a concept of wired and wireless interoperable networks where digital content such as photos, music, and videos can be shared through consumer electronics (CE), personal computers (PCs), and mobile devices in and beyond the home. (This description is partly based on or reuses content from the Wikipedia article "Digital Living Network Alliance" (http://en.wikipedia.org/wiki/Digital_Living_Network_Alliance) and is licensed under the GNU Free Documentation License (http://www.gnu.org/copyleft/fdl.html).)
belongs to module: TV

Monochrome
type: Display Type
comment: Ability to display just two colors (black/white).
label: Monochrom @de
belongs to module: MP3Player

height
type: ObjectProperty
comment: Defines the measurement of vertical distance (Common unit of measurement centimetre, CMT).
label: Höhe @de
range: QuantitativeValueFloat
sub property of: quantitativeProductOrServiceProperty
belongs to module: MP3Player, TV, Printer, DigitalCamera, Camcorder

Indoor white balance
type: White balance
comment: Ability to adapt of different adjustments of the intensities of the colors.
label: Weißabgleich innen @de
belongs to module: Camcorder

Infrared
type: Data Interface Type
comment: Infrared (IR) radiation is electromagnetic radiation whose wavelength is longer than that of visible light, but shorter than that of terahertz radiation and microwaves. (This description is partly based on or reuses content from the Wikipedia article "Infrared" (http://en.wikipedia.org/wiki/Infrared) and is licensed under the GNU Free Documentation License (http://www.gnu.org/copyleft/fdl.html).)
label: Infrarot @de
belongs to module: MP3Player, Printer, DigitalCamera, Camcorder

B2
type: Media format
comment: Format of the german institute for standardization: 500 x 707 mm.
belongs to module: Printer

Lens system
type: Class
comment: A lens is an optical device with perfect or approximate axial symmetry which transmits and refracts light, converging or diverging the beam. (This description is partly based on or reuses content from the Wikipedia article "Lens (optics)" (http://en.wikipedia.org/wiki/Lens_(optics)) and is licensed under the GNU Free Documentation License (http://www.gnu.org/copyleft/fdl.html).)
label: Objektivsystem @de
subclass of: QualitativeValue
belongs to module: Camcorder

Smartdisk
type: BusinessEntity
comment: The business entity Verbatim Corporation.
legal name: Verbatim Corporation
belongs to module: MP3Player

IEEE_1394
type: Data Interface Type
comment: The IEEE 1394 interface is a serial bus interface standard for high-speed communications and isochronous real-time data transfer, frequently used by personal computers, as well as in digital audio, digital video, automotive, and aeronautics applications. (This description is partly based on or reuses content from the Wikipedia article "firewire" (http://en.wikipedia.org/wiki/FireWire) and is licensed under the GNU Free Documentation License (http://www.gnu.org/copyleft/fdl.html).)
belongs to module: Printer, Printer, DigitalCamera, Camcorder

Transparency
type: Media type
comment: A thin sheet of transparent flexible material, typically cellulose acetate, onto which you can print.
label: Folie @de
belongs to module: Printer

number of USB ports
type: ObjectProperty
comment: Number of serial bus standard ports to connect devices to a host computer.
label: Anzahl USB Anschlussmöglichkeiten @de
range: QuantitativeValueInteger
sub property of: quantitativeProductOrServiceProperty
belongs to module: Camcorder

HDMI interface
type: Data Interface Type
comment: HDMI (High-Definition Multimedia Interface) is a compact audio/video interface for transmitting uncompressed digital data. (This description is partly based on or reuses content from the Wikipedia article "HDMI" (http://en.wikipedia.org/wiki/HDMI) and is licensed under the GNU Free Documentation License (http://www.gnu.org/copyleft/fdl.html).)
label: HDMI Schnittstelle @de
belongs to module: DigitalCamera, Camcorder

scene mode
type: ObjectProperty
comment: Defines a projection of information from any physical environment into any sensory system.
label: Szenenmodus @de
range: Scene mode
sub property of: qualitativeProductOrServiceProperty
belongs to module: Camcorder

Energy Sistem
type: BusinessEntity
comment: The business entity Energy Sistem Soyntec S.A.
legal name: Energy Sistem Soyntec S.A.
belongs to module: MP3Player

Analog
type: Tuner type
comment: An analog or analogue signal is any continuous signal for which the time varying feature (variable) of the signal is a representation of some other time varying quantity, i.e analogous to another time varying signal. (This description is partly based on or reuses content from the Wikipedia article "Analog signal" (http://en.wikipedia.org/wiki/Analog_signal) and is licensed under the GNU Free Documentation License (http://www.gnu.org/copyleft/fdl.html).)
label: Digital @de
belongs to module: TV

DVI
type: Connectivity
comment: The Digital Visual Interface (DVI) is a video interface standard designed to maximize the visual quality of digital display devices such as flat panel LCD computer displays and digital projectors. It is designed for carrying uncompressed digital video data to a display. It is partially compatible with the High-Definition Multimedia Interface (HDMI) standard in digital mode (DVI-D), and VGA in analog mode (DVI-A). (This description is partly based on or reuses content from the Wikipedia article "Digital Visual Interface" (http://en.wikipedia.org/wiki/Digital_Visual_Interface) and is licensed under the GNU Free Documentation License (http://www.gnu.org/copyleft/fdl.html).)
belongs to module: TV

GIF
type: Data Format Image
comment: The format supports up to 8 bits per pixel, allowing a single image to reference a palette of up to 256 distinct colors chosen from the 24-bit RGB color space. (This description is partly based on or reuses content from the Wikipedia article "Graphics Interchange Format" (http://en.wikipedia.org/wiki/Graphics_Interchange_Format) and is licensed under the GNU Free Documentation License (http://www.gnu.org/copyleft/fdl.html).)
belongs to module: MP3Player, DigitalCamera, Camcorder

display brightness
type: DatatypeProperty
comment: Defines the brightness of a display or screen. Brightness is an attribute of visual perception in which a source appears to be radiating or reflecting light. (This description is partly based on or reuses content from the Wikipedia article "Brightness" (http://en.wikipedia.org/wiki/Brightness) and is licensed under the GNU Free Documentation License (http://www.gnu.org/copyleft/fdl.html).)
label: Bildhelligkeit @de
range: float
sub property of: datatypeProductOrServiceProperty
belongs to module: TV

Unterstützte Auflösung
type: Class
comment: Resolution supported by an electronical device.
label: Supported resolution
subclass of: QualitativeValue
belongs to module: TV

Grey
type: Color
comment: RGB Value 128,128,128
label: Grau @de
belongs to module: MP3Player, TV, Printer, DigitalCamera, Camcorder

max color print speed normal
type: ObjectProperty
comment: Amount of pages per minute the product is able to print in the mode of color-printig normal quality.
label: maximale Druckgeschwindigkeit Farbe normal @de
range: QuantitativeValueFloat
sub property of: quantitativeProductOrServiceProperty
belongs to module: Printer

Phoenix
type: BusinessEntity
comment: The business entity Phoenix.
legal name: Phoenix Contact GmbH Co. KG
belongs to module: Camcorder

Intuix
type: BusinessEntity
comment: The business entity Intuix LLC.
legal name: Intuix LLC
belongs to module: MP3Player

Digital audio coaxial out
type: Connectivity
comment: Digital audio uses digital signals for sound reproduction. This includes analog-to-digital conversion, digital-to-analog conversion, storage and transmission. From the signal point of view, a connector can be viewed as a short, rigid cable. The connector usually has the same impedance as the related cable and probably has a similar cutoff frequency although its dielectric may be different. Some connectors are gold or rhodium plated, while some connectors use nickel or tin plating. Silver is also used due to its excellent conductivity. Although silver tends to oxidize rather quickly, the silver oxide that is produced is still conductive. This may pose a cosmetic issue but it does not degrade the performance of the connector. Here the output is meant. (This description is partly based on or reuses content from the Wikipedia article "Digital audio" (http://en.wikipedia.org/wiki/Digital_audio) and is licensed under the GNU Free Documentation License (http://www.gnu.org/copyleft/fdl.html).)
belongs to module: TV

Common interface
type: General Features
comment: The Common Interface is an extensible digital interconnect found in the digital TV market. (This description is partly based on or reuses content from the Wikipedia article "Common Interface" (http://en.wikipedia.org/wiki/Common_Interface) and is licensed under the GNU Free Documentation License (http://www.gnu.org/copyleft/fdl.html).)
belongs to module: TV

TRUST
type: BusinessEntity
comment: The business entity TRUST International B.V.
legal name: TRUST International B.V.
belongs to module: MP3Player, DigitalCamera, Camcorder

viewing angle vertical
type: ObjectProperty
comment: Defines the angle in a vertical axe where a viewer is still able to see the picture on a screen (Common unit of measurement degree, DD).
label: vertikaler Betrachtungswinkel @de
range: QuantitativeValueFloat
sub property of: quantitativeProductOrServiceProperty
belongs to module: TV

Format 5.1ch
type: Data Format Audio
comment: Encompasses a range of techniques for enriching (expanding and deepening) the sound reproduction quality, of an audio source, with additional audio channels reproduced via additional, discrete speakers.
belongs to module: Camcorder

HP FastRes 1200 DPI
type: Print resolution
comment: Special printing technology invented and used by HP.
belongs to module: Printer

Toshiba
type: BusinessEntity
comment: The business entity Toshiba Corporation.
legal name: Toshiba Corporation
belongs to module: MP3Player, TV, DigitalCamera, Camcorder

Windows Vista
type: Compatible Operating Systems
comment: A version of a Microsoft operating system.
belongs to module: MP3Player, Printer, DigitalCamera, Camcorder

Maxfield
type: BusinessEntity
comment: The business entity Maxfield GmbH.
legal name: Maxfield GmbH
belongs to module: MP3Player

digital zoom factor
type: ObjectProperty
comment: Defines the stages an object can be zoomed digitally.
label: digitaler Zoomfaktor @de
range: QuantitativeValueFloat
sub property of: quantitativeProductOrServiceProperty
belongs to module: DigitalCamera, Camcorder

CVBS in
type: Connectivity
comment: Composite video is often designated by the CVBS acronym, meaning any of "Color, Video, Blank and Sync", "Composite Video Baseband Signal", "Composite Video Burst Signal", or "Composite Video with Burst and Sync". Here the input is meant.
belongs to module: TV

Nanopoint
type: BusinessEntity
comment: The business entity Nanopoint Technology Inc.
legal name: Nanopoint Technology Inc.
belongs to module: MP3Player

Viewfinder electronic
type: Viewfinder
comment: An electronic viewfinder or EVF is a viewfinder where the image captured by the lens is projected electronically onto a miniature display. The image on this display is used to assist in aiming the camera at the scene to be photographed. (This description is partly based on or reuses content from the Wikipedia article "Electronic viewfinder" (http://en.wikipedia.org/wiki/Electronic_viewfinder) and is licensed under the GNU Free Documentation License (http://www.gnu.org/copyleft/fdl.html).)
label: Elektronischer Bildsucher @de
belongs to module: DigitalCamera

Sweex
type: BusinessEntity
comment: The business entity Sweex.
legal name: Sweex
belongs to module: TV

min illumination
type: ObjectProperty
comment: Minimum deliberate application of light to achieve some aesthetic or practical effect (common unit of measurement: Lux; LUX).
label: minimale Belichtung @de
range: QuantitativeValueFloat
sub property of: quantitativeProductOrServiceProperty
belongs to module: Camcorder

HP REt
type: Print resolution
comment: Special printing technology invented and used by HP.
belongs to module: Printer

shutter lag
type: ObjectProperty
comment: Defines the delay between triggering the shutter and when the photograph is actually recorded (Common unit of measurement seconds, SEC).
label: Auslöseverzögerung @de
range: QuantitativeValueFloat
sub property of: quantitativeProductOrServiceProperty
belongs to module: DigitalCamera, Camcorder

Text viewing
type: Features
comment: Ability to display text.
label: Textdarstellung @de
belongs to module: MP3Player

SmartMediaCard
type: Storage Media
comment: SmartMedia is a flash memory card standard.
belongs to module: MP3Player, DigitalCamera, Camcorder

Denver
type: BusinessEntity
comment: The business entity Denver.
legal name: Denver Electronics
belongs to module: TV

Philips
type: BusinessEntity
comment: The business entity Koninklijke Philips Electronics N.V.
legal name: Koninklijke Philips Electronics N.V.
belongs to module: MP3Player, TV, DigitalCamera

One step fixed
type: Lens system
comment: A special lens system.
belongs to module: Camcorder

depth
type: ObjectProperty
comment: Defines the distance from side to side, measuring across the object at right angles to the width (Common unit of measurement centimetre, CMT). (This description is partly based on or reuses content from the Wikipedia article "Length" (http://en.wikipedia.org/wiki/Length) and is licensed under the GNU Free Documentation License (http://www.gnu.org/copyleft/fdl.html).)
label: Tiefe @de
range: QuantitativeValueFloat
sub property of: quantitativeProductOrServiceProperty
belongs to module: MP3Player, TV, Printer, DigitalCamera, Camcorder

audio input source
type: DatatypeProperty
comment: Defines which audio input devices can be used with this object.
label: Audioeingang @de
range: boolean
sub property of: datatypeProductOrServiceProperty
belongs to module: DigitalCamera

Inkjet printer
type: Class
comment: Inkjet printers operate by propelling variably-sized droplets of liquid or molten material (ink) onto almost any sized page. (This description is partly based on or reuses content from the Wikipedia article "Inkjet printer" (http://en.wikipedia.org/wiki/Inkjet_printer) and is licensed under the GNU Free Documentation License (http://www.gnu.org/copyleft/fdl.html).)
label: Tintenstrahldrucker @de
subclass of: Printer
belongs to module: Printer

DK digital
type: BusinessEntity
comment: The business entity DK digital GmbH.
legal name: DK digital GmbH
belongs to module: MP3Player

Camcorder
type: Class
comment: A camcorder is a portable consumer electronics device for recording video and audio using a built-in recorder unit.
subclass of: ProductOrService
belongs to module: Camcorder

compatible operating system
type: ObjectProperty
comment: Defines the possible external operating systems to communicate with.
label: kompatibles Betriebssystem @de
range: Compatible Operating Systems
sub property of: qualitativeProductOrServiceProperty
belongs to module: MP3Player, Printer, DigitalCamera, Camcorder

Sharkoon
type: BusinessEntity
comment: The business entity SHARKOON Technologies GmbH.
legal name: SHARKOON Technologies GmbH
belongs to module: MP3Player

Self-timer
type: Features
comment: Ability to give a delay between the pressing of the shutter release and the shutter firing.
label: Selbstauslöser @de
belongs to module: DigitalCamera, Camcorder

A6
type: Media format
comment: Format of the german institute for standardization: 105 x 148 mm.
belongs to module: Printer

certificate
type: ObjectProperty
comment: Defines the type of certificate of a product used to attest quality standards.
label: Zertifikat @de
range: Certificate
sub property of: qualitativeProductOrServiceProperty
belongs to module: TV

Tektronix
type: BusinessEntity
comment: The business entity Tektronix.
legal name: Tektronix, Inc.
belongs to module: Printer