ha agente correlato
type: ObjectProperty
comment: This property is used to associate an entity of any kind to an agent related to that entity in some way. It is used when it is not possible to express the relation in a more specific way. @en
comment: Questa proprietà collega un'entità di qualsiasi tipo a un agente che è collegato in qualche modo a quell'entità. È una relazione generica che viene usata per quei casi in cui non sia possibile definire in maniera più precisa la natura della relazione.
domain: Thing
label: has related agent @en
range: Agent
inverse of: è agente correlato a
property chain axiom: hasAgentRole
property chain axiom: hasAgent
version info: stabile
version info: stable @en
iccd norm tag: ICCD Normativa Trasversale: AU/NMC

ha tipo di responsabilità
type: ObjectProperty
comment: Questa proprietà collega una responsabilità individuata relativamente ai processi di produzione e di divulgazione che caratterizzano specificamente i beni fotografici al tipo di responsabilità (es.: stampatori, ritoccatori, coloritori, ecc.).
comment: This property relates a resposibility relative to some production or disclosure process which characterise photographic artefacts, to its responsibility type (i.e. printers, retouchers). @en
domain: Responsabilità
label: has responsibility type @en
range: Tipo di responsabilità
sub property of: hasType
inverse of: è tipo di responsabilità di
version info: stabile
version info: stable @en
iccd norm tag: ICCD Normative F e FF: PD/PDF/PDFR

è responsabile di numero di inventario di
type: ObjectProperty
comment: Questa proprietà collega il contenitore giuridico che conserva attualmente il bene, o che lo ha conservato in passato, e che è responsabile dell'assegnazione del numero di inventario all'inventario stesso.
comment: This property relates the juridical container responsible for the inventory identifier of the cultural property to the inventory itself. @en
domain: Agent
label: is inventory identifier responsible of @en
range: Inventario
sub property of: è agente correlato a
version info: stable @en
version info: stabile

Titolo attribuito
type: Tipo di Titolo
type: NamedIndividual
comment: Represents an attributed title of a photograph, that is a title taken from archival, bibliographic, oral or iconographic sources, or created based on picture contents. @en
comment: Rappresenta un titolo attribuito di una fotografia, cioè un titolo desunto, se possibile, da fonti archivistiche, bibliografiche, orali o iconografiche (altri esemplari della stessa immagine) oppure creato in base al contenuto dell'immagine (o della serie di immagini; è necessario nei casi in cui siano del tutto assenti titoli sul/nel documento, o su materiali ad esso complementari, e nel caso in cui tali titoli risultino errati.
label: Attributed title @en
iccd norm tag: Normativa F: SG/SGL/SGLA - Normativa FF: se PA/PAC/PACG = 'attribuita'

didascalia
type: DatatypeProperty
comment: Questa proprietà rappresenta una sintetica didascalia, se presente e utile alla comprensione di quanto documentato.
comment: This property represents a synthetic caption, useful for understanding what is documented. @en
domain: Documentazione fotografica
label: caption @en
range: Literal
version info: stabile
version info: stable @en
iccd norm tag: FNTN

è interpretazione del sesso di
type: ObjectProperty
comment: This property relates the sex estimate of an antropologic artifact to the related artifact. @en
comment: Questa proprietà collega la stima del sesso di un reperto antropologico al reperto stesso.
domain: Interpretazione del sesso
label: is sex interpretation of @en
range: CulturalEntity
sub property of: isSituationOf
version info: stable
version info: stabile

Stima
type: Class
comment: This class represents the concept of estimate. @en
comment: Questa classe rappresenta il concetto di stima di un'entità.
label: Estimate @en
subclass of: Interpretazione
subclass of: Restriction
  on property: è stima di
  some values from: Thing
subclass of: Restriction
  on property: valore stimato
  some values from: Literal
version info: stable @en
version info: stabile

ha ente che ha emanato il provvedimento
type: ObjectProperty
comment: This property relates an urban-planning instrument to the institution which issued the provision. @en
comment: Questa proprietà collega uno strumento urbanistico-territoriale con l'ente o l'amministrazione che ha emanato il provvedimento.
domain: Strumento urbanistico-territoriale
label: has issuing agency @en
range: Agent
sub property of: ha agente correlato
inverse of: è ente che ha emanato il provvedimento
version info: stabile
version info: stable @en
iccd norm tag: TU/STU/STUE

fa riferimento a indagini
type: DatatypeProperty
comment: Questa proprietà rappresenta altre indagini cui fa riferimento un'indagine volta a elaborare una diagnosi di una paleopatologia rilevata in un reperto antropologico.
comment: This property represents other investigations referred to in a survey aimed at developing a diagnosis of a paleopathology found in an anthropological finding. @en
domain: Indagine su paleopatologia
label: refers to surveys @en
range: Literal
version info: stable @en
version info: stabile
iccd norm tag: ICCD Normativa AT: PT/PTC/PTCI

Diritti d'autore
type: Class
comment: This class represents the copyright of an object, e.g. a cultural property. @en
comment: Questa classe rappresenta i diritti d'autore detenuti da un agente su un oggetto, per esempio un bene culturale.
label: Copyright @en
subclass of: Object
subclass of: Restriction
  on property: ha titolare dei diritti d'autore
  some values from: Agent
subclass of: Restriction
  on property: sono diritti d'autore di
  some values from: Thing
subclass of: Restriction
  on property: data di scadenza
  some values from: Literal
version info: stable @en
version info: stabile
iccd norm tag: ICCD Normativa F 4.00 e OAC: TU/CPR

Bibliografia specifica
type: Genere della bibliografia
type: NamedIndividual
comment: This individual represents the definition related to the kind of bibliography that specifically concerns the subject under examination. @en
comment: Questo individuo rappresenta la definizione relativa al genere di bibliografia che riguarda in modo specifico il bene in esame.
label: Specific bibliography @en
version info: stable @en
version info: stabile

Scala
type: Class
comment: Questa classe rappresenta le indicazioni sulla scala di rappresentazione della documentazione grafica e cartografica.
comment: This class represents the representative scale of a graphic or cartographic documentation. @en
label: Scale @en
subclass of: Object
subclass of: Restriction
  on property: è scala di
  some values from: Documentazione grafica e cartografica
version info: stabile
version info: stable @en
iccd norm tag: ICCD Normativa Trasversale 4.00: DO/DRA/DRAS

ha autore attribuito
type: ObjectProperty
comment: Questa proprietà collega una situazione in cui viene attribuito un autore a un bene culturale all'autore stesso.
comment: This property relates a situation where an autorship is attributed to a cultural entity's author. @en
domain: Class
  union of: Attribuzione Alternativa di Autore
  union of: Attribuzione Primaria di Autore
label: has attributed author @en
range: Agent
sub property of: ha agente correlato
inverse of: è autore attribuito in
version info: stable @en
version info: stabile
iccd norm tag: AU/AUT/AUTN (+ AU/AUT/AUTS); AU/AAT; AU/AAT/AATN

causale RCS
type: DatatypeProperty
comment: This property represents the code of the RCS causal (Central State Accounting Office) of increasing or decreasing property value. @en
comment: Questa proprietà rappresenta il codice della causale RCS (Ragioneria Centrale dello Stato) di aumento o diminuzione del valore del bene.
domain: Inventario Patrimoniale
label: RCS reason @en
range: Literal
iccd norm tag: ICCD Normativa Trasversale 4.00: UB/INP/INPU

ha sesso stimato
type: ObjectProperty
comment: Questa proprietà collega un reperto antropologico alla stima del sesso.
comment: This property relates an antropologic artifact to its sex estimate. @en
domain: CulturalEntity
label: has sex interpretation @en
range: Interpretazione del sesso
sub property of: hasSituation
inverse of: è interpretazione del sesso di
version info: stable @en
version info: stabile
iccd norm tag: ICCD Normativa AT: DA/STS

Altra documentazione multimediale
type: Class
comment: Questa classe rappresenta la documentazione multimediale in formato digitale relativa al un oggetto, per esempio un bene culturale. Nel caso delle Normative per la catalogazione dell'ICCD questa classe riguarda la documentazione multimediale realizzata in formati non compresi dalle norme ICCD, allegata alla scheda di catalogo o esistente e depositata presso l'Ente schedatore o in altre raccolte.
comment: This class represents the multimedia documentation of an object, e.g. a cultural property. @en
label: Multimedia documentation @en
subclass of: Documentazione
version info: stable @en
version info: stabile
iccd norm tag: ADM (solo versioni 3.00 e 3.01)

Anomalia areale
type: Tipo di anomalia
type: NamedIndividual
label: Polygon anomaly @en

è responsabile scientifico della ricerca di
type: ObjectProperty
comment: This property relates the research's scientific responsible to its research. @en
comment: Questa proprietà collega il responsabile scientifico di una ricerca alla ricerca.
domain: Agent
label: is research scientific director of @en
range: Ricerca
sub property of: è agente correlato a
version info: stabile
version info: stable @en

codice univoco ICCD della bibliografia
type: FunctionalProperty
type: DatatypeProperty
comment: This property represents the code, assigned by the ICCD, which identifies the bibliographic reference uniquely at national level. @en
comment: Questa proprietà rappresenta il codice, assegnato dall'ICCD, che individua il riferimento bibliografico in modo univoco a livello nazionale.
domain: Bibliografia
label: bibliography ICCD identifier @en
range: Literal
sub property of: ICCDIdentifier
version info: stabile
version info: stable @en
iccd norm tag: ICCD Normativa Trasversale 4.00: DO/BIB/BIBK

Ottima affidabilità
type: Affidabilità
type: NamedIndividual
label: Excellent reliability @en

è ente che ha emanato il provvedimento
type: ObjectProperty
comment: Questa è la proprietà inversa di "ha ente che ha emanato il provvedimento".
comment: This is the inverse property of "has issuing agency". @en
domain: Agent
label: is issuing agency of @en
range: Strumento urbanistico-territoriale
sub property of: è agente correlato a
version info: stable @en
version info: stabile

è anomalia di
type: ObjectProperty
comment: Questa proprietà collega un'anomalia rilevata nel corso dell'indagine tramite fotointerpretazione o fotorestituzione alla relativa indagine.
comment: This property relates an anomaly revealed by a photo interepretation rendering to the related survey. @en
domain: Anomalia
label: is anomaly of @en
range: Fotointerpretazione e fotorestituzione
sub property of: isSituationOf
version info: stable @en
version info: stabile

Situazione giuridica
type: Class
comment: Questa classe rappresenta la condizione giuridica di un bene culturale, con riferimenti al proprietario, detentore o possessore.
comment: This class represents the legal situation of a cultural property, related to the owner. @en
label: Legal situation @en
subclass of: Situation
subclass of: Restriction
  all values from: Agent
  on property: ha proprietario
subclass of: Restriction
  on property: è condizione giuridica di
  some values from: CulturalEntity
description: Un esempio d'uso della classe "Condizione giuridica" è il seguente: resource:LegalSituation/1400054721-legal-situation-proprieta-stato a cd:LegalSituation ; rdfs:label "Condizione giuridica del bene culturale 1400054721: proprietà Stato"@it ; cd:hasOwner resource:Agent/ministero-beni-culturali .
description: An example of usage of the class "Legal situation" is the following: resource:LegalSituation/1400054721-legal-situation-proprieta-stato a cd:LegalSituation ; rdfs:label "Legal situation of cultural property 1400054721: State property"@en ; cd:hasOwner resource:Agent/ministero-beni-culturali . @en
version info: stabile
version info: stable @en
iccd norm tag: ICCD Normativa Trasversale 4.00: TU/CDG/CDGG

Appartenenza a unità archivistica complessa
type: Class
comment: This class represents the membership of a cultural property in an archival record set. @en
comment: Questa classe rappresenta l'appartenenza di un bene culturale a un'unità archivistica complessa (fondo, serie, sottoserie, etc.).
label: Archival record set membership @en
subclass of: Appartenenza
subclass of: Restriction
  all values from: Literal
  on property: collocazione di unità documentaria
subclass of: Restriction
  on property: ha unità archivistica complessa
  some values from: Unità archivistica complessa
subclass of: Restriction
  all values from: Literal
  on property: titolo di unità archivistica complessa
subclass of: Restriction
  on property: ha membro di unità archivistica complessa
  some values from: CulturalEntity
version info: stable @en
version info: stabile
iccd norm tag: ICCD Normativa F: UB/UBF

Repertorio
type: Class
comment: This class represents the reference catalogue that cites the copy of a print. @en
comment: Questa classe rappresenta il repertorio che cita la copia di una stampa.
label: Reference catalogue @en
subclass of: Object
subclass of: Restriction
  on property: è repertorio di riferimento di
  some values from: Copia
version info: stable @en
version info: stabile
iccd norm tag: ICCD Normativa S 3: RO/COP/COPR

ha edizione
type: ObjectProperty
comment: Questa proprietà collega un'entità a una sua edizione.
comment: This property relates an entity to its edition. @en
domain: Thing
label: has edition @en
range: Edizione
inverse of: è edizione di
version info: stable @en
version info: stabile
iccd norm tag: ICCD Normative VeAC e AT 3.01: DO/BSE/BSEN - Normativa S 3.00: RO/ADL/ADLE.

è fruizione di
type: ObjectProperty
comment: This property relates the fruition of a garment to that garment. @en
comment: Questa proprietà collega una fruizione di un vestimento al vestimento stesso.
domain: Fruizione
label: is fruition of @en
range: CulturalEntity
sub property of: isSituationOf
version info: stable @en
version info: stabile

Copia
type: Class
comment: Questa classe rappresenta la copia di un bene culturale, per esempio di una fotografia o di una stampa. Nel caso della fotografia, in questo caso viene esplicitamente dichiarata la responsabilità del fotografo principale.
comment: This class represents the copy of a cultural property, e.g. a copy of a photography or a print. @en
label: Copy @en
subclass of: Opera derivata
version info: stabile
version info: stable @en
iccd norm tag: ICCD Normativa S 3: RO/COP; ICCD Normativa F: RO/CRF/CRFT = 'copia'

foglio
type: DatatypeProperty
comment: Questa proprietà codifica il numero di foglio o di carta del documento per la classe di documentazione Fonti e documenti.
comment: This property represent document's folio number. @en
domain: Fonti e documenti
label: folio @en
range: Literal
version info: stable @en
version info: stabile
iccd norm tag: DO/FNT/FNTF

gestione diritti
type: DatatypeProperty
comment: This property represents information on rights management. @en
comment: Questa proprietà rappresenta le informazioni a testo libero sulla gestione dei diritti. Nel caso di un bene culturale, permette di rappresentare indicazioni sulla presenza dei privilegi, autorizzazioni, licenze, specificando il concedente, eventualmente riportando anche il periodo di tempo della privativa.
domain: Class
  union of: CulturalEntity
  union of: Documentazione
label: rights @en
range: Literal
version info: stabile
version info: stable @en
iccd norm tag: ICCD Normativa Trasversale 4.00: DO/FTA/FTAY, DO/DRA/DRAY, DO/VDC/VDCY, DO/REG/REGY, DO/FNT/FNTY, DO/BIB/BIBY - ICCD Normativa MI 3.00: DA/PLC

Contesto di rinvenimento
type: Class
comment: Questa classe rappresenta il contesto di ritrovamento (tipo di contesto, elementi associati) di un bene culturale, e in particolare di un reperto antropologico.
comment: This class represents the context (type of context, associated objects) in which a cultural property (in particular, an anthropological material) is found. @en
label: Finding context @en
subclass of: Situation
subclass of: Restriction
  all values from: Literal
  on property: specifications
subclass of: Restriction
  on property: ha tipo di contesto di rinvenimento
  some values from: Tipo di contesto di rinvenimento
subclass of: Restriction
  all values from: Object
  on property: ha elemento associato
subclass of: Restriction
  on property: è contesto di rinvenimento di
  some values from: CulturalEntity
version info: stabile
version info: stable @en
iccd norm tag: ICCD Normativa AT 3.01: OG/OGC

Cronologia
type: Class
comment: Questa classe rappresenta la cronologia di un'entità, cioè i dati cronologici che riguardano la storia dell'entità (es.: un bene culturale o un'opera collegata a un bene culturale). In relazione alle diverse situazioni, indicheranno un periodo esteso nel tempo oppure una singola data. Per ciascun bene viene fornita la cronologia della sua realizzazione, o, nel caso di immobili che presentano diverse fasi edilizie o diversi momenti di vita, un arco cronologico di riferimento; possono essere fornite anche altre notizie cronologiche relative ad altri eventi che hanno riguardato il bene (demolizione, progettazione, rimaneggiamenti, etc.)
comment: This class represents the dating of an entity, that is information about the chronology of the entity (e.g.: a cultural property), referring to a particular event (e.g.: the creation of the cultural property, its distruction, etc.) @en
label: Dating @en
subclass of: Interpretazione
subclass of: Restriction
  on property: è cronologia di
  some values from: CulturalEntity
subclass of: Restriction
  all values from: EventOrSituation
  on property: ha evento relativo a datazione
version info: stabile
version info: stable @en
iccd norm tag: ICCD Normativa Trasversale 4.00: DT - ICCD Normative F, RA, SMO, PST, S, OAC, OA, MI, D, NU: RO/ROF/ROFD

riferimento agli atti
type: DatatypeProperty
comment: Questa proprietà rappresenta, a testo libero, eventuali riferimenti a documenti (atti amministrativi; riproduzioni digitali di registri inventariali, ecc.) che interessano l'acquisizione del bene nel patrimonio. Rappresenta anche i dati relativi ai registri inventariali in vigore, ma comunque dotati di qualità storica.
comment: This property represents any references to documents that affect cultural entity acquisition. @en
domain: Inventario Patrimoniale
label: relevant legal act @en
range: Literal
version info: stabile
version info: stable @en
iccd norm tag: ICCD Normativa Trasversale 4.00: IUB/INP/INPO

è genere in
type: ObjectProperty
comment: This property relates a genus to the biological taxon in which it is classified. @en
comment: Questa proprietà collega un genere alla tassonomia in cui è classificato.
domain: Genere
label: is genus in @en
range: Tassonomia biologica
sub property of: isConceptOf
version info: stable @en
version info: stabile

ha posizione della riproduzione
type: ObjectProperty
comment: Questa proprietà collega la riproduzione di una stampa all'interno di una pubblicazione con la posizione fisica nella pubblicazione stessa (es.: frontespizio, copertina, colophon, etc.).
comment: This property relates the print reproduction in a publication to the position in the publication. @en
domain: Riproduzione
label: has reproduction position @en
range: Posizione della riproduzione
inverse of: è posizione della riproduzione di
version info: stable @en
version info: stabile
iccd norm tag: ICCD Normativa S 3: RO/ADL/ADLP

è stadio del bene culturale in
type: ObjectProperty
comment: This cultural property relates the stage of a cultural property referring to another entity (preparatory or final work) to this relationship between the two entities. @en
comment: Questa proprietà collega lo stadio di realizzazione del bene culturale in relazione a un'altra entità collegata (opera preparatoria o opera finale) al rapporto tra il bene culturale stesso e questa entità.
domain: Stadio del bene culturale
label: is cultural property stage in @en
range: Rapporto con opera collegata
version info: stable @en
version info: stabile
iccd norm tag: ICCD Normative RA, SMO, PST, S, OAC, OA, MI, D, NU, F: RO/ROF/ROFF

codice inventario bene in collezione
type: FunctionalProperty
type: DatatypeProperty
comment: Questa proprietà rappresenta il codice d'inventario attribuito al bene nella collezione.
comment: This property represents the inventory code assigned to the cultural entity inside a collection. @en
domain: CulturalEntity
label: collection unit inventory identifier @en
range: Literal
sub property of: identifier
version info: stable @en
version info: stabile
iccd norm tag: UB/COL/COLI

è condizione giuridica di
type: ObjectProperty
comment: This property relates a legal situation to an entity that is in that situation. @en
comment: Questa proprietà collega una condizione giuridica a un'entità che si trova in quella condizione.
domain: Situazione giuridica
label: is legal situation of @en
range: Thing
sub property of: isSituationOf
version info: stabile
version info: stable @en

è agente correlato a
type: ObjectProperty
comment: This property is used to associate an agent related in some way to an entity of any kind to that entity. It is used when it is not possible to express the relation in a more specific way. @en
comment: Questa proprietà collega un agente che è collegato in qualche modo a un'entità di qualsiasi tipo a quell'entità. È una relazione generica che viene usata per quei casi in cui non sia possibile definire in maniera più precisa la natura della relazione.
domain: Agent
label: is agent related to @en
range: Thing
version info: stable @en
version info: stabile

è luogo di ritrovamento di
type: ObjectProperty
comment: This is the inverse property of "has finding location". @en
comment: Questa è la proprietà inversa di 'ha luogo di ritrovamento'.
domain: CulturalEntity
label: is finding location of @en
range: CulturalEntity
sub property of: è opera collegata a
version info: stabile
version info: stable @en

informazioni raccolte sul luogo
type: DatatypeProperty
comment: Questa proprietà rappresenta le informazioni raccolte sul luogo dove si trova il bene o sul luogo dove il bene è stato rilevato.
comment: This property represents information collected on the place where the cultural entity is located or on the place where it was detected. @en
domain: CulturalEntity
label: information gathered on site @en
range: Literal
version info: stable @en
version info: stabile
iccd norm tag: ICCD Normativa Trasversale 4.00: DA/NRL

è coinvolto in
type: ObjectProperty
comment: Questa proprietà collega un bene culturale a un altro bene culturale collegato, di tipo immateriale, in cui è coinvolto.
comment: This property relates a cultural entity to another involved cultural entity (e.g. immaterial). @en
domain: CulturalEntity
label: is involved in @en
range: CulturalEntity
sub property of: ha opera collegata
version info: stable @en
version info: stabile
iccd norm tag: ICCD Normativa Trasversale 4.00: RV/RSE/RSER = 'è coinvolto in' (versioni precedenti: 'esecuzione/evento di riferimento')

valore del bene culturale
type: DatatypeProperty
comment: Questa proprietà rappresenta il valore economico di un bene culturale. Nel caso di una collezione, questa proprietà rappresenta il valore del bene desunto, quando presente, dall'inventario della collezione o dal suo prezzo di acquisto o vendita. Nel caso di un inventario patrimoniale, questa proprietà rappresenta la stima patrimoniale del bene. Il valore viene preceduto dalla specifica della valuta.
comment: This property represents cultural entity's economic value.. The value is preceded by the currency specification. @en
domain: Stima di bene culturale
label: cultural property value @en
range: Literal
sub property of: valore stimato
version info: stabile
version info: stable @en
iccd norm tag: ICCD Normativa Trasversale 4.00: UB/COL/COLV; UB/INP/INP/INPA; UB/STI

ha affidabilità
type: ObjectProperty
comment: Questa proprietà collega una fotointerpretazione o fotorestituzione al livello di affidabilità delle informazioni rilevate nell'indagine.
comment: This property relates a photo interpretation rendering survey to the reliability of the information collected during the survey. @en
domain: Fotointerpretazione e fotorestituzione
label: has reliability @en
range: Affidabilità
sub property of: hasCharacteristic
inverse of: è affidabilità di
version info: stabile
version info: stable @en
iccd norm tag: ICCD Normativa Trasversale 4.00: RE/FOI/FOIO

è stato rinvenuto in
type: ObjectProperty
comment: This property relates a cultural entity to a connected cultural entity which constitutes the site where it was rediscovered. @en
comment: Questa proprietà collega un bene culturale a un altro bene culturale collegato, che ne costituisce la sede di rinvenimento archeologico.
domain: CulturalEntity
label: has finding location @en
label: ha sede di rinvenimento
range: CulturalEntity
sub property of: ha opera collegata
inverse of: è luogo di ritrovamento di
version info: stable @en
version info: stabile
iccd norm tag: ICCD Normativa Trasversale 4.00: RV/RSE/RSER = 'è stato rinvenuto in' (versioni precedenti: 'sede di rinvenimento')

Interpretazione
type: Class
comment: This class represents a situation in which pieces of information related to an object (e.g.: a cultural property) are detected and recorded by an agent, based on a specific source or motivation (e.g.:ithe authorship attribution, commission, etc.) @en
comment: Questa classe rappresenta una situazione in cui viene individuata e registrata da un agente una certa informazione o un gruppo di informazioni relativamente a un oggetto, per esempio a un bene culturale o a una sua parte, supportata da una fonte o motivazione. Per esempio, l'attribuzione di autore, l'individuazione della committenza o delle entità responsabili di fasi successive alla creazione di un bene culturale sono tutte interpretazioni basate su fonti.
label: Interpretation @en
subclass of: Situation
subclass of: Restriction
  on property: ha criterio interpretativo
  some values from: Criterio interpretativo
description: An example of usage of one of the subclasses of the class 'Interpretation' is the following: resource:PreferredAuthorshipAttribution/1200865600-1 a cd:PreferredAuthorshipAttribution ; rdfs:label "Preferred authorship attribution of cultural property: 1200865600"@en ; cd:hasAttributedAuthor resource:Agent/cavaceppi-bartolomeo-1717-1799 ; cd:hasSource resource:Source/documentation . @en
description: Un esempio di utilizzo di una delle sottoclassi della classe "Interpretazione" è il seguente: resource:PreferredAuthorshipAttribution/1200865600-1 a cd:PreferredAuthorshipAttribution ; rdfs:label "Attribuzione di autore preferita, maggiormente accreditata o convincente del bene: 1200865600"@it ; cd:hasAttributedAuthor resource:Agent/cavaceppi-bartolomeo-1717-1799 ; cd:hasSource resource:Source/documentazione .
version info: stabile
version info: stable @en

è provvedimento di tutela di
type: ObjectProperty
comment: This property relates an international or national protective measure to the cultural enitity to which it is applied. @en
comment: Questa proprietà collega un provvedimento di tutela nazionale o internazionale al bene culturale cui si applica.
domain: Provvedimento di tutela
label: is protective measure of @en
range: CulturalEntity
version info: stable @en
version info: stabile
iccd norm tag: ICCD Normativa Trasversale 4.00: TU/NVC

è tipo di documentazione di
type: ObjectProperty
comment: This property relates the type of documentation to its documentation. @en
comment: Questa proprietà collega il tipo di documentazione alla sua documetanzione.
domain: Tipo di documentazione
label: is documentation type of @en
range: Documentazione
sub property of: isTypeOf
version info: stable @en
version info: stabile

Documentazione fotografica
type: Class
comment: Questa classe rappresenta la documentazione fotografica relativa a un oggetto, per esempio a un bene culturale.
comment: This class represents the photographic documentation of an object, e.g. a cultural property. @en
label: Photographic documentation @en
subclass of: Documentazione
subclass of: Restriction
  all values from: Literal
  on property: strisciata/numero fotogramma
subclass of: Restriction
  all values from: Literal
  on property: didascalia
version info: stable @en
version info: stabile
iccd norm tag: ICCD Normativa Trasversale 4.00: DO/FTA

titolo proprio
type: DatatypeProperty
comment: Rappresenta il titolo proprio del soggetto di una stampa, di una matrice incisa o di una fotografia. Per titolo proprio di una stampa si intende il titolo principale nella forma in cui appare sulla stampa o sulla matrice stessa. Per titolo proprio (principale) di una fotografia, si intende nella forma in cui appare nell'immagine (o su uno dei suoi supporti, o nelle schede a campi testuali, o nei commenti sonori presenti all'interno del file contenente l'immagine digitale). Per la normativa F, Il titolo proprio include anche ogni eventuale titolo alternativo (altre denominazioni dell'opera che appaiano insieme al titolo principale) e, facoltativamente, i complementi del titolo proprio (ossia sottotitoli od ulteriori indicazioni che contribuiscono a qualificare più specificamente il contenuto dell'immagine).
comment: This property represents the proper title of a cultural property. @en
domain: CulturalEntity
label: propert title @en
range: Literal
sub property of: titolo
version info: stable @en
version info: stabile
iccd norm tag: Normative S e MI: OG/SGT/SGTP - Normativa F: SG/SGL/SGLT

ha area geografico-culturale
type: ObjectProperty
comment: This property relates a cultural entity's use to its cultural geographical area. @en
comment: Questa proprietà collega l'uso del bene con la sua area geografico-culturale.
domain: Uso
label: has cultural geographic area @en
range: Feature
inverse of: è area geografico-culturale di
version info: stable @en
version info: stabile

numero dell'item all'interno della serie
type: FunctionalProperty
type: DatatypeProperty
comment: This property represents numbering of the photograph within editorial photographic series. @en
comment: Questa proprietà rappresenta la numerazione della fotografia all'interno della serie fotografica editoriale.
domain: Appartenenza a serie fotografica
label: series item number @en
range: Literal
version info: stabile
version info: stable @en
iccd norm tag: ICCD Normativa F: PD/SFI/SFIN

cultural property inventory description
type: DatatypeProperty
comment: This property represents a cultural entity inventory description. @en
comment: Questa proprietà rappresenta la descrizione patrimoniale del bene, con riferimento a quanto inserito nel modello 15 RCS a cura dell'ente competente per tutela. Il dato viene richiesto direttamente agli uffici di catalogo/inventario dei relativi Istituti.
domain: Inventario Patrimoniale
range: Literal
version info: stabile
version info: stable @en
iccd norm tag: ICCD Normativa Trasversale 4.00: UB/INP/INPD

Tipo di opera derivata
type: Class
comment: Questa classe rappresenta il tipo di opera derivata da un bene culturale.
comment: This class represents the type of derivated work of a cultural property. @en
label: Derivated work type @en
subclass of: Type
version info: stabile
version info: stable @en
iccd norm tag: ICCD Normativa F: RO/CRF/CRFT - Normativa S: RO/ADL/ADLL - Normative RA, SMO, PST, S, OA, MI, D, NU: RO/REI/REIT - Normative CA, MA: RO/RIU/RIUT

referto
type: DatatypeProperty
comment: This property represents the report of a anthropological finding's archaeometric and diagnostic investigation. @en
comment: ICCD Normativa Trasversale 4.00: RE/IND/INDT - ICCD Normativa AT 3.00: IN/INI/INIR
comment: Questa proprietà rappresenta il referto di un'indagine archeometrica e diagnostica o di una tipologia particolare di bene archeologico, ovvero i reperti antropologici.
domain: Class
  union of: Indagine su bene archeologico
  union of: Indagine archeometrica e diagnostica
label: report @en
range: Literal
version info: stabile
version info: stable @en

ha immagine di indagine
type: ObjectProperty
comment: Questa proprietà collega una fotointerpretazione o fotorestituzione all'immagine presa in esame nel corso dell'indagine.
comment: This property relates a photo interpretation rendering to the survey image. @en
domain: Fotointerpretazione e fotorestituzione
label: has survey image @en
range: Immagine di indagine
inverse of: è immagine di indagine
version info: stable @en
version info: stabile
iccd norm tag: ICCD Normativa Trasversale 4.00: RE/FOI/FOIT + FOID

Datazione diversa
type: Tipo di datazione alternativa
type: NamedIndividual
comment: This individual represents a different type of dating than the one present in cultural entity's chronological information. @en
comment: Questo individuo rappresenta un tipo di datazione differente rispetto a quella presente nelle informazioni della cronologia del bene in esame.
label: Different dating @en
version info: stable @en
version info: stabile
iccd norm tag: ICCD Normativa Trasversale: DT/ADT/ADTT. @en

è ruolo nell'intervento
type: ObjectProperty
comment: This is the inverse property of "has intervention role". @en
comment: Questa è la proprietà inversa di "ha ruolo nell'intervento".
domain: Role
label: is intervention role in @en
range: Attribuzione di Autore o responsabilità
version info: stabile
version info: stable @en

è origine dell'anomalia di
type: ObjectProperty
comment: This property relates the origin of the anomaly (e.g. natural, unsure) to an anomaly detected during a photo interpretation or rendering survey. @en
comment: Questa proprietà collega l'origine dell'anomalia (naturale, antropica, incerta) all'anomalia rilevata durante una fotointerpretazione o fotorestituzione.
domain: Origine dell'anomalia
label: is anomaly origin of @en
range: Anomalia
sub property of: isCharacteristicOf
version info: stabile
version info: stable @en

specifiche su pasta/argilla
type: DatatypeProperty
comment: Questa proprietà rappresenta le specifiche su eventuali componenti significativi per lo studio del bene, nel caso di analisi su reperti in argilla.
comment: This property represents specifications on any significant components for the study of the entity, in case of analysis on clay findings. @en
domain: Analisi di laboratorio
label: clay specifications @en
range: Literal
sub property of: specifications
version info: stable @en
version info: stabile

data di notifica
type: FunctionalProperty
type: DatatypeProperty
comment: This property represents the date of notification of the administrative provision to the owner. @en
comment: Questa proprietà rappresenta la data della notifica del provvedimento amministrativo al proprietario.
domain: Provvedimento di tutela
label: notice date @en
range: dateTime
sub property of: date
version info: stabile
version info: stable @en
iccd norm tag: ICCD Normativa Trasversale 4.00: TU/NVC/NVCD

ha inventario
type: ObjectProperty
comment: This property relates a cultural property or an entity or an activity related to it to an inventory. @en
comment: Questa proprietà collega un bene culturale o una delle entità o attività collegate al bene culturale a un inventario che registra informazioni relative al bene culturale.
domain: Thing
label: has inventory @en
range: Inventario
inverse of: è inventario di
version info: stabile
version info: stable @en
iccd norm tag: UB/INV; ICCD Normativa Trasversale: UB/INP

ha riproduzione
type: ObjectProperty
comment: This property relates a publication to the print reproduction which is or was part of it. @en
comment: Questa proprietà collega la pubblicazione con la riproduzione della stampa che ne è, o è stata, parte integrante.
domain: Stampa in pubblicazione
label: has reproduction @en
range: Riproduzione
inverse of: è riproduzione di
version info: stabile
version info: stable @en
iccd norm tag: ICCD Normativa S 3: RO/ADL

Documentazione audio
type: Class
comment: Questa classe rappresenta la documentazione audio relativa a un oggetto, per esempio a un bene culturale.
comment: This class represents the audio documentation of an object, e.g. a cultural property. @en
label: Audio documentation @en
subclass of: Documentazione
subclass of: Restriction
  on property: ha formato
  some values from: Class
    intersection of: Tipo di documentazione
    intersection of: Formato
version info: stable @en
version info: stabile
iccd norm tag: DO/REG

è luogo di collocazione di
type: ObjectProperty
comment: Questa proprietà, inversa di 'is located in', collega un bene culturale a un altro bene culturale collegato, che costituisce il luogo di collocazione del primo.
comment: This property, inverse of 'is located in', relates a cultural entity to a connected cultural entity, which constitutes its location area. @en
domain: CulturalEntity
label: is location of @en
range: CulturalEntity
sub property of: è opera collegata a
version info: stable @en
version info: stabile

note su opere collegate
type: DatatypeProperty
comment: Questa proprietà rappresenta note generali sulle relazioni instaurate fra il bene in esame e altre opere.
comment: This property represents general notes on the relationships established between the property in question and other works. @en
domain: CulturalEntity
label: related work note @en
range: Literal
sub property of: note
version info: stable @en
version info: stabile
iccd norm tag: ICCD Normativa Trasversale 4.00: RV/REZ

è tipo di indagine di rilevamento di
type: ObjectProperty
comment: This property relates the type of observation survey (in the context, out of context) to the related observation survey. @en
comment: Questa proprietà collega il tipo di indagine di rilevamento (nel contesto/decontestualizzato) alla relativa indagine di rilevamento.
domain: Tipo di indagine di rilevamento
label: is observation survey type of @en
range: Indagine di rilevamento
sub property of: isTypeOf
version info: stabile
version info: stable @en

ha repertorio
type: ObjectProperty
comment: This property relates a print's copy to its reference catalogue. @en
comment: Questa proprietà collega la copia della stampa con il suo repertorio.
domain: Copia
label: has reference catalogue @en
range: Repertorio
inverse of: è repertorio di riferimento di
version info: stable @en
version info: stabile
iccd norm tag: ICCD Normativa S 3: RO/COP/COPR

codice della collezione
type: DatatypeProperty
type: FunctionalProperty
comment: This property represents the collection identifier. @en
comment: Questa proprietà rappresenta il codice identificativo di una collezione.
domain: CollectionCulEnt
label: collection identifier @en
range: Literal
sub property of: identifier
version info: stable @en
version info: stabile

è tipo di immagine di indagine di
type: ObjectProperty
comment: This property relates the type of a survey image (i.e. aerial photograph, Satellite photograph) to the related survey image. @en
comment: Questa proprietà collega il tipo una immagine di indagine (fotografia aerea o fotografia satellitare). con la relativa immagine di indagine.
domain: Tipo di immagine di indagine
label: is survey image type of @en
range: Immagine di indagine
sub property of: isTypeOf
version info: stabile
version info: stable @en

Attestato di libera circolazione
type: Tipo di certificazione di esportazione o importazione
type: NamedIndividual
label: Free movement certification @en
version info: stable @en
version info: stabile

è bibliografia di
type: ObjectProperty
comment: Questa proprietà collega una bibliografia all'entità alla quale si riferisce.
comment: This property relates a bibliography to the entity which is referred to. @en
domain: Bibliografia
label: is bibliography of @en
range: Thing
version info: stable @en
version info: stabile
iccd norm tag: ICCD Normativa Trasversale 4.00: DO/BIB; RE/RCG/RCGS

è autore secondario di
type: ObjectProperty
comment: Questa proprietà collega l'autore secondario di un entità, come ad esempio un contributo o una parte di una pubblicazione, all'entità stessa.
comment: This property relates the secondary authors of an entity (i.e. a publication's contribution or section) to the related entity. @en
domain: Agent
label: is secondary author of @en
range: Thing
sub property of: è agente correlato a
version info: stable @en
version info: stabile

note interpretative
type: DatatypeProperty
comment: Questa proprietà permette di rappresentare l'interpretazione di un bene culturale, ricavabile dall'osservazione diretta e dai dati conoscitivi disponibili.
comment: This property represents a cultural asset interpretation. @en
domain: CulturalEntity
label: explanation note @en
range: Literal
sub property of: note
version info: stable @en
version info: stabile
iccd norm tag: ICCD Normativa CA: DA/INT - ICCD Normativa TMA: DA/DES/DESI - ICCD Normativa SI: DA/NCS

ha emissione di moneta
type: ObjectProperty
comment: This property relates a numismatic entity to its issuance. @en
comment: Questa proprietà collega un bene numismatico alla sua emissione, o una contromarca a una nuova emissione che sostituisce nominale, autorità emittente, zecca e cronologia della moneta originari.
domain: Class
  union of: CulturalEntity
  union of: Counterstamp
label: has coin issuance @en
range: Emissione di moneta
sub property of: hasSituation
inverse of: è emissione di moneta
version info: stabile
version info: stable @en
iccd norm tag: ICCD Normativa NU: DA/AUE; DA/CON/CONN; DA/CON/CONZ; DA/CON/CONA; DA/CON/CONC - ICCD Normativa OA (dopo il rilascio della specifica scheda NU nel 2004 la scheda OA non è stata più utilizzata per la catalogazione di monete e medaglie): AU/EDT

strisciata/numero fotogramma
type: DatatypeProperty
comment: Questa proprietà rappresenta, per le foto aeree, le informazioni relative alla strisciata e al fotogramma.
comment: This property represents aerial photos information about run and frame. @en
domain: Documentazione fotografica
label: strip run/frame number @en
range: Literal
version info: stabile
version info: stable @en
iccd norm tag: FTAR

Stima di bene culturale
type: Class
comment: This class represents the estimate of a cultural property. @en
comment: Questa classe rappresenta una stima di un bene culturale.
label: Cultural property estimate @en
subclass of: Stima
subclass of: Restriction
  on property: valore del bene culturale
  some values from: Literal
subclass of: Restriction
  on property: è stima del bene culturale
  some values from: CulturalEntity
version info: stabile
version info: stable @en
iccd norm tag: ICCD Normativa Trasversale 4.00: UB/STI

è responsabile dell'attività
type: ObjectProperty
comment: Questa è la proprietà inversa a "ha sponsor dell'attività".
comment: This is the inverse property of "has activity sponsor". @en
domain: Agent
label: is activity responsible of @en
range: Activity
sub property of: è agente correlato a
version info: stabile
version info: stable @en

Opera preparatoria
type: Class
comment: This class represents an entity related to a cultural property, as its preparatory stage. @en
comment: Questa classe rappresenta un'entità collegata a un bene culturale, che ne costituisce una fase preparatoria.
label: Preparatory work @en
subclass of: Opera preparatoria o finale
version info: stable @en
version info: stabile
iccd norm tag: ICCD Normative F, RA, SMO, PST, S, OAC, OA, MI, D, NU: se RO/ROF/ROFF rappresenta uno stadio del bene catalogato riconducibile a una fase finale, per cui è possibile dedurre che l'opera collegata al bene è una sua fase preparatoria.

è fonico dell'indagine di
type: ObjectProperty
comment: Questa proprietà collega il fonico professionista (diverso dal rilevatore) che ha effettuato la registrazione sonora all'indagine di rilevamento di un bene demo-etno-antropologico.
comment: This property relates the sound engineer who recorded an observation survey to the related observation survey of a demo-etno-antropologic entity. @en
domain: Agent
label: is survey sound engineer of @en
range: Indagine di rilevamento
sub property of: è agente correlato a
version info: stable @en
version info: stabile

è membro di un'unità archivistica complessa di
type: ObjectProperty
comment: This property relates a cultural property to the class that represents the membership relation between this cultural property and an archival record set. @en
comment: Questa proprietà collega un bene culturale alla classe che rappresenta l'appartenenza del bene a una unità archivistica complessa.
domain: CulturalEntity
label: is member of archival record set of @en
range: Appartenenza a unità archivistica complessa
version info: stabile
version info: stable @en
iccd norm tag: ICCD Normativa F: UB/UBF

Origine antropica
type: Origine dell'anomalia
type: NamedIndividual
label: Anthropic origin @en

Genere
type: Class
comment: Questa classe rappresenta uno dei livelli di classificazione di una tassonomia biologica, ovvero il genere.
comment: This class represents one level of a biological taxon, the genus. @en
label: Genus @en
subclass of: Concept
subclass of: Restriction
  on property: è genere in
  some values from: Tassonomia biologica
version info: stabile
version info: stable @en
iccd norm tag: ICCD Normativa AT: OG/OGS/OGSG

Tipo di acquisizione
type: Class
comment: This class represents the type of acquisition (e.g. purchase, donation, etc.) of a cultural property. @en
comment: Questa classe rappresenta il tipo di acquisizione (es.: acquisto, alienazione, confisca, donazione) che ha interessato il bene culturale.
label: Acquisition type @en
subclass of: Type
version info: stable @en
version info: stabile
iccd norm tag: ICCD Normativa Trasversale 4.00: TU/ACQ/ACQT

ha tassonomia biologica
type: ObjectProperty
comment: Questa proprietà collega un'entità biologica a una tassonomia.
comment: This property relates a biological entity to a taxon. @en
domain: Thing
label: has biological taxon @en
range: Tassonomia biologica
sub property of: hasClassification
inverse of: è tassonomia biologica di
version info: stabile
version info: stable @en
iccd norm tag: ICCD Normativa AT: OG/OGS

ha mutamento condizione materiale
type: ObjectProperty
comment: This property relates a cultural enity involved in a change of availability event (i.e. theft, destruction, recovery) to the event. @en
comment: Questa proprietà collega un bene culturale coinvolto in un un evento di mutamento di condizione materiale (furto, distruzione, recupero) all'evento stesso.
domain: CulturalEntity
label: has change of availability @en
range: Mutamento condizione materiale
sub property of: hasSituation
inverse of: è mutamento di condizione materiale di
version info: stabile
version info: stable @en

Mutamento condizione materiale
type: Class
comment: Questa classe rappresenta un evento che modifica la disponibilità materiale del bene culturale (es. per distruzione, furto, perdita, recupero)
comment: This class represents the change of availability of a cultural property (e.g.: theft, distruction, rescue, etc.) @en
label: Change of availability @en
subclass of: Situation
subclass of: Restriction
  on property: ha tipo di mutamento condizione materiale
  some values from: Tipo di mutamento condizione materiale
subclass of: Restriction
  on property: è mutamento di condizione materiale di
  some values from: CulturalEntity
description: Un esempio d'uso della classe 'Mutamento condizione materiale' è il seguente: resource:ChangeOfAvailability/0900041230-change-of-availability a cd:ChangeOfAvailability ; rdfs:label "Mutamento condizione materiale del bene culturale: 0900041230"@it ; cd:hasChangeOfAvailabilityType resource:ChangeOfAvailabilityType/furto ; tiapit:time "1998/11/15" .
description: An example of usage of the class 'Change of availability' is the following: resource:ChangeOfAvailability/0900041230-change-of-availability a cd:ChangeOfAvailability ; rdfs:label "Change of availability of cultural property: 0900041230"@en ; cd:hasChangeOfAvailabilityType resource:ChangeOfAvailabilityType/furto ; tiapit:time "1998/11/15" . @en
version info: stabile
version info: stable @en
iccd norm tag: ICCD Normativa Trasversale 4.00: TU/ALN

riutilizza
type: ObjectProperty
comment: This is the invers property of 'is reused by', which relates a cultural entity to a connected cultural entity that reuse it or a part of it. @en
comment: Questa è la proprietà inversa di 'è riutilizzato da', che collega un bene culturale a un altro bene culturale collegato che lo riutilizza in tutto o in parte.
domain: CulturalEntity
label: reuses @en
range: CulturalEntity
sub property of: è opera collegata a
version info: stabile
version info: stable @en

codice identificativo locale della ricognizione archeologica
type: FunctionalProperty
type: DatatypeProperty
comment: Questa proprietà rappresenta il codice identificativo, numerico o alfanumerico, che individua la ricognizione archeologica in modo univoco nell'ambito di un repertorio locale.
comment: This property represents the identification code, numeric or alphanumeric, which identifies the field survey unambiguously in the context of a local repertoire. @en
domain: Ricognizione archeologica
label: archaeological field survey local identifier @en
range: Literal
sub property of: localIdentifier
version info: stabile
version info: stable @en
iccd norm tag: ICCD Normativa Trasversale 4.00: RE/RCG/RCGH

ha responsabile di numero di inventario
type: ObjectProperty
comment: Questa proprietà collega un inventario al contenitore giuridico che conserva attualmente il bene o che lo ha conservato in passato, e che è responsabile dell'assegnazione del numero di inventario.
comment: This property relates an inventory to the juridical container responsible for the inventory identifier of the cultural property. @en
domain: Inventario
label: has inventory identifier responsible @en
range: Agent
sub property of: ha agente correlato
inverse of: è responsabile di numero di inventario di
version info: stable @en
version info: stabile
iccd norm tag: ICCD Normativa Trasversale: UB/INV/INVG

Bibliografia
type: Class
comment: This class represents the bibliography of an entity, e.g. a cultural property. @en
comment: Questa classe rappresenta un riferimento bibliografico che riguarda un'entità, per esempio un bene culturale.
label: Bibliography @en
subclass of: Object
subclass of: Restriction
  all values from: anyURI
  on property: URL
subclass of: Restriction
  all values from: Literal
  on property: abbreviazione
subclass of: Restriction
  all values from: Tipo di bibliografia
  on property: ha tipo di bibliografia
subclass of: Restriction
  all values from: Literal
  on property: specifications
subclass of: Restriction
  on property: riferimento bibliografico completo
  some values from: Literal
subclass of: Restriction
  on property: è bibliografia di
  some values from: Thing
subclass of: Restriction
  all values from: Genere della bibliografia
  on property: hasCategory
subclass of: Restriction
  all values from: Literal
  on property: codice univoco ICCD della bibliografia
subclass of: Restriction
  all values from: Edizione
  on property: ha edizione
version info: stable @en
version info: stabile
iccd norm tag: ICCD Normativa Trasversale 4.00: DO/BIB; RE/RCG/RCGS - Normative VeAC e AT 3.01: DO/BIB; DO/BSE.

provvisoria
type: Tipo di certificazione di esportazione o importazione
type: NamedIndividual
label: unstable @en
label: Temporary export license @en
label: Licenza di esportazione temporanea

è documentazione primaria di
type: ObjectProperty
comment: Questa è la proprietà inversa di "ha documentazione primaria".
comment: This is the inverse property of "has primary documentation". @en
domain: Documentazione
label: is primary documentation of @en
range: CulturalEntity
sub property of: è documentazione di
version info: stable @en
version info: stabile

intervento dell'autore
type: DatatypeProperty
comment: Questa proprietà rappresenta specifiche relative all'intervento effettuato dall'autore sul bene culturale.
comment: This property represents specifications relating to the intervention carried out by the author on the cultural property. @en
domain: Class
  union of: Attribuzione Alternativa di Autore
  union of: Attribuzione Primaria di Autore
label: author intervention @en
range: Literal
version info: stable @en
version info: stabile
iccd norm tag: AU/AUT/AUTY

è formato di
type: ObjectProperty
comment: This property relates the format to the related documentation. @en
comment: Questa proprietà collega il formato con la relativa documentazione.
domain: Formato
label: is format of @en
range: Documentazione
sub property of: isDescriptionOf
version info: stabile
version info: stable @en

Fotografia aerea
type: Tipo di immagine di indagine
type: NamedIndividual
label: Aerial photograph @en

ha funzione d'uso
type: ObjectProperty
comment: Questa proprietà collega un'entità alla sua funzione d'uso.
comment: This property relates an entity to its use function. @en
domain: Thing
label: has use function @en
range: Funzione d'uso
inverse of: è funzione d'uso di
version info: stable @en
version info: stabile
iccd norm tag: ICCD Normativa Trasversale: UT/UTU/UTUF; LC/LDC/LDCF; LA/PRC/PRCF - BDM 2.00:UT/UTF - PST 3.01: DA/UTF

è immagine di indagine
type: ObjectProperty
comment: This is the inverse property of "has survey image". @en
comment: Questa è la proprietà inversa di "ha immagine di indagine".
domain: Immagine di indagine
label: is survey image of @en
range: Fotointerpretazione e fotorestituzione
version info: stabile
version info: stable @en

Funzione d'uso
type: Class
comment: This class represents the use function of an object. @en
comment: Questa classe rappresenta la funzione d'uso che ha un oggetto.
label: Use function @en
subclass of: Role
subclass of: Restriction
  on property: funzione d'uso
  some values from: Literal
version info: stable @en
version info: stabile
iccd norm tag: ICCD Normativa Trasversale: UT/UTU/UTUF; LC/LDC/LDCF; LA/PRC/PRCF - BDM 2.00:UT/UTF - PST 3.01: DA/UTF

ha rapporto con opera collegata
type: ObjectProperty
comment: Questa proprietà collega un bene culturale alla relazione tra il bene stesso e un'altra opera che ne costituisce una fase preparatoria o che ne rappresenta la fase finale, e in riferimento alla quale il bene culturale si trova in un determinato stadio.
comment: This property relates a cultural property to a situation in which this cultural property is related to another work, that could even be another cultural property, as its preparatory or final phase. @en
domain: CulturalEntity
label: has related work situation @en
range: Rapporto con opera collegata
sub property of: hasSituation
inverse of: è rapporto con opera collegata di
version info: stable @en
version info: stabile

Categoria SEC
type: Class
comment: This class represents the patrimonial category of a cultural property, referring to the SEC classification 1995. @en
comment: Questa classe rappresenta la categoria patrimoniale del bene, con riferimento alla classificazione del Sistema Europeo dei Conti 1995
label: SEC Category @en
subclass of: Category
subclass of: Restriction
  all values from: Inventario Patrimoniale
  on property:
    inverse of: ha categoria SEC
version info: stable @en
version info: stabile
iccd norm tag: ICCD Normativa Trasversale 4.00: UB/INP/INPZ

ha circostanza
type: ObjectProperty
comment: Questa proprietà collega una situazione all'occasione che ha determinato quella situazione. Per esempio, può collegare una situazione in cui viene indicata la committenza di un bene culturale all'occasione che ha determinato quella committenza, oppure un luogo di ripresa di un bene fotografico all'occasione che ha determinato il motivo della ripresa, o ancora l'uso di un bene culturale all'occasione d'uso.
comment: This property relates a situation to the circumstance which led to the situation. For example it can connect a situation where is indicated a cultural entity's committment to its circumstance. @en
domain: Thing
label: has circumstance @en
range: Occasione
sub property of: hasSituation
inverse of: è circostanza di
version info: stable @en
version info: stabile
iccd norm tag: ICCD Normativa Trasversale: UT/UTU/UTUO; normativa BDM: UT/UTO; AU/CMM/CMMC; normativa VeAC: AU/FRU/FRUC; normativa F: LR/LRO - ICCD Normativa MI: AU/DDC/DDCC

Analisi di laboratorio
type: Class
comment: Questa classe rappresenta un tipo particolare di indagine su bene culturale, ovvero un'analisi di laboratorio.
comment: This class represents a particular type of survey on a cultural property, that is a laboratory test. @en
label: Laboratory test @en
subclass of: Indagine
subclass of: Restriction
  all values from: Literal
  on property: specifiche su pasta/argilla
subclass of: Restriction
  all values from: Tipo di analisi di laboratorio
  on property: ha tipo di analisi di laboratorio
version info: stabile
version info: stable @en
iccd norm tag: ICCD Normative NU, RA, BNB, MA, CA: RS/ALB

è musicista di
type: ObjectProperty
comment: This property relates the person who plays (in the present or past) a certain role as a musical instrument's exectutor to the related instrument. @en
comment: Questa proprietà collega una persona che assume - o ha assunto - un ruolo certo come esecutore di uno strumento musicale al relativo strumento.
domain: Agent
label: is musician of @en
range: CulturalEntity
sub property of: è agente correlato a
version info: stable @en
version info: stabile

Bibliografia di corredo
type: Genere della bibliografia
type: NamedIndividual
comment: This individual represents the definition relative to the genre of bibliography. @en
comment: Questo individuo rappresenta la definizione (vocabolario chiuso) relativa al genere di bibliografia che riguarda in modo più generico il contesto in cui si è venuto a trovare il bene nel corso della sua storia.
label: Accompanying bibliography @en
version info: stable @en
version info: stabile

Documentazione allegata
type: Genere della documentazione
type: NamedIndividual
comment: This individual represents documenation definition included inside catalog. @en
comment: Questo individuo rappresenta la definizione (vocabolario chiuso) della documentazione acclusa alla scheda di catalogo.
label: Attached documentation @en
version info: stable @en
version info: stabile

Sottoserie archivistica
type: Class
comment: This class represents an archival subseries, that is component of an archival series. @en
comment: Questa classe rappresenta una sottoserie archivistica, ovvero una partizione interna alla serie.
label: Archival subseries @en
subclass of: Unità archivistica complessa
subclass of: Restriction
  all values from: Serie archivistica
  on property: isComponentOf
version info: stable @en
version info: stabile
iccd norm tag: ICCD Normativa F: UB/UBF/UBFT

Conferma di avvenuta spedizione
type: Tipo di certificazione di esportazione o importazione
type: NamedIndividual
label: Delivery confirmation certification @en
version info: stable @en
version info: stabile

ha membro di collezione
type: ObjectProperty
comment: This property relates the membership of a movable cultural entity to a collection in a time interval. It is the inverse property of "isMemberofCollection". @en
comment: Questa proprietà, inversa a "è membro di collezione", collega l'appartenenza di un bene culturale a una collezione in un certo intervallo di tempo al bene culturale mobile coinvolto nella relazione.
domain: Appartenenza a Collezione
label: has member of collection @en
range: CulturalEntity
inverse of: è membro di collezione di
version info: stable @en
version info: stabile
iccd norm tag: UB/COL

ha unità archivistica complessa
type: ObjectProperty
comment: Questa proprietà, inversa a "è unità archivistica complessa in", collega il rapporto tra una unità archivistica complessa e un bene culturale che ne fa parte alla unità archivistica stessa.
comment: This property relates the relationship of an archival set and a one of its belonging cultural entities. @en
domain: Appartenenza a unità archivistica complessa
label: has archival record set @en
range: Unità archivistica complessa
inverse of: è unità archivistica complessa in
version info: stable @en
version info: stabile
iccd norm tag: ICCD Normativa F: UB/UBF

Attestato di circolazione temporanea
type: Tipo di certificazione di esportazione o importazione
type: NamedIndividual
label: Temporary movement certification @en
version info: stable @en
version info: stabile

ha stima
type: ObjectProperty
comment: This property relates an entity to its estimate. @en
comment: Questa proprietà collega un'entità a una sua stima.
domain: Thing
label: has estimate @en
range: Stima
sub property of: hasSituation
inverse of: è stima di
version info: stabile
version info: stable @en
iccd norm tag: ICCD Normativa Trasversale 4.00: UB/STI - ICCD Normative di versione 2.00: UB/INV/INVS

Strumento urbanistico-territoriale
type: Class
comment: Questa classe rappresenta uno strumento urbanistico-territoriale, ovvero un piano regolatore generale e particolareggiato o un piano paesaggistico che interessa un bene culturale.
comment: This class represents a urban planning instrument, related to a cultural property. @en
label: Urban planning instrument @en
subclass of: Object
subclass of: Restriction
  all values from: Agent
  on property: ha ente che ha emanato il provvedimento
subclass of: Restriction
  all values from: Intervento ammesso
  on property: ha intervento ammesso
subclass of: Restriction
  on property: è strumento urbanistico-territoriale di
  some values from: CulturalEntity
version info: stabile
version info: stable @en
iccd norm tag: ICCD Normativa Trasversale 4.00: TU/STU

Certificato di avvenuta importazione
type: Tipo di certificazione di esportazione o importazione
type: NamedIndividual
label: Import confirmation certification @en
version info: stable @en
version info: stabile

Inventario
type: Class
comment: This class represents an inventory about a cultural property or about an entity or an activity related to the cultural property. @en
comment: Questa classe rappresenta un inventario, di vario tipo, relativo a un bene culturale o relativo a una delle entità o attività collegate al bene culturale (per esempio un inventario di scavo archeologico).
label: Inventory @en
subclass of: Object
subclass of: Restriction
  all values from: Literal
  on property: collocazione dell'inventario
subclass of: Restriction
  on property: codice d'inventario
  some values from: Literal
subclass of: Restriction
  all values from: Agent
  on property: ha responsabile di numero di inventario
subclass of: Restriction
  on property: è inventario di
  some values from: Thing
version info: stable @en
version info: stabile
iccd norm tag: ICCD Normativa Trasversale 4.00: UB/INV; ICCD Normativa RA 3.00 RE/DSC/DSCI

ha luogo di collocazione
type: ObjectProperty
comment: This property relates a cultural entity to a connected cultural entity which constitutes its location area. @en
comment: Questa proprietà collega un bene culturale a un altro bene culturale collegato, che ne costituisce il luogo di collocazione.
domain: CulturalEntity
label: è contenuto in
label: is located in @en
range: CulturalEntity
sub property of: ha opera collegata
inverse of: è luogo di collocazione di
version info: stable @en
version info: stabile
iccd norm tag: ICCD Normativa Trasversale 4.00: RV/RSE/RSER = 'è contenuto in' (versioni precedenti: 'luogo di collocazione/localizzazione'; 'scheda contenitore')

ha intervento ammesso
type: ObjectProperty
comment: This property relates a urban planning instrument to the eligible intervention (e.g.: conservation intervention/ exceptional maintenance). @en
comment: Questa proprietà collega uno strumento urbanistico-territoriale all'intervento ammesso dalla normativa specifica (es.: restauro/ manutenzione straordinaria).
domain: Strumento urbanistico-territoriale
label: has eligible intervention @en
range: Intervento ammesso
inverse of: è intervento ammesso da
version info: stable @en
version info: stabile
iccd norm tag: ICCD Normativa Trasversale 4.00: TU/STU/STUN

ha soggetto
type: ObjectProperty
comment: Questa proprietà collega un bene culturale, un'opera correlata a un bene culturale in quanto sua fase preparatoria o finale, o un apparato iconografico-decorativo di un bene culturale al suo soggetto o motivo ornamentale.
comment: This property relates a cultural property or a preparatory or final work of a cultural property to ist subject or ornamental motif. @en
domain: Thing
label: has subject @en
range: Soggetto
inverse of: è soggetto di
version info: stabile
version info: stable @en
iccd norm tag: ICCD Normativa Trasversale: DA/AID/AIDI - Normativa F: SG/SGT/SGTI - Altre normative di versioni precedenti alla 4.00: OG/SGT/SGTI - ICCD Normative F, RA, SMO, PST, S, OAC, OA, MI, D, NU: RO/ROF/ROFS

Titolo storicizzato
type: Tipo di Titolo
type: NamedIndividual
label: Historicized title @en
iccd norm tag: ICCD Normativa FF: se PA/PAC/PACG = 'storicizzata'

autore e data della tassonomia
type: FunctionalProperty
type: DatatypeProperty
comment: This property represents the author that described the species and the date of description. @en
comment: Questa proprietà rappresenta l'autore che ha descritto la specie e l'anno di descrizione.
domain: Tassonomia biologica
label: taxon author and date @en
range: Literal
version info: stable @en
version info: stabile
iccd norm tag: ICCD Normativa AT: OG/OGS/OGSA

è soggetto di
type: ObjectProperty
comment: This property relates a subject or ornamental motif to the cultural property or to the final or preparatory work of a cultural property. @en
comment: Questa proprietà, inversa a "ha soggetto", collega un soggetto o motivo ornamentale al bene culturale o a un'opera correlata a un bene culturale in quanto sua fase preparatoria o finale o a un apparato iconografico-decorativo su cui è rappresentato.
domain: Soggetto
label: is subject of @en
range: Thing
version info: stabile
version info: stable @en
iccd norm tag: ICCD Normativa Trasversale: DA/AID/AIDI - Normativa F: SG/SGT/SGTI - Altre normative di versioni precedenti alla 4.00: OG/SGT/SGTI - ICCD Normative F, RA, SMO, PST, S, OAC, OA, MI, D, NU: RO/ROF/ROFS

è uso di
type: ObjectProperty
comment: Questa proprietà collega l'uso di un bene culturale con il bene culturale stesso.
comment: This property relates the use of a cultural entity to the related cultural property. @en
domain: Uso
label: is use of @en
range: CulturalEntity
sub property of: isDescriptionOf
version info: stable @en
version info: stabile

codice identificativo della documentazione
type: DatatypeProperty
type: FunctionalProperty
comment: Questa proprietà rappresenta una sequenza numerica o alfanumerica che identifica la scheda a cui il documento si riferisce.
comment: This property represents a numeric or alphanumeric sequence that identifies the record to which the document refers. @en
domain: Documentazione
label: documentation identifier @en
range: Literal
sub property of: identifier
version info: stabile
version info: stable @en
iccd norm tag: ICCD Normativa Trasversale 4.00: DO/FTA/FTAN; DO/DRA/DRAN; DO/VDC/VDCN; DO/REG/REGN; DO/FNT/FNTI

Appartenenza
type: Class
comment: Questa classe rappresenta il concetto di appartenenza.
comment: This class represents the concept of membership. @en
label: Membership @en
subclass of: Situation
description: An example of usage of one of the subclasses of the class 'Membership' is the following: resource:CollectionMembership/0300633618-collection-membership-1 a cd:CollectionMembership ; rdfs:label "Collection membership 1 of cultural property: 0300633618"@en ; cd:hasCollection resource:CollectionOfCulturalEntities/collezione-mingozzi ; cd:hasMemberOfCollection resource:ScientificOrTechnologicalHeritage/0300633618 ; tiapit:atTime resource:TimeInterval/1967 . @en
description: Un esempio d'uso di una delle sottoclassi della classe 'Appartenenza' è il seguente: resource:CollectionMembership/0300633618-collection-membership-1 a cd:CollectionMembership ; rdfs:label "Appartenenza a collezione 1 del bene culturale: 0300633618"@it ; cd:hasCollection resource:CollectionOfCulturalEntities/collezione-mingozzi ; cd:hasMemberOfCollection resource:ScientificOrTechnologicalHeritage/0300633618 ; tiapit:atTime resource:TimeInterval/1967 .
version info: stabile
version info: stable @en

titolo alternativo
type: DatatypeProperty
comment: Questa proprietà rappresenta un altro titolo noto del soggetto, in alternativa o in aggiunta al titolo più noto o accreditato.
comment: This property represents an entity's alternative title. @en
domain: CulturalEntity
label: alternative title @en
range: Literal
sub property of: titolo
version info: stabile
version info: stable @en
iccd norm tag: ICCD Normativa Trasversale: DA/AID/AIDN

Occasione legata alla socialità quotidiana
type: Class
comment: Questa classe rappresenta un'occasione connessa alla socialità quotidiana (balli, caffè, veglie, osterie)
comment: This class represents a circumstance related to social interaction (dances, pubs, wakes) @en
label: Social interaction circumstance @en
subclass of: Occasione
version info: stabile
version info: stable @en
iccd norm tag: ICCD Normativa BDI 4.00: CA/CAO/CAOQ

Fonti e documenti
type: Class
comment: This class represents source and document related to an object, e.g. a cultural property. @en
comment: Questa classe rappresenta le fonti e i documenti testuali editi e inediti relativi a un oggetto, per esempio a un bene culturale.
label: Source and document @en
subclass of: Documentazione
subclass of: Restriction
  all values from: Literal
  on property: foglio
version info: stable @en
version info: stabile
iccd norm tag: ICCD Normativa Trasversale 4.00: DO/FNT

è oggetto associato a
type: ObjectProperty
comment: This is the inverse property of "has associated object". @en
comment: Questa è la proprietò inversa a "ha oggetto associato".
domain: Object
label: is object associated to @en
range: Contesto di rinvenimento
version info: stabile
version info: stable @en

Uso
type: Class
comment: Questa classe rappresenta l'uso del bene, che può variare nel corso del tempo, a seconda delle diverse occasioni e delle parti utilizzate del bene.
comment: This class represents the use of a cultural property, that can change over time, depending on the circumstances and on which parts of the cultural property are used. @en
label: Use @en
subclass of: Description
subclass of: Restriction
  all values from: Specifiche del tipo d'uso
  on property: ha specifiche del tipo d'uso
subclass of: Restriction
  all values from: Literal
  on property: modalità di uso
subclass of: Restriction
  all values from: Literal
  on property: funzione d'uso
subclass of: Restriction
  on property: ha funzione d'uso
  some values from: Funzione d'uso
subclass of: Restriction
  on property: è uso di
  some values from: CulturalEntity
subclass of: Restriction
  all values from: Occasione
  on property: ha circostanza
subclass of: Restriction
  all values from: Tipo d'uso
  on property: ha tipo d'uso
version info: stable @en
version info: stabile
iccd norm tag: ICCD Normativa Trasversale 4.00: UT

cronologia specifica di
type: ObjectProperty
comment: Questa proprietà collega la cronologia specifica, cioè la cronologia in anni (anche a cavallo di secoli diversi) o con date precise (nella forma "aaaa/mm/gg") con l'evento (realizzazione, demolizione, etc.) cui si riferisce una specifica cronologia di un bene culturale.
comment: This property relates the "specific time", as the dating expressed in year or as a date yyyy/mm/dd, with the event (creation, distruction) to which a dating of a cultural property is related to. @en
domain: TimeInterval
label: specific time of @en
range: EventOrSituation
version info: stable @en
version info: stabile

è acquisizione di
type: ObjectProperty
comment: This property relates an acquisition event to the cultural entity involved in the acquisition. @en
comment: Questa proprietà collega un evento di acquisizione al bene culturale coinvolto nell'acquisizione.
domain: Acquisizione
label: is acquisition of @en
range: CulturalEntity
sub property of: isSituationOf
version info: stable @en
version info: stabile
iccd norm tag: ICCD Normativa Trasversale 4.00: TU/ACQ

è posizione della riproduzione di
type: ObjectProperty
comment: Questa proprietà collega la posizione fisica della riproduzione di una stampa all'interno di una pubblicazione (es.: frontespizio, copertina, colophon, etc.). con la relativa riproduzione della stampa.
comment: This property relates the position of the print reproduction in a publication to the print reproduction itself. @en
domain: Posizione della riproduzione
label: is reproduction position of @en
range: Riproduzione
version info: stabile
version info: stable @en

Indagine
type: Class
comment: This class represents a survey carried out on a cultural property, that is an activity related to a cultural property and carried out for its identification, study or observation of its technical characteristics. @en
comment: Questa classe rappresenta un'indagine effettuata su un bene culturale. Per indagine, si intende un'attività che riguarda il bene, effettuata per la sua individuazione (nel caso dei beni archeologici), per il suo studio e per l'approfondimento delle sue caratteristiche tecniche (indagini di scavo, di ricognizione, indagini geognostiche, analisi di vario genere e tipo, etc.). Questa classe viene specializzata in sottoclassi, per la rappresentazione di tipologie di indagini specifiche.
label: Survey @en
subclass of: Activity
subclass of: Restriction
  on property: è indagine su
  some values from: CulturalEntity
description: Un esempio d'uso di una delle sottoclassi della classe "Indagine" è il seguente: resource:ArchaeologicalExcavation/0500590557-survey-1 a cd:ArchaeologicalExcavation ; rdfs:label "Scavo archeologico 1 del bene 0500590557: Monselice, via Valli"@it ; cd:hasActivityResponsible resource:Agent/sba ; cd:hasStratigraphicUnit resource:StratigraphicUnit/325 ; cd:hasSurveyMethod resource:SurveyMethod/scavo-stratigrafico ; cd:hasSurveyMotivation resource:SurveyMotivation/opere-pubbliche ; cd:hasSurveyScientificDirector resource:Agent/bianchin-citton-elodia ; core:hasAgentRole resource:AgentRole/0500590557-archaeological-excavation-1-activity-responsible , resource:AgentRole/0500590557-archaeological-excavation-1-scientific-director ; tiapit:time "2004" .
description: An example of usage of one of the subclasses of the class 'Survey' is the following: resource:ArchaeologicalExcavation/0500590557-survey-1 a cd:ArchaeologicalExcavation ; rdfs:label "Archaeological excavation 1 of cultural property 0500590557: Monselice, via Valli"@en ; cd:hasActivityResponsible resource:Agent/sba ; cd:hasStratigraphicUnit resource:StratigraphicUnit/325 ; cd:hasSurveyMethod resource:SurveyMethod/scavo-stratigrafico ; cd:hasSurveyMotivation resource:SurveyMotivation/opere-pubbliche ; cd:hasSurveyScientificDirector resource:Agent/bianchin-citton-elodia ; core:hasAgentRole resource:AgentRole/0500590557-archaeological-excavation-1-activity-responsible , resource:AgentRole/0500590557-archaeological-excavation-1-scientific-director ; tiapit:time "2004" . @en
version info: stabile
version info: stable @en
iccd norm tag: ICCD Normativa Trasversale 4.00: RE; CM/ISP - ICCD Normative NU, RA, BNB, MA, CA: RS/ALB - ICCD Normativa AT 3.00: IN/INI - ICCD Normativa SM: DR

Unità stratigrafica
type: Class
comment: This class represents a stratigraphic unit from which a cultural property may come from. @en
comment: Questa classe rappresenta l'unità stratigrafica dalla quale può provenire un bene culturale.
label: Stratigraphic unit @en
subclass of: Location
subclass of: Restriction
  all values from: Scavo archeologico
  on property: è unità stratigrafica di
version info: stabile
version info: stable @en
iccd norm tag: ICCD Normativa Trasversale 4.00: RE/DSC/DSCU

è specifica del tipo di uso di
type: ObjectProperty
comment: Questa proprietà collega le specifiche relative al tipo di utilizzo di un bene con il relativo uso.
comment: This property relates the specification of the type of a cultural property use to the related use. @en
domain: Specifiche del tipo d'uso
label: is use type specification of @en
range: Uso
sub property of: hasConcept
version info: stabile
version info: stable @en

Occasione legata al ciclo stagionale
type: Class
comment: Questa classe rappresenta un'occasione legata ai cicli stagionali, ovvero cicli che si riferiscono a: oggetto di concezioni, credenze, mito, scienza, di elaborazione in poesia, prosa, canto, arte e di culto; riferimento di attività, pratiche, comportamenti, di dati o fenomeni a particolari cicli, giorni, settimane, lunazioni, mesi, stagioni ecc.; giorni e periodi fausti e infausti.
comment: This class represents a circumstance related to seasonal cycles, referred to: subject of popular belief, myth, science; poetry, prose, songs, art, ritual; practical activities, behaviour, phenomena connected to specific cycles, days, months, seasons; fortunate or unfortunate days and periods. @en
label: Season cycle circumstance @en
subclass of: Occasione
version info: stabile
version info: stable @en
iccd norm tag: ICCD Normativa BDI 4.00: CA/CAO/CAOS

ha tipo di circostanza
type: ObjectProperty
comment: This property relates the circumstance to its type. @en
comment: Questa proprietà collega un'occasione con il tipo di occasione.
domain: Occasione
label: has circumstance type @en
range: Tipo di circostanza
sub property of: hasType
inverse of: è tipo di circostanza di
version info: stable @en
version info: stabile
iccd norm tag: ICCD Normativa BDI: CA/CAR; CA/CAC

è strumento urbanistico-territoriale di
type: ObjectProperty
comment: Questa proprietà collega uno strumento urbanistico-territoriale, ovvero un piano regolatore generale e particolareggiato o un piano paesaggistico che interessa un bene culturale al bene stesso.
comment: This class relates a urban planning instrument to the related cultural property. @en
domain: Strumento urbanistico-territoriale
label: is urban planning instrument of @en
range: CulturalEntity
version info: stable @en
version info: stabile
iccd norm tag: ICCD Normativa Trasversale 4.00: TU/STU

Ontologia della Descrizione di Contesto (ArCo network)
type: Ontology
comment: The Context Description module includes models for the context of a cultural property, in a broad sense: agents (e.g.: author, collector, copyright holder), objects (e.g.: inventories, bibliography, protective measures, other cultural properties, collections etc.), activities (e.g.: surveys, conservation interventions), situations (e.g.: commission, coin issuance, estimate, legal situation) related, involved or involving the cultural property. Thus it represents attributes that do not result from a measurement of features in a cultural property, but are associated with it. In this module are used as template the following Ontology Design Patterns: - http://www.ontologydesignpatterns.org/cp/owl/collectionentity.owl - http://www.ontologydesignpatterns.org/cp/owl/countingas.owl - http://www.ontologydesignpatterns.org/cp/owl/agentrole.owl - http://www.ontologydesignpatterns.org/cp/owl/classification.owl - http://mklab.iti.gr/pericles/BornDigitalArchives_ODP.owl - http://www.ontologydesignpatterns.org/cp/owl/place.owl - http://www.ontologydesignpatterns.org/cp/owl/situation.owl @en
comment: Questo modulo, detto della descrizione di contesto, include le informazioni che riguardano il contesto (inteso in senso ampio) in cui il bene culturale viene a trovarsi nel corso della sua storia. Fanno per esempio parte delle informazioni di contesto: autore, committente, collezione, ambito culturale, eventi coinvolti, contenitore giuridico, utente, circostanza, modalità di fruizione, bibliografia, documentazione collegata, collocazione in un determinato inventario, etc. Dunque, rappresenta attributi che non sono il risultato di una misurazione condotta sul bene culturale, ma che sono associati al bene culturale. In questo modulo sono riusati come template i seguenti Ontology Design Patterns: - http://www.ontologydesignpatterns.org/cp/owl/collectionentity.owl - http://www.ontologydesignpatterns.org/cp/owl/countingas.owl - http://www.ontologydesignpatterns.org/cp/owl/agentrole.owl - http://www.ontologydesignpatterns.org/cp/owl/classification.owl - http://mklab.iti.gr/pericles/BornDigitalArchives_ODP.owl - http://www.ontologydesignpatterns.org/cp/owl/place.owl - http://www.ontologydesignpatterns.org/cp/owl/situation.owl
label: Context Description Ontology (ArCo network) @en
creator: Valentina Carriero (ISTC-CNR, STLab)
creator: Marialetizia Mancinelli (MiBACT, ICCD)
creator: Aldo Gangemi (ISTC-CNR, STLab)
creator: Valentina Presutti (ISTC-CNR, STLab)
creator: Ludovica Marinucci (ISTC-CNR, STLab)
creator: Chiara Veninata (MiBACT, ICCD)
creator: Andrea Nuzzolese (ISTC-CNR, STLab)
description: The Context Description module includes models for the context of a cultural property, in a broad sense: agents (e.g.: author, collector, copyright holder), objects (e.g.: inventories, bibliography, protective measures, other cultural properties, collections etc.), activities (e.g.: surveys, conservation interventions), situations (e.g.: commission, coin issuance, estimate, legal situation) related, involved or involving the cultural property. Thus it represents attributes that do not result from a measurement of features in a cultural property, but are associated with it. @en
description: Questo modulo, detto della descrizione di contesto, include le informazioni che riguardano il contesto (inteso in senso ampio) in cui il bene culturale viene a trovarsi nel corso della sua storia. Fanno per esempio parte delle informazioni di contesto: autore, committente, collezione, ambito culturale, eventi coinvolti, contenitore giuridico, utente, circostanza, modalità di fruizione, bibliografia, documentazione collegata, collocazione in un determinato inventario, etc. Dunque, rappresenta attributi che non sono il risultato di una misurazione condotta sul bene culturale, ma che sono associati al bene culturale.
language: ITA
language: ENG
issued: 2018-03-07
license: A31 CCBYSA40
license: https://creativecommons.org/licenses/by-sa/4.0/
modified: 2019-06-01
reuses pattern as template: collectionentity.owl
reuses pattern as template: countingas.owl
reuses pattern as template: situation.owl
reuses pattern as template: agentrole.owl
reuses pattern as template: classification.owl
reuses pattern as template: BornDigitalArchives ODP.owl
reuses pattern as template: place.owl#
imports: core
imports: catalogue
version info: Version 1.0 @en
version info: Versione 1.0

Occasione civile
type: Tipo di circostanza
type: NamedIndividual
label: Civil circumstance @en

è ente schedatore dell'authority file di
type: ObjectProperty
comment: Questa proprietà collega l'ente schedatore dell'authority file a un'entità descritta in una scheda di Authority File.
comment: This property relates the file's cataloguing institution to an entity described in a authority file. @en
domain: Agent
label: is authority file cataloguing agency of @en
range: Thing
sub property of: è agente correlato a
version info: stabile
version info: stable @en

Occasione legata al ciclo dell'anno
type: Class
comment: Questa classe rappresenta un'occasione legata ai cicli dell'anno (es.: equinozio autunno, capodanno, Quaresima, Ramadan, carnevale, etc.)
comment: This class represents a circumstance related to year cycles (e.g.: autumnal equinox, New Year's Eve, Lent, Ramadan, carnival, etc.) @en
label: Year cycle circumstance @en
subclass of: Occasione
version info: stabile
version info: stable @en
iccd norm tag: ICCD Normativa BDI 4.00: CA/CAO/CAOA

titolo parallelo
type: DatatypeProperty
comment: Questa proprietà rappresenta un titolo parallelo, cioè lo stesso titolo principale tradotto in altre lingue e presentato come equivalente.
comment: This property represents the parallel title of a cultural property. @en
domain: CulturalEntity
label: parallel title @en
range: Literal
sub property of: titolo
version info: stable @en
version info: stabile
iccd norm tag: Normativa F: SG/SGL/SGLL - Normative S e MI: OG/SGT/SGTR

è fotografo dell'indagine di
type: ObjectProperty
comment: Questa proprietà collega il fotografo professionista (diverso dal rilevatore) che ha effettuato l'indagine all'indagine di rilevamento di un bene demo-etno-antropologico.
comment: This property relates the professional photographer who took the shot to the observation survey of a demo-etno-antropologic entity. @en
domain: Agent
label: is observation photographer of @en
range: Indagine di rilevamento
sub property of: è agente correlato a
version info: stable @en
version info: stabile

ha specie
type: ObjectProperty
type: FunctionalProperty
comment: Questa proprietà collega una tassonomia biologica alla specie, che è uno dei concetti della tassonomia.
comment: This property relates a biological taxon to the subspecies, that is one of the concept of the taxon. @en
domain: Tassonomia biologica
label: has species @en
range: Specie
sub property of: hasConcept
inverse of: è specie in
version info: stabile
version info: stable @en
iccd norm tag: ICCD Normativa AT: OG/OGS/OGSN

ha scala
type: ObjectProperty
comment: This property relates the graphic or cartographic documentation to its representation scale. @en
comment: Questa proprietà collega la documentazione grafica e cartografica alla sua scala di rappresentazione.
domain: Documentazione grafica e cartografica
label: has scale @en
range: Scala
inverse of: è scala di
version info: stabile
version info: stable @en
iccd norm tag: ICCD Normativa Trasversale: DO/DRA/DRAS

ha criterio interpretativo
type: ObjectProperty
comment: This property relates an authorship, dating, commission, or other interpretation situations, to the reason or criterion which led to that interpretation. @en
comment: Questa proprietà associa una attribuzione di autore/responsabilità, una cronologia, una committenza, o altre situazioni che prevedono una interpretazione, alla motivazione o criterio che hanno determinato quella interpretazione.
domain: Thing
label: has interpretation criterion @en
range: Criterio interpretativo
sub property of: hasDescription
inverse of: è criterio interpretativo di
version info: stabile
version info: stable @en
iccd norm tag: ICCD Normativa Trasversale 4.00: AU/AUT/AUTM; AU/CMM/CMMF; AU/AAT/AATM; AU/ATB/ATBM; DT/DTM/DTMM; SG/SGT/SGTL - ICCD Normativa F: PD/PDF/PDFM - ICCD Normativa VeAC: AU/FRU/FRUF - CCD Normative F, RA, SMO, PST, S, OAC, OA, MI, D, NU: RO/ROF/ROFM

è tipo di responsabilità di
type: ObjectProperty
comment: Questa proprietà collega al tipo di responsabilità (es.: stampatori, ritoccatori, coloritori, ecc.) alla relativa responsabilità individuata relativamente ai processi di produzione e di divulgazione che caratterizzano specificamente i beni fotografici.
comment: This property relates the esponsibility type (i.e. printers, retouchers) to the related resposibility relative to some production or disclosure process which characterise photographic artefacts. @en
domain: Tipo di responsabilità
label: is responsibility type of @en
range: Responsabilità
sub property of: isTypeOf
version info: stable @en
version info: stabile

ha relazione urbanistico-ambientale con
type: ObjectProperty
type: SymmetricProperty
comment: This property relates a cultural entity to another cultural entity, in an planning environmental relation. @en
comment: Questa proprietà collega un bene culturale a un altro bene culturale collegato, con cui è in relazione urbanistico-ambientale.
domain: CulturalEntity
label: has planning environmental relation with @en
range: CulturalEntity
sub property of: ha opera collegata
sub property of: è opera collegata a
version info: stabile
version info: stable @en
iccd norm tag: ICCD Normativa Trasversale 4.00: RV/RSE/RSER = 'è in relazione urbanistico - ambientale con' (versioni precedenti: 'relazione urbanistico ambientale')

è membro di serie fotografica in
type: ObjectProperty
comment: Questa proprietà collega un bene fotografico alla classe che rappresenta l'appartenenza del bene a una serie editoriale.
comment: This property relates a cultural property to the class that represents the membership relation between this cultural property and a photographic series.
domain: CulturalEntity
label: is member of photographic series in @en
range: Appartenenza a serie fotografica
version info: stable @en
version info: stabile
iccd norm tag: ICCD Normativa F: PD/SFI; PD/SSI

Intervento
type: Class
comment: Questa classe rappresenta un intervento che ha interessato un bene culturale, a fini conservativi (per i quali si crea una sottoclasse di "Intervento") oppure di altro tipo: restauri (termine obsoleto che attualmente corrisponde a "intervento a fine conservativo"), rilavorazioni, ripristini, trasformazioni per recuperare aspetto e funzionalità rispondenti ai mutati gusti, ecc. In generale, per interventi si intendono attività che riguardano il bene, effettuate per la sua realizzazione/modifica e conservazione materiale.
comment: This class represents an intervention on a cultural property, that is an activity carried out for its conservation or for other purposes: conservation interventions, reprocessing, restoring, etc. @en
label: Intervention @en
subclass of: Activity
subclass of: Restriction
  all values from: Agent
  on property: ha responsabile dell'attività
subclass of: Restriction
  all values from: Literal
  on property: specifications
subclass of: Restriction
  all values from: Agent
  on property: ha operatore dell'attività
subclass of: Restriction
  all values from: AgentRole
  on property: hasAgentRole
subclass of: Restriction
  all values from: Literal
  on property: description
subclass of: Restriction
  all values from: CulturalEntity
  on property: è intervento su
subclass of: Restriction
  all values from: TimeInterval
  on property: atTime
subclass of: Restriction
  all values from: Agent
  on property: ha finanziatore dell'attività
subclass of: Restriction
  all values from: Tipo di intervento
  on property: ha tipo di intervento
description: An example of usage of the class 'Intervention' is the following: resource:Intervention/0800640527-10-intervention-1 a cd:Intervention ; rdfs:label "Intervention 1 on cultural property 0800640527-10"@en ; cd:hasActivityOperator resource:Agent/tonelli-elvira ; cd:hasActivityResponsible resource:Agent/soprintendenza-per-i-beni-ambientali-ed-architettonici-di-bologna-modena-e-reggio-emilia ; cd:hasInterventionType resource:InterventionType/restauro ; tiapit:atTime resource:TimeInterval/1994 . @en
description: Un esempio di utilizzo della classe "Intervento" è il seguente: resource:Intervention/0800640527-10-intervention-1 a cd:Intervention ; rdfs:label "Intervento 1 sul bene culturale 0800640527-10"@it ; cd:hasActivityOperator resource:Agent/tonelli-elvira ; cd:hasActivityResponsible resource:Agent/soprintendenza-per-i-beni-ambientali-ed-architettonici-di-bologna-modena-e-reggio-emilia ; cd:hasInterventionType resource:InterventionType/restauro ; tiapit:atTime resource:TimeInterval/1994 .
disjoint with: Indagine
version info: stable @en
version info: stabile
iccd norm tag: ICCD Normativa Trasversale 4.00: CO/RST - normative di versioni precedenti: RS/RST; Normativa VeAC: CO/RIA; Normativa CA: RO/RIS

Datazione superata
type: Tipo di datazione alternativa
type: NamedIndividual
comment: This individual represents an obsolete dating. @en
comment: Questo individuo rappresenta il tipo di datazione superata rispetto a quella presente nelle informazioni relative alla cronologia del bene in esame.
label: Obsolete dating @en
version info: stable @en
version info: stabile
iccd norm tag: ICCD Normativa Trasversale: DT/ADT/ADTT.

Stadio del bene culturale
type: Class
comment: Questa classe rappresenta lo stadio del bene catalogato in rapporto con l'oggetto che ne costituisce una fase preparatoria o che ne rappresenta la fase finale.
comment: This class represents the stage of the catalogued cultural property related to the object which constitutes its preparatory or final stage. @en
label: Cultural property stage @en
subclass of: CulturalEntityCharacteristic
subclass of: Restriction
  all values from: Rapporto con opera collegata
  on property: è stadio del bene culturale in
version info: stable @en
version info: stabile
iccd norm tag: ICCD Normative RA, SMO, PST, S, OAC, OA, MI, D, NU, F: RO/ROF/ROFF

ha elemento associato
type: ObjectProperty
comment: Questa proprietà collega il contesto di rinvenimento di un bene culturale (in particolare, un reperto antropologico) a un elemento associato al bene in quel contesto (es.: orecchini, scudo, resti di tessuto).
comment: This property relates a finding context of a cultural property (in particular, an anthropological material) to an object associated to the cultural property (e.g: earrings, shield, cloth, etc.) @en
domain: Contesto di rinvenimento
label: has associated object @en
range: Object
inverse of: è oggetto associato a
version info: stable @en
version info: stabile
iccd norm tag: ICCD Normativa AT 3.01: OG/OGC/OGCE

ha organico musicale
type: ObjectProperty
comment: This property relates an musical instrument to the musical ensamble where the instument is (or were) played. In the ontology this relationship is modelled also by the class AgentRole which allows more expressiveness. @en
comment: Questa proprietà collega uno strumento musicale al gruppo di musicisti (bande, complessi musicali, associazioni corali, ecc.) in cui lo strumento assume, o ha assunto, abitualmente un ruolo esecutivo. Questa relazione è modellata anche, con maggiore potere espressivo, tramite il pattern AgentRole, che collega lo strumento musicale a una situazione in cui un agente ha rivestito un ruolo (in questo caso, organico musicale).
domain: CulturalEntity
label: has musical ensemble @en
range: Agent
sub property of: ha agente correlato
inverse of: è organico musicale di
version info: stable @en
version info: stabile
iccd norm tag: ICCD Normativa SM 4.00: OS/OSD

Ambito culturale
type: Class
comment: Questa classe rappresenta l'ambito culturale a cui può essere riferito un bene culturale. Per l'ambito culturale si usano definizioni quali: ambito, cultura, periodo, produzione, scuola, manifattura, ecc.; a questi termini segue la qualificazione geografica o il nome dell'ambito, della cultura, del periodo, della produzione, della scuola, della manifattura, ecc. Nel caso della normativa VeAC, questa classe rappresenta l'ambito sartoriale/di produzione, ovvero il contesto sartoriale (oppure la manifattura, la maestranza, ecc.) a cui può essere ricondotta la realizzazione del bene catalogato.
comment: This class represents the cultural scope related to a cultural property (e.g.: neoclassical, Milanese manifacturing, etc.) @en
label: Cultural Scope @en
subclass of: Topic
subclass of: Restriction
  on property: è ambito culturale di
  some values from: Attribuzione di Ambito Culturale
version info: stabile
version info: stable @en
iccd norm tag: ICCD Normativa Trasversale 4.00: AU/ATB

data di scadenza
type: DatatypeProperty
comment: This property represents an expiration date. @en
comment: Questa proprietà rappresenta una data di scadenza, per esempio la data di scadenza dei diritti d'autore su un oggetto (come un bene culturale).
domain: Thing
label: expiry date @en
range: Literal
sub property of: time
version info: stable @en
version info: stabile
iccd norm tag: ICCD Normativa F 4.00 e OAC: TU/CPR/CPRD

Uso precedente
type: Tipo d'uso
type: NamedIndividual
comment: This individual represents cultural enity's previous use. @en
comment: Questo individuo rappresenta l'uso precedente di un bene.
label: Previous use @en
version info: stable @en
version info: stabile

Titolo
type: Class
comment: Questa classe rappresenta il titolo di un oggetto. Nel caso del dominio dei beni culturali, può rappresentare il titolo del soggetto di un bene culturale o di un'opera collegata a un bene culturale in quanto sua fase preparatoria o finale o in quanto pubblicazione contenente una stampa, oppure il titolo di una serie fotografica, etc.
comment: This class represents the title of an object, e.g. the title of the subject represented by a cultural property, or the title of a photographic series, etc. @en
label: Title @en
subclass of: Object
subclass of: Restriction
  all values from: Tipo di Titolo
  on property: ha tipo di titolo
subclass of: Restriction
  all values from: Criterio interpretativo
  on property: ha criterio interpretativo
subclass of: Restriction
  on property: è titolo di
  some values from: Thing
subclass of: Restriction
  all values from: Literal
  on property: specifications
version info: stable @en
version info: stabile
iccd norm tag: ICCD Normativa Trasversale: DA/AID/AIDN (titolo alternativo); DA/AID/AIDT (titolo) - Normativa S e MI: OG/SGT/SGTP (titolo proprio); Normativa F: SG/SGL/SGLA (titolo attribuito); SG/SGL/SGLT (titolo proprio); SG/SGL/SGLL (titolo parallelo); - Altre normative di versioni precedenti alla 4.00: OG/SGT/SGTR (titolo parallelo); OG/SGT/SGTT (titolo); ICCD Normativa S 3: RO/ADL/ADLT

Occasione legata al ciclo produttivo
type: Class
comment: Questa classe rappresenta un'occasione connessa ai cicli produttivi (bachicoltura, cerealicoltura, etc.)
comment: This class represents a circumstance related to production cycles (sericulture, cereal crop, etc.) @en
label: Production cycle circumstance @en
subclass of: Occasione
version info: stable @en
version info: stabile
iccd norm tag: ICCD Normativa BDI 4.00: CA/CAO/CAOP

è inventario di
type: ObjectProperty
comment: This property relates an inventory to a cultural property or an entity or an activity related to it. @en
comment: Questa proprietà collega un inventario che registra informazioni relative al bene culturale al bene culturale o alle entità o attività collegate al bene culturale.
domain: Inventario
label: is inventory of @en
range: Thing
sub property of: hasMember
version info: stabile
version info: stable @en

è zecca in
type: ObjectProperty
comment: Questa è la proprietà inversa di "ha zecca".
comment: This is the inverse property of "has mint". @en
domain: Agent
label: is mint in @en
range: Emissione di moneta
sub property of: è agente correlato a
version info: stable @en
version info: stabile

Titolo alternativo
type: Tipo di Titolo
type: NamedIndividual
comment: Represents subject's alternative title. @en
comment: Rappresenta un altro titolo noto del soggetto, in alternativa o in aggiunta al titolo più noto o accreditato.
label: Alternative title @en
iccd norm tag: ICCD Normativa Trasversale: DA/AID/AIDN

Tipo di indagine su bene archeologico
type: Class
comment: This class represents the type of archaeological property survey. @en
comment: Questa classe rappresenta il tipo di indagine su bene archeologico.
label: Archaeological property survey type @en
subclass of: Type
version info: stable @en
version info: stabile
iccd norm tag: ICCD Normativa AT 3.01: IN/INI/INIT

Responsabilità
type: Class
comment: Questa classe rappresenta l'individuazione di una responsabilità attribuibile a un agente relativamente ai processi di produzione e di divulgazione che caratterizzano specificamente i beni fotografici, quindi alle diverse personalità responsabili, a vario titolo, del ciclo produttivo del bene in esame, oltre che della sua circolazione, divulgazione, commercializzazione e promozione (committenti, stampatori, ritoccatori, coloritori, editori, distributori, sponsor, curatori e responsabili di edizioni e di serie, dedicanti e dedicatari, responsabili di collezioni e di collazioni, ecc.).
comment: This class represents the attribution of a responsibility to an agent, relating to the activities of production and dissemination of photographic heritage (e.g.: committent, editor, printer, dedicatee, etc.) @en
label: Responsibility @en
subclass of: Interpretazione
subclass of: Restriction
  on property: è responsibilità su
  some values from: CulturalEntity
subclass of: Restriction
  on property: ha agente con responsabilità
  some values from: Agent
subclass of: Restriction
  all values from: Agent
  on property: ha ente schedatore dell'authority file
subclass of: Restriction
  on property: ha tipo di responsabilità
  some values from: Tipo di responsabilità
version info: stable @en
version info: stabile
iccd norm tag: ICCD Normative F e FF: PD/PDF

ha documentazione primaria
type: ObjectProperty
comment: This property relates an intangible demoethnoanthropological property to its primary documentation, that is the documentation more representative of the intangible heritage. @en
comment: Questa proprietà collega un bene demoetnoantropologico immateriale alla sua documentazione primaria, ovvero la documentazione che restituisce il bene immateriale e ritenuta più rappresentativa.
domain: CulturalEntity
label: has primary documentation @en
range: Documentazione
sub property of: ha documentazione
inverse of: è documentazione primaria di
version info: stable @en
version info: stabile
iccd norm tag: ICCD Normativa BDI 4.00: DU, DV, DF

collocazione dell'inventario
type: DatatypeProperty
comment: This property represents the location of the inventory about a cultural property. @en
comment: Questa proprietà rappresenta la collocazione dell'inventario, cioè il luogo in cui è attualmente conservato l’inventario.
domain: Inventario
label: inventory location @en
range: Literal
version info: stable @en
version info: stabile
iccd norm tag: UB/INV/INVC

ha diritti d'autore
type: ObjectProperty
comment: This property relates an entity to copiright held by an agent or its "public domain" condition, if it is out of copyright. @en
comment: Questa proprietà collega un'entità, per esempio un bene fotografico, ai diritti d'autore detenuti da un agente, o allo stato di "in pubblico dominio" relativo all'entità stessa, qualora i diritti siano scaduti.
domain: Thing
label: has copyright @en
range: Diritti d'autore
inverse of: sono diritti d'autore di
version info: stabile
version info: stable @en
iccd norm tag: ICCD Normativa F 4.00 e OAC: TU/CPR

è scala di
type: ObjectProperty
comment: This property relates the representation scale to its graphic or cartographic representation. @en
comment: Questa proprietà collega la scala di rappresentazione alla documentazione grafica e cartografica.
domain: Scala
label: is scale of @en
range: Documentazione grafica e cartografica
version info: stable @en
version info: stabile

Sottospecie
type: Class
comment: This class represents one level of a biological taxon, the subspecies. @en
comment: Questa classe rappresenta uno dei livelli di classificazione di una tassonomia biologica, ovvero la sottospecie.
label: Subspecies @en
subclass of: Concept
subclass of: Restriction
  on property: è sottospecie in
  some values from: Tassonomia biologica
version info: stabile
version info: stable @en
iccd norm tag: ICCD Normativa AT: OG/OGS/OGST

Tipo di bibliografia
type: Class
comment: This class represents the type of bibliography. @en
comment: Questa classe rappresenta il tipo di riferimento bibliografico.
label: Bibliography type @en
subclass of: Type
disjoint with: Tipo di documentazione
version info: stable @en
version info: stabile
iccd norm tag: ICCD Normativa Trasversale DO/BIB/BIBF - Normative VeAC e AT 3.01: DO/BSE/BSES.

Fotografia satellitare
type: Tipo di immagine di indagine
type: NamedIndividual
label: Satellite photograph @en

Tipo di contesto di rinvenimento
type: Class
comment: This class represents the type of finding context of a cultural property, and in particular of an anthropological material (e.g.: individual burial, common burial, etc.) @en
comment: Questa classe rappresenta il tipo di contesto di rinvenimento di un bene culturale, e in particolare di un reperto antropologico (es.: sepoltura collettiva, sepoltura singola primaria, etc.)
label: Finding context type @en
subclass of: Type
version info: stable @en
version info: stabile
iccd norm tag: ICCD Normativa AT 3.01: OG/OGC/OGCT

ha committenza
type: ObjectProperty
comment: Questa proprietà collega un bene culturale alla sua committenza.
comment: This property relates a cultural entity to its commission. @en
domain: CulturalEntity
label: has commission @en
range: Committenza
sub property of: hasSituation
inverse of: è committenza di
version info: stabile
version info: stable @en
iccd norm tag: AU/CMM

Appartenenza a serie fotografica
type: Class
comment: This class represents the membership of photographic heritage in a photographic series, as a unit. @en
comment: Questa classe rappresenta l'appartenenza di un bene fotografico a una serie editoriale, esplicitamente indicata da un titolo o da una numerazione progressiva o da altri elementi che ne individuino inequivocabilmente l'appartenenza.
label: Photographic series membership @en
subclass of: Appartenenza
subclass of: Restriction
  all values from: Literal
  on property: numero dell'item all'interno della serie
subclass of: Restriction
  on property: ha serie fotografica
  some values from: Serie fotografica
subclass of: Restriction
  on property: ha membro di serie fotografica
  some values from: CulturalEntity
version info: stable @en
version info: stabile
iccd norm tag: ICCD Normativa F: PD/SFI; PD/SSI

ha ambito culturale
type: ObjectProperty
comment: This property relates a situation, where a cultural scope is attributed to a cultural entity, to the cultural scope. @en
comment: Questa proprietà collega una situazione in cui viene attribuito un ambito culturale di un bene culturale all'ambito culturale stesso.
domain: Attribuzione di Ambito Culturale
label: has cultural scope @en
range: Ambito culturale
sub property of: hasTopic
inverse of: è ambito culturale di
version info: stabile
version info: stable @en
iccd norm tag: ICCD Normativa Trasversale 4.00: AU/ATB

specifiche sulla sovrapposizione
type: DatatypeProperty
comment: Questa proprietà rappresenta le specifiche per effettuare sovrapposizioni con altri documenti utili per la lettura e l'interpretazione dell'immagine analizzata durante uan fotointerpretazione o fotorestituzione.
comment: This property represents specifications to make overlaps with other documents useful for reading and interpreting image analyzed during a photointerpretation or photo-repayment. @en
domain: Fotointerpretazione e fotorestituzione
label: overlap specifications @en
range: Literal
sub property of: specifications
version info: stabile
version info: stable @en
iccd norm tag: ICCD Normativa Trasversale 4.00: RE/FOI/FOIP

è criterio interpretativo di
type: ObjectProperty
comment: This property relates an interpretation criterion to the interpretation that was based on that criterion. @en
comment: Questa proprietà collega un criterio interpretativo all'interpretazione che si è basata su quel criterio.
domain: Criterio interpretativo
label: is interpretation criterion of @en
range: Thing
sub property of: isDescriptionOf
version info: stabile
version info: stable @en

si riferisce a ricerca
type: FunctionalProperty
type: ObjectProperty
comment: Questa proprietà collega un rilevamento di un bene musicale o demoetnoantropologico alla ricerca nell'ambito della quale è stata redatta la scheda.
comment: This class relates an observation survey of musical or demoetnoanthropological heritage to the research in which the catalogue record describing a cultural property was recorded (e.g.: a cataloguing campaign) @en
domain: Indagine di rilevamento
label: is related to research @en
range: Ricerca
version info: stabile
version info: stable @en
iccd norm tag: ICCD Normativa SM 4.00: DR

Licenza di esportazione definitiva
type: Tipo di certificazione di esportazione o importazione
type: NamedIndividual
label: Permanent export license @en
version info: stable @en
version info: stabile

Documentazione grafica e cartografica
type: Class
comment: This class represents the graphic or cartographic documentation of an object, e.g. a cultural property. @en
comment: Questa classe rappresenta la documentazione grafica e cartografica relativa a un oggetto, per esempio a un bene culturale.
label: Graphic and cartographic documentation @en
subclass of: Documentazione
subclass of: Restriction
  all values from: Scala
  on property: ha scala
version info: stabile
version info: stable @en
iccd norm tag: DRA

ha specifiche del tipo d'uso
type: ObjectProperty
comment: This property relates the use of a cultural property to the specification of the type of use. @en
comment: Questa proprietà collega l'uso del bene con le specifiche relative al tipo di utilizzo.
domain: Uso
label: has use type specification @en
range: Specifiche del tipo d'uso
inverse of: è specifica del tipo di uso di
version info: stabile
version info: stable @en
iccd norm tag: ICCD Normativa Trasversale: UT/UTUS

è utente di
type: ObjectProperty
comment: Questa proprietà collega un utente, inteso come agente che ha fatto uso di un'entità, all'entità stessa.
comment: This property relates the user, intended as the agent who employed an entity, to the related entity. @en
domain: Agent
label: is user of @en
range: Thing
sub property of: è agente correlato a
version info: stabile
version info: stable @en

settore ambiente quadrato
type: DatatypeProperty
comment: Questa proprietà collega uno scavo archeologico alla successione delle denominazioni, assegnate nell'ambito dello scavo, al settore (o l'area), all'ambiente e al quadrato da cui proviene il bene.
comment: This property relates an archaeological excavation to the succession of the denominations, assigned in the excavation, to the sector (or the area), to the environment and to the square from which the good comes. @en
domain: Scavo archeologico
label: area room square @en
range: Literal
version info: stable @en
version info: stabile
iccd norm tag: ICCD Normativa Trasversale 4.00: RE/DSC/DSCQ

Specifiche del tipo d'uso
type: Class
comment: This class represents the specification of the type of use of a cultural property (e.g. building, ornamental, structural, instrumental) @en
comment: Questa classe rappresenta le specifiche sul tipo di uso del bene (reimpiego, edilizio, epigrafico, ornamentale, strumentale, strutturale).
label: Use type specification @en
subclass of: Type
version info: stabile
version info: stable @en
iccd norm tag: ICCD Normativa Trasversale: UT/UTU/UTUS

Interpretazione dell'età della morte
type: Class
comment: This class represents the interpretation of the age of death of an anthropological material. @en
comment: Questa classe rappresenta la stima dell'età della morte di un reperto antropologico.
label: Age of death interpretation @en
subclass of: Interpretazione
subclass of: Restriction
  on property: è età della morte stimata di
  some values from: CulturalEntity
subclass of: Restriction
  on property: età della morte stimata
  some values from: Literal
version info: stabile
version info: stable @en
iccd norm tag: ICCD Normativa AT: DA/SEM

titolo attribuito
type: DatatypeProperty
comment: Questa proprietà rappresenta un titolo attribuito di una fotografia, cioè un titolo desunto, se possibile, da fonti archivistiche, bibliografiche, orali o iconografiche (altri esemplari della stessa immagine) oppure creato in base al contenuto dell'immagine (o della serie di immagini; è necessario nei casi in cui siano del tutto assenti titoli sul/nel documento, o su materiali ad esso complementari, e nel caso in cui tali titoli risultino errati.
comment: This property represents an attributed title of a photograph, that is a title taken from archival, bibliographic, oral or iconographic sources, or created based on picture contents. @en
domain: CulturalEntity
label: attributed title @en
range: Literal
sub property of: titolo
version info: stable @en
version info: stabile
iccd norm tag: Normativa F: SG/SGL/SGLA

è mantenuto in
type: DatatypeProperty
comment: This property represents the location of the asset in its environment, i.e. the place where it is stored when not in use. @en
comment: Questa proprietà rappresenta la collocazione del bene nel suo ambiente, ovvero il luogo dove esso viene riposto quando non viene usato.
domain: Uso
label: is kept in @en
range: Literal
version info: stable @en
version info: stabile
iccd norm tag: ICCD Normativa BDM 2.00: UT/UTA

Strumentale
type: Specifiche del tipo d'uso
type: NamedIndividual
comment: This individual represents cultural entity instrumental use specifications. @en
comment: Questo individuo rappresenta le specifiche d'uso strumentale di un bene.
label: Instrumental @en
version info: stable @en
version info: provvisorio

Professione
type: Class
comment: Questa classe rappresenta il mestiere o la professione dell'utente del bene.
comment: This class represents the role of a cultural entity's user. @en
label: Profession @en
subclass of: Role
disjoint with: Funzione d'uso
version info: stable @en
version info: stabile
iccd norm tag: ICCD Normativa BDM 2: UT/UTN/UTNM

Specie
type: Class
comment: This class represents one level of a biological taxon, the species. @en
comment: Questa classe rappresenta uno dei livelli di classificazione di una tassonomia biologica, ovvero la specie.
label: Species @en
subclass of: Concept
subclass of: Restriction
  on property: è specie in
  some values from: Tassonomia biologica
version info: stabile
version info: stable @en
iccd norm tag: ICCD Normativa AT: OG/OGS/OGSN

Occasione religiosa
type: Tipo di circostanza
type: NamedIndividual
label: Religious circumstance @en

è motivo di indagine di
type: ObjectProperty
comment: This property relates the main motivation that led to an archeological, archaeometric or diagnostic survey or a photo interpretation rendering to each of them.
comment: Questa proprietà collega il motivo principale che ha determinato uno scavo archeologico, una ricognizione archeologica, un'indagine archeometrica e diagnostica o una fotointerpretazione e fotorestituzione a ciascuno di essi.
domain: Motivo di indagine
label: is survey motivation of @en
range: Indagine
sub property of: isDescriptionOf
version info: stabile
version info: stable @en

Ricerca
type: Class
comment: Questa classe rappresenta la ricerca nell'ambito della quale è stata redatta la scheda, intendendo con il termine "ricerca" vari e differenziati livelli, fra cui quello della campagna di catalogazione. La ricerca si può collegare al rilevamento di un bene musicale di interesse etno-organologico.
comment: This class represents the research in which the catalogue record describing a cultural property was recorded (e.g.: a cataloguing campaign). The research can be related to the observation survey on musical heritage. @en
label: Research @en
subclass of: Activity
subclass of: Restriction
  all values from: Indagine di rilevamento
  on property:
    inverse of: si riferisce a ricerca
subclass of: Restriction
  all values from: Agent
  on property: ha responsabile scientifico della ricerca
subclass of: Restriction
  on property: name
  some values from: Literal
version info: stable @en
version info: stabile
iccd norm tag: ICCD Normativa SM e BDM 4.00: DR/DRT

ha ruolo nell'intervento
type: ObjectProperty
comment: This property relates an authorship attribution to the agent's role. @en
comment: Questa proprietà associa un'attribuzione di autore/responsabilità al ruolo rivestito dall'autore o dall'ambito culturale.
domain: Attribuzione di Autore o responsabilità
label: has intervention role @en
range: Role
inverse of: è ruolo nell'intervento
version info: stabile
version info: stable @en
iccd norm tag: AU/ATB/ATBR; AU/AUT/AUTR

ha finanziatore dell'attività
type: ObjectProperty
comment: Questa proprietà collega un'attività (per esempio, un'indagine o un intervento su un bene culturale) all'ente o al soggetto che ha finanziato l'attività.
comment: This property relates an activity to its investor. The investor may be an institution or an agent. @en
domain: Activity
label: has activity sponsor @en
range: Agent
sub property of: ha agente correlato
inverse of: è responsabile dell'attività
version info: stable @en
version info: stabile
iccd norm tag: ICCD Normativa Trasversale 4.00: RS/RST/RSTR; RE/IND/INDR

identificativo immagine di indagine
type: FunctionalProperty
type: DatatypeProperty
comment: Questa proprietà rappresenta il codice identificativo che individua l'immagine presa in esame nel corso di un'indagine di fotointerpretazione o fotorestituzione.
comment: This property represents the identification code that identifies the image examined during a photo-interpretation or photo-restoration investigation. @en
domain: Immagine di indagine
label: survey image identifier @en
range: Literal
sub property of: identifier
version info: stabile
version info: stable @en
iccd norm tag: ICCD Normativa Trasversale 4.00: RE/FOI/FOID

contatti
type: DatatypeProperty
comment: This property represents contacts of an agent (i.e. email, telephone number...) @en
comment: Questa proprietà rappresenta i contatti di riferimento di un agente (persona, organizzazione), es. indirizzo, numeri di telefono e di fax, indirizzi di posta elettronica, ecc.
domain: Agent
label: contacts @en
range: Literal
version info: stabile
version info: stable @en
iccd norm tag: ICCD Normativa SM 4.00: OS/OSE

è tipo di bibliografia di
type: ObjectProperty
comment: Questa proprietà collega il tipo di riferimento bibliografico alla bibliografia.
comment: This property relates the bibliography type to its bibliography. @en
domain: Tipo di bibliografia
label: is bibliography type of @en
range: Bibliografia
sub property of: isTypeOf
version info: stable @en
version info: stabile

Altro metodo di datazione
type: Tipo di datazione alternativa
type: NamedIndividual
comment: This individual represents a different type of dating method than the one present in cultural entity's chronological information. @en
comment: Questo individuo rappresenta un tipo di metodo diverso di datazione rispetto a quella presente nelle informazioni della cronologia del bene in esame.
label: Other method of dating @en
version info: stable @en
version info: stabile
iccd norm tag: ICCD Normativa Trasversale: DT/ADT/ADTT.

Serie archivistica
type: Class
comment: This class represents an archival series. @en
comment: Questa classe rappresenta una serie archivistica.
label: Archival series @en
subclass of: Unità archivistica complessa
subclass of: Restriction
  all values from: Sottoserie archivistica
  on property: hasComponent
subclass of: Restriction
  all values from: Fondo archivistico
  on property: isComponentOf
is native to: BornDigitalArchives ODP.owl
version info: stable @en
version info: stabile
iccd norm tag: ICCD Normativa F: UB/UBF/UBFS

Intervento a fini conservativi
type: Class
comment: This class represents a conservation intervention on a cultural property (e.g.: microclimatic inspection, mechanical cleaning or with chemicals, pest control, etc.) @en
comment: Questa classe rappresenta un particolare tipo di intervento che ha interessato un bene culturale, cioè un intervento a fini conservativi (termine che sostituisce l'obsoleto "restauro", presente nelle versioni di normativa precedenti alla 4.00). Per esempio: consolidamento, controllo microclimatico, trattamento biocida-disinfestazione, rimozione di elementi non originali, pulitura meccanica, pulitura chimica, protezione finale, riadesione parti, trattamento parti metalliche.
label: Conservation Intervention @en
subclass of: Intervento
subclass of: Restriction
  all values from: Literal
  on property: situazione
version info: stabile
version info: stable @en
iccd norm tag: ICCD Normativa Trasversale 4.00: CO/RST quando RSTI='consolidamento' or 'controllo microclimatico' or 'trattamento biocida-disinfestazione' or 'rimozione di elementi non originali' or 'pulitura meccanica' or 'pulitura chimica' or 'protezione finale' or 'riadesione parti' or 'trattamento parti metalliche' - Normative di versioni precedenti: RS/RST

è luogo di realizzazione di
type: ObjectProperty
comment: Questa è la proprietà inversa di "ha luogo di creazione".
comment: This is the inverse property of "has creation location". @en
domain: CulturalEntity
label: is creation location of @en
range: CulturalEntity
sub property of: è opera collegata a
version info: stabile
version info: stable @en

ha uso
type: ObjectProperty
comment: Questa proprietà collega il bene culturale con il suo uso.
comment: This property relates a cultural entity to its use. @en
domain: CulturalEntity
label: has use @en
range: Uso
sub property of: hasDescription
inverse of: è uso di
version info: stabile
version info: stable @en
iccd norm tag: ICCD Normativa Trasversale: UT

ha provvedimento di tutela
type: ObjectProperty
comment: Questa proprietà collega un bene culturale a un provvedimento di tutela nazionale o internazionale che lo ha interessato.
domain: CulturalEntity
label: has protective measure @en
range: Provvedimento di tutela
inverse of: è provvedimento di tutela di
version info: stable @en
version info: stabile
iccd norm tag: ICCD Normativa Trasversale 4.00: TU/NVC

coinvolge
type: ObjectProperty
comment: Questa è la proprietà inversa di 'is involved in', che collega un bene culturale a un altro bene culturale collegato, di tipo immateriale, in cui è coinvolto.
comment: This is the inverse property of 'is involved in', which relates a cultural entity to another involved cultural entity (e.g. immaterial). @en
domain: CulturalEntity
label: involves @en
range: CulturalEntity
sub property of: è opera collegata a
inverse of: è coinvolto in
version info: stable @en
version info: stabile

è collezionista di
type: ObjectProperty
comment: Questa proprietà, inversa a "ha collezionista", collega un collezionista alla relativa collezione di beni culturali.
comment: This property relates a collector to its collection of cultural properties. @en
domain: Agent
label: is collector of @en
range: CollectionCulEnt
sub property of: è agente correlato a
version info: stabile
version info: stable @en
iccd norm tag: UB/COL/COLN

Tipo di datazione alternativa
type: Class
comment: Questa classe rappresenta il tipo di datazione alternativa che può riguardare un bene culturale (es.: altro metodo di datazione, datazione superata)
comment: This class represents the type of alternative dating of a cultural property (different dating, obsolete dating, other method dating) @en
label: Alternative dating type @en
subclass of: Type
version info: stabile
version info: stable @en
iccd norm tag: ICCD Normativa Trasversale: DT/ADT/ADTT.

è tipo di titolo di
type: ObjectProperty
comment: Questa proprietà collega il tipo di titolo di un bene culturale al relativo titolo.
comment: This property relates the type of a cultural entity title to its title. @en
domain: Tipo di Titolo
label: is title type of @en
range: Titolo
sub property of: isTypeOf
version info: stabile
version info: stable @en

ha metodo di indagine
type: ObjectProperty
comment: Questa proprietà collega un'indagine al metodo adottato nel corso dell'indagine.
comment: This property relates a survey to the method adopted in the survey. @en
domain: Indagine
label: has survey method @en
range: Metodo di indagine
sub property of: hasMethod
inverse of: è metodo di indagine di
version info: stable @en
version info: stabile
iccd norm tag: ICCD Normativa Trasversale 4.00: RE/RCG/RCGM; RE/DSC/DSCM - ICCD Normativa AT: PT/PTC/PTCM

Discreta affidabilità
type: Affidabilità
type: NamedIndividual
label: Decent reliability @en

Uso edilizio
type: Specifiche del tipo d'uso
type: NamedIndividual
comment: This individual represents cultural entity building use specifications. @en
comment: Questo individuo rappresenta le specifiche d'uso edilizio di un bene.
label: Building use @en
version info: stable @en
version info: stabile

data di emissione
type: DatatypeProperty
type: FunctionalProperty
comment: Questa proprietà rappresenta la data di emissione di un provvedimento amministrativo o di una certificazione (es.: per la circolazione, esportazione/importazione di un bene culturale)
comment: This property represents issue date of an administrative provision or a certification. @en
domain: Class
  union of: Certificazione di importazione o esportazione
  union of: Provvedimento di tutela
label: issue date @en
range: dateTime
sub property of: date
version info: stabile
version info: stable @en
iccd norm tag: ICCD Normativa Trasversale 4.00: TU/NVC/NVCE; TU/ESP/ESPD

titolo
type: DatatypeProperty
comment: Questa proprietà rappresenta il titolo del soggetto di un bene culturale. La proprietà viene specificata in sottoproprietà per esprimere tipologie di titolo specifiche. Per la normativa trasversale è il titolo più noto e accreditato; nelle altre normative si specifica che è il titolo dato dall'autore o la denominazione tradizionale del soggetto.
comment: This property represents the title of a cultural property. @en
domain: CulturalEntity
label: title @en
range: Literal
version info: stable @en
version info: stabile
iccd norm tag: Normativa trasversale: DA/AID/AIDT - Altre normative di versioni precedenti alla 4.00: OG/SGT/SGTT

è deposizione funeraria di
type: ObjectProperty
comment: This is the inverse property of "has tomb". @en
comment: Questa è la proprietà inversa di "ha deposizione funeraria".
domain: Deposizione funeraria
label: is tomb of @en
range: Scavo archeologico
version info: stable @en
version info: stabile

codice identificativo locale dello scavo archeologico
type: DatatypeProperty
type: FunctionalProperty
comment: This property represents the identification code, numeric or alphanumeric, which identifies the archaeological excavation unambiguously in the context of a local repertoire. @en
comment: Questa proprietà rappresenta il codice identificativo, numerico o alfanumerico, che individua lo scavo archeologico in modo univoco nell'ambito di un repertorio locale. @en
domain: Scavo archeologico
label: archaeological excavation local identifier @en
range: Literal
sub property of: localIdentifier
version info: stable @en
version info: stabile
iccd norm tag: ICCD Normativa Trasversale 4.00: RE/DSC/DSCH

ha sede di provenienza
type: ObjectProperty
comment: Questa proprietà collega un bene culturale a un altro bene culturale collegato, che ne costituisce la sede di provenienza, prima della sua attuale collocazione.
comment: This property relates a cultural entity to a connected cultural entity which constitutes its provenance location before its current position. @en
domain: CulturalEntity
label: era contenuto in
label: has previous location @en
range: CulturalEntity
sub property of: ha opera collegata
inverse of: è sede di provenienza di
version info: stabile
version info: stable @en
iccd norm tag: ICCD Normativa Trasversale 4.00: RV/RSE/RSER = 'era contenuto in' (versioni precedenti: 'sede di provenienza')

ha tipo d'uso
type: ObjectProperty
comment: Questa proprietà collega l'uso del bene con il suo tipo (attuale, precedente, storico).
comment: This property relates a cultural entity's use to its use type. @en
domain: Uso
label: has use type @en
range: Tipo d'uso
sub property of: hasType
inverse of: è tipo d'uso di
version info: stabile
version info: stable @en
iccd norm tag: ICCD Normativa Trasversale: UT/UTU/UTUT

è ricerca su
type: ObjectProperty
comment: This property relates a research from which has been produced a cultural entity's catalogue record, to the cultural entity. @en
comment: Questa proprietà la ricerca nell'ambito della quale è stata redatta la scheda su un bene culturale al bene stesso.
domain: Ricerca
label: is research on @en
range: CulturalEntity
version info: stable @en
version info: stabile
iccd norm tag: ICCD Normativa SM e BDM 4.00: DR/DRT

Uso attuale
type: Tipo d'uso
type: NamedIndividual
comment: This individual represents cultural entity current use. @en
comment: Questo individuo rappresenta l'uso attuale di un bene.
label: Current use @en
version info: stable @en
version info: stabile

codice identificativo locale della bibliografia
type: DatatypeProperty
type: FunctionalProperty
comment: Questa proprietà rappresenta una sequenza numerica o alfanumerica che identifica il riferimento bibliografico in modo univoco nell'ambito di un repertorio locale.
comment: This property represents a numerical or alphanumeric sequence that uniquely identifies the bibliographic reference within a local repertoire. @en
domain: Bibliografia
label: bibliography local identifier @en
range: Literal
sub property of: localIdentifier
version info: stable @en
version info: stabile
iccd norm tag: ICCD Normativa Trasversale 4.00: DO/BIB/BIBH

cronologia specifica
type: ObjectProperty
comment: Questa proprietà collega l'evento (realizzazione, demolizione, etc.) cui si riferisce una specifica cronologia di un bene culturale alla cronologia specifica, cioè la cronologia in anni (anche a cavallo di secoli diversi) o con date precise (nella forma "aaaa/mm/gg"). Nel caso in cui la cronologia corrisponda ad uno specifico anno, l'intervallo di tempo avrà lo stesso valore per data di inizio e data di fine.
comment: This property relates the event (creation, distruction) to which a dating of a cultural property is related to the "specific time", as the dating expressed in year or as a date yyyy/mm/dd. @en
domain: EventOrSituation
label: specific time @en
range: TimeInterval
sub property of: atTime
inverse of: cronologia specifica di
version info: stabile
version info: stable @en
iccd norm tag: ICCD Normativa Trasversale: DT/DTS/DTSI + DT/DTS/DTSV + DT/DTS/DTSF + DT/DTS/DTSL

ha committente
type: ObjectProperty
comment: This property relates a situation where it is indicated a cultural entity's commission to the investor agent or institution. @en
comment: Questa proprietà collega una situazione in cui viene indicata la committenza di un bene culturale alla persona o istituzione committente.
domain: Committenza
label: has committent @en
range: Agent
sub property of: ha agente correlato
inverse of: è committente in
version info: stabile
version info: stable @en
iccd norm tag: ICCD Normativa Trasversale 4.00: AU/CMM/CMMN

ha tipo di contesto di rinvenimento
type: ObjectProperty
comment: Questa proprietà collega il contesto di rinvenimento di un bene culturale, e in particolare di un reperto antropologico, al tipo di contesto.
comment: This property relates a cultural property (anthropological material) finding context to the type of context. @en
domain: Contesto di rinvenimento
label: has finding context type @en
range: Tipo di contesto di rinvenimento
sub property of: hasType
inverse of: è tipo di contesto di rinvenimento di
version info: stabile
version info: stable @en
iccd norm tag: ICCD Normativa AT 3.01: OG/OGC/OGCT

ha anomalia
type: ObjectProperty
comment: This property relates a photo interepretation rendering to an anomaly revealed by a survey. @en
comment: Questa proprietà collega una fotointerpretazione o fotorestituzione a un'anomalia rilevata nel corso dell'indagine.
domain: Fotointerpretazione e fotorestituzione
label: has anomaly @en
range: Anomalia
sub property of: hasSituation
inverse of: è anomalia di
version info: stabile
version info: stable @en
iccd norm tag: ICCD Normativa Trasversale 4.00: RE/FOI/FOIA + RE/FOI/FOIQ + RE/FOI/FOIF

è membro di collezione di
type: ObjectProperty
comment: This property relates a cultural property to the class that represents the membership relation between this cultural property and a collection.
comment: Questa proprietà collega un bene culturale mobile alla classe che rappresenta l'appartenenza del bene culturale a una collezione in un certo intervallo di tempo.
domain: CulturalEntity
label: is member of collection of @en
range: Appartenenza a Collezione
version info: stable @en
version info: stabile
iccd norm tag: UB/COL

è collezione in
type: ObjectProperty
comment: Questa proprietà, inversa a "ha collezione", rappresenta la partecipazione di una collezione nel rapporto tra una collezione e un bene culturale che ne fa parte, in un certo intervallo di tempo.
comment: This property relates a collection to the relationship (membership) between the collection itself and a cultural property that is member of it. @en
domain: CollectionCulEnt
label: is collection in @en
range: Appartenenza a Collezione
version info: stabile
version info: stable @en
iccd norm tag: UB/COL/COLD

è organico musicale di
type: ObjectProperty
comment: This property relates the musical ensamble where an instument is (or were) played to the related musical instrument. @en
comment: Questa proprietà collega il gruppo di musicisti (bande, complessi musicali, associazioni corali, ecc.) in cui uno strumento assume, o ha assunto, abitualmente un ruolo esecutivo al relativo strumento musicale.
domain: Agent
label: is musical ensemble of @en
range: CulturalEntity
sub property of: è agente correlato a
version info: stabile
version info: stable @en

è stima del bene culturale
type: ObjectProperty
comment: Questa proprietà collega una stima di un bene culturale al bene culturale stimato.
comment: This property relates a cultural property estimate to the estimated cultural property. @en
domain: Stima di bene culturale
label: is cultural property estimate of @en
range: CulturalEntity
sub property of: è stima di
version info: stable @en
version info: stabile

è responsabile scientifico dell'indagine di
type: ObjectProperty
comment: Questa proprietà collega il responsabile scientifico di un'indagine alla relativa indagine.
comment: This property relates the scientific director of a survey to the related survey. @en
domain: Agent
label: is survey scientific director of @en
range: Indagine
sub property of: è agente correlato a
version info: stable @en
version info: stabile

ha genere
type: FunctionalProperty
type: ObjectProperty
comment: This property relates a biological taxon to the genus, that is one of the concept of the taxon. @en
comment: Questa proprietà collega una tassonomia biologica al genere, che è uno dei concetti della tassonomia.
domain: Tassonomia biologica
label: has genus @en
range: Genere
sub property of: hasConcept
inverse of: è genere in
version info: stable @en
version info: stabile
iccd norm tag: ICCD Normativa AT: OG/OGS/OGSG

situazione
type: DatatypeProperty
comment: Questa proprietà rappresenta la situazione in cui si svolge l'intervento di restauro. Nel caso in cui l’intervento sul bene sia in corso al momento della schedatura e non risulti ancora concluso, il valore di questa proprietà sarà "intervento in corso" con l'eventuale indicazione del luogo presso cui si sta effettuando.
comment: This property represents the framework in which the restoration is carried out. @en
domain: Intervento a fini conservativi
label: framework @en
range: Literal
version info: stabile
version info: stable @en
iccd norm tag: RS/RST/RSTS

è evento relativo alla datazione di
type: ObjectProperty
comment: Questa proprietà collega un evento relativo al bene culturale, cui si riferisce la specifica cronologia a una cronologia.
comment: This property relates an event involving the cultural property, which the dating is about, to a dating. @en
domain: EventOrSituation
label: is dating event of @en
range: Cronologia
version info: stabile
version info: stable @en

Tipo di intervento
type: Class
comment: Questa classe rappresenta il tipo di intervento (a fini conservativi o di altro tipo) che ha interessato un bene culturale.
comment: This class represents the type of intervention on a cultural property. @en
label: Intervention type @en
subclass of: Type
version info: stable @en
version info: stabile
iccd norm tag: ICCD Normativa Trasversale 4.00: valori di CO/RST/RSTI - Normativa VeAC: CO/RIA (riadattamento/modifica) - Normativa CA: RO/RIS (intervento successivo)

ha codice SEC
type: ObjectProperty
comment: This property relates the current inventory to the patrimonial code of a cultural property, referring to the SEC classification 1995. @en
comment: Questa proprietà collega un inventario patrimoniale al codice SEC (modello 15) attribuito al bene.
domain: Inventario Patrimoniale
label: has SEC identifier @en
range: Codice SEC
sub property of: hasCategory
version info: stabile
version info: stable @en
iccd norm tag: ICCD Normativa Trasversale 4.00: UB/INP/INPS

ha ente proponente
type: ObjectProperty
comment: Questa proprietà collega un'entità, che può essere direttamente il bene culturale o specificamente il provvedimento di tutela relativo al bene culturale, all'ente proponente, ovvero al soggetto che ha proposto il provvedimento, identificato per mezzo della denominazione per esteso oppure, nel caso di Enti accreditati dall'ICCD, del relativo codice assegnato dall'Istituto. La relazione tra il ruolo e l'agente che lo riveste è espressa, in maniera generica, nel nome della proprietà, che quindi ne fornisce una rappresentazione semplificata, con ridotta espressività. Nell'ontologia questa relazione è modellata anche, in maniera più espressiva, dalla classe AgentRole, che permette di collegare l'agente e il suo ruolo.
comment: This property relates an entity (e.g a cultural entity or a cultual entity's protective measure) to the proposing institution. In the ontology this relationship is modelled also by the class AgentRole which allows more expressiveness. @en
domain: Class
  union of: CulturalEntity
  union of: Provvedimento di tutela
label: has proponet agency @en
range: Agent
sub property of: ha agente correlato
inverse of: è ente proponente di
version info: stabile
version info: stable @en
iccd norm tag: ICCD Normativa Trasversale 4.00: TU/NVC/NVCA; Versioni precedenti: CD/EPR

ha tipo di titolo
type: ObjectProperty
comment: This property relates a cultural entity's title to its title type. @en
comment: Questa proprietà collega un titolo di un bene culturale al tipo di titolo.
domain: Titolo
label: has title type @en
range: Tipo di Titolo
sub property of: hasType
inverse of: è tipo di titolo di
version info: stable @en
version info: stabile
iccd norm tag: OG/SGT/SGTP; SG/SGL/SGLT; SG/SGL/SGLL; OG/SGT/SGTR; DA/AID/AIDN; SG/SGL/SGLA; DA/AID/AIDT; OG/SGT/SGTT

Deposizione funeraria
type: Class
comment: Questa classe rappresenta una deposizione funeraria.
comment: This class represents a tomb. @en
label: Tomb @en
subclass of: Object
subclass of: Restriction
  on property: è deposizione funeraria di
  some values from: Scavo archeologico
version info: stable @en
version info: stabile
iccd norm tag: ICCD Normativa Trasversale 4.00: RE/DSC/DSCS

ha acquisizione
type: ObjectProperty
comment: Questa proprietà collega un bene culturale coinvolto in un evento di acquisizione all'acquisizione stessa.
comment: This property relates a cultual property involved in an acquisition event to the actual acquisition. @en
domain: CulturalEntity
label: has acquisition @en
range: Acquisizione
sub property of: hasSituation
inverse of: è acquisizione di
version info: stabile
version info: stable @en
iccd norm tag: ICCD Normativa Trasversale 4.00: TU/ACQ

luogo di acquisizione
type: DatatypeProperty
comment: This property represents the place where an acquisition event, generally expressed, based on the available data, took place, in the form: "Region / abbreviation province / full name of the Municipality / locality or toponym" @en
comment: Questa proprietà rappresenta il luogo in cui è avvenuto un evento di acquisizione, generalmente espresso, in base ai dati disponibili, nella forma: "Regione/sigla provincia/denominazione per esteso del Comune/località o toponimo"
domain: Acquisizione
label: acquisition location @en
range: Literal
version info: stable @en
version info: stabile
iccd norm tag: ICCD Normativa Trasversale 4.00: TU/ACQ/ACQL

ha attribuzione di autore/responsabilità
type: ObjectProperty
comment: Proprietà che lega un oggetto culturale a un'attribuzione di autore o di responsabilità relativa all'oggetto.
comment: This property relates a cultural entity to an authorship or resposibility attribution of the entity. @en
domain: CulturalEntity
label: has authorship attribution @en
range: Attribuzione di Autore o responsabilità
sub property of: hasSituation
inverse of: è attribuzione di autore/responsabilità di
version info: stable @en
version info: stabile
iccd norm tag: ICCD Normativa Trasversale 4.00: AU/AUT; AU/ATB; AU/AAT

Acquisizione
type: Class
comment: This class represents a situation in which a cultural property is acquired, passing from an owner to another, and has a particular legal situation. @en
comment: Questa classe rappresenta un evento in cui un bene culturale è stato acquisito e si trova in una certa condizione giuridica.
label: Acquisition @en
subclass of: Situation
subclass of: Restriction
  on property: ha tipo di acquisizione
  some values from: Tipo di acquisizione
subclass of: Restriction
  all values from: Literal
  on property: luogo di acquisizione
subclass of: Restriction
  all values from: Agent
  on property: ha soggetto fonte dell'acquisizione
subclass of: Restriction
  all values from: Literal
  on property: time
subclass of: Restriction
  on property: è acquisizione di
  some values from: CulturalEntity
description: An example of usage of the class 'Acquisition' is the following: resource:Acquisition/1200865053-acquisition-1 a cd:Acquisition ; rdfs:label "Acquisition 1 of cultural property: 1200865053"@it ; cd:hasAcquisitionType resource:AcquisitionType/donazione ; cd:hasPreviousOwner resource:Agent/auriti-giacinto ; tiapit:time "1963" . @en
description: Un esempio d'uso della classe 'Acquisizione' è il seguente: resource:Acquisition/1200865053-acquisition-1 a cd:Acquisition ; rdfs:label "Acquisizione 1 del bene culturale: 1200865053"@it ; cd:hasAcquisitionType resource:AcquisitionType/donazione ; cd:hasPreviousOwner resource:Agent/auriti-giacinto ; tiapit:time "1963" .
version info: stabile
version info: stable @en
iccd norm tag: ICCD Normativa Trasversale 4.00: TU/ACQ

è serie fotografica in
type: ObjectProperty
comment: This property relates a photographic series to the class that represents the membership relation between this photographic series and a cultural property that is member of it. @en
comment: Questa proprietà, inversa a "ha serie", collega una serie fotografica editoriale al rapporto tra la serie e un bene fotografico che ne fa parte.
domain: Serie fotografica
label: is photographic series in @en
range: Appartenenza a serie fotografica
version info: stabile
version info: stable @en
iccd norm tag: ICCD Normativa Trasversale: PD/SFI; PD/SSI

ha utente
type: ObjectProperty
comment: This property relates an entity to the user, intended as the agent who employed the entity. @en
comment: Questa proprietà collega un'entità a un utente, inteso come agente che ha fatto uso di quell'entità. Per esempio, può collegare un'occasione in cui un vestimento antico o contemporaneo è stato indossato da una persona al fruitore stesso, oppure un particolare uso di un bene culturale al tipo di utente coinvolto in quell'uso.
domain: Thing
label: has user @en
range: Agent
sub property of: ha agente correlato
inverse of: è utente di
version info: stabile
version info: stable @en
iccd norm tag: ICCD Normativa Trasversale: UT/UTU/UTUN; Normativa VeAC: AU/FRU/FRUF

è metodo di individuazione di
type: ObjectProperty
comment: This property relates the detection method of a cultural property to the cultural property itself. @en
comment: Questa proprietà collega la modalità di individuazione di un bene culturale al bene culturale stesso.
domain: Metodo di individuazione
label: is detection method of @en
range: CulturalEntity
sub property of: isMethodOf
version info: stable @en
version info: stabile

Tipo di documentazione
type: Class
comment: Questa classe rappresenta il tipo di documentazione.
comment: This class represents the type of documentation. @en
label: Documentation type @en
subclass of: Type
version info: stable @en
version info: stabile
iccd norm tag: FTAP, DRAT, FNTP (+VDCP, REGP), ADMP (v. 3.00 e 3.01)

è responsibilità su
type: ObjectProperty
comment: This property relates the attribution of a responsibility to an agent, relating to the activities of production and dissemination of photographic heritage (e.g.: committent, editor, printer, dedicatee, etc.) to photographic heritage. @en
domain: Responsabilità
label: is responsibility for @en
range: CulturalEntity
version info: stabile
version info: stable @en
iccd norm tag: ICCD Normativa F: PD/PDF

è unità archivistica complessa in
type: ObjectProperty
comment: Questa proprietà, inversa a "ha unità archivistica complessa", collega una unità archivistica complessa al rapporto tra l'unità stessa e un bene culturale che ne fa parte.
comment: This property relates an archival record set to the relationship (membership) between the set itself and a cultural property that is member of it. @en
domain: Unità archivistica complessa
label: is archival record set in @en
range: Appartenenza a unità archivistica complessa
version info: stable @en
version info: stabile
iccd norm tag: ICCD Normativa F: UB/UBF

è riprodotto da
type: ObjectProperty
comment: This property relates a print to the reproduction of that print in a publication. @en
comment: Questa proprietà collega una stampa con la sua riproduzione contenuta in una pubblicazione, di cui la stampa è, o è stata, parte integrante.
domain: CulturalEntity
label: is reproduced by @en
range: Riproduzione
inverse of: riproduce
version info: stabile
version info: stable @en
iccd norm tag: ICCD Normativa S 3: RO/ADL

ha tipo di indagine archeometrica e diagnostica
type: ObjectProperty
comment: This property relates an arecheometric diagnostic survey to its type (i.e. thermal imaging, coring). @en
comment: Questa proprietà collega un'indagine archeometrica e diagnostica al suo tipo (es.: analisi della malta, carotaggio, termografia, etc.)
domain: Indagine archeometrica e diagnostica
label: has archaeometric diagnostic survey type @en
range: Tipo di indagine archeometrica e diagnostica
sub property of: hasType
inverse of: è tipo di indagine archeometrica e diagnostica di
version info: stable @en
version info: stabile
iccd norm tag: ICCD Normativa Trasversale 4.00: RE/IND/INDI - ICCD normative di versioni precedenti: RE/AIN/AINT

ha editore
type: ObjectProperty
comment: Questa proprietà collega un'edizione all'editore.
comment: This property relates an edition to its editor. @en
domain: Edizione
label: has editor @en
range: Agent
sub property of: ha agente correlato
inverse of: è editore di
version info: stable @en
version info: stabile

ha documentazione
type: ObjectProperty
comment: This property relates a cultural entity to the documentation related to the cutultural entity described in a catalogue record. @en
comment: Questa proprietà collega un bene culturale alla documentazione che riguarda il bene descritto in una scheda di catalogo.
domain: Thing
label: has documentation @en
range: Documentazione
inverse of: è documentazione di
version info: stable @en
version info: stabile
iccd norm tag: ICCD Normativa Trasversale 4.00: tutti i campi strutturati di DO tranne BIB

ha Stato emittente
type: ObjectProperty
comment: Questa proprietà collega l'emissione della moneta alla realtà statuale emittente, coeva all'emissione della moneta. Questa proprietà, esprimendo il significato della relazione nel nome, dà una rappresentazione semplificata della relazione che lega questa entità e l'agente; la stessa relazione è rappresentata attraverso una n-ary relation, arco-core:AgentRole, che permette di collegare l'agente al ruolo che riveste nei confronti dell'entità.
comment: This property relates the coin issuance to the issuing State of that historic period. In the ontology this relationship is modelled also by the class AgentRole which allows more expressiveness. @en
domain: Emissione di moneta
label: has issuing State @en
range: Agent
sub property of: ha agente correlato
inverse of: è stato emittente in
version info: stabile
version info: stable @en
iccd norm tag: ICCD Normativa NU: DA/AUE/AUES - ICCD Normativa OA (dopo il rilascio della specifica scheda NU nel 2004 la scheda OA non è stata più utilizzata per la catalogazione di monete e medaglie): AU/EDT/EDTA

è moneta membro di
type: ObjectProperty
comment: Questa proprietà collega una moneta a una serie di monete di cui è membro.
comment: This property relates a coin to a numismatic series which is member of. @en
domain: CulturalEntity
label: is coin member of @en
range: Serie numismatica
sub property of: isMemberOf
version info: stable @en
version info: stabile

ha tipo di anomalia
type: ObjectProperty
comment: This property relates an anomaly revealed by a photo interpretation rendering to its anomaly type (line, point, poligony anomaly). @en
comment: Questa proprietà collega un'anomalia rilevata nel corso di una fotointerpretazione o fotorestituzione al tipo di anomalia (puntuale, lineare, areale).
domain: Anomalia
label: has anomaly type @en
range: Tipo di anomalia
sub property of: hasType
inverse of: è tipo di anomalia di
version info: stable @en
version info: stabile
iccd norm tag: ICCD Normativa Trasversale 4.00: RE/FOI/FOIQ

ha soggetto emittente
type: ObjectProperty
comment: Questa proprietà collega l'emissione della moneta al soggetto emittente. Questa proprietà, esprimendo il significato della relazione nel nome, dà una rappresentazione semplificata della relazione che lega questa entità e l'agente; la stessa relazione è rappresentata attraverso una n-ary relation, arco-core:AgentRole, che permette di collegare l'agente al ruolo che riveste nei confronti dell'entità.
comment: This property relates to coin's issuance to the issuer agent. In the ontology this relationship is modelled also by the class AgentRole which allows more expressiveness. @en
domain: Emissione di moneta
label: has issuer @en
range: Agent
sub property of: ha agente correlato
inverse of: è emittente in
version info: stabile
version info: stable @en
iccd norm tag: ICCD Normativa NU: DA/AUE/AUEE - ICCD Normativa OA (dopo il rilascio della specifica scheda NU nel 2004 la scheda OA non è stata più utilizzata per la catalogazione di monete e medaglie): AU/EDT/EDTN

è ente proponente di
type: ObjectProperty
comment: Questa proprietà collega all'ente proponente, ovvero il soggetto che ha proposto il provvedimento (identificato per mezzo della denominazione per esteso oppure, nel caso di Enti accreditati dall'ICCD, del relativo codice assegnato dall'Istituto) al provvedimento di tutela relativo al bene culturale, oppure direttamente al bene culturale. La relazione tra il ruolo e l'agente che lo riveste è espressa, in maniera generica, nel nome della proprietà, che quindi ne fornisce una rappresentazione semplificata, con ridotta espressività. Nell'ontologia questa relazione è modellata anche, in maniera più espressiva, dalla classe AgentRole, che permette di collegare l'agente e il suo ruolo.
comment: This property relates an agent that is a proponent agency of a protective measure of a cultural property to the protective measure or to the cultural entity itself. The relation is declared in the name of the property, but within the ontology this relation is also modeled, in a more expressive way, through the class AgentRole. @en
domain: Agent
label: is proponent agency of @en
range: Class
  union of: CulturalEntity
  union of: Provvedimento di tutela
sub property of: è agente correlato a
version info: stable @en
version info: stabile
iccd norm tag: ICCD Normativa Trasversale 4.00: TU/NVC/NVCA

Opera derivata
type: Class
comment: This class represents a derivated work of a cultural property (copy, reuse, facsimile, forgery), created by the same author or by another author. @en
comment: Questa classe rappresenta una derivazione del bene catalogato (reimpiego, copia, contraffazione, replica, controtipo) prodotta dallo stesso o da altro autore.
label: Derivated work @en
subclass of: CulturalEntity
subclass of: Restriction
  all values from: Tipo di opera derivata
  on property: ha tipo di opera derivata
subclass of: Restriction
  all values from: Literal
  on property: collocazione dell'opera derivata
subclass of: Restriction
  all values from: Agent
  on property: ha autore
version info: stable @en
version info: stabile
iccd norm tag: ICCD Normativa S 3: RO/COP - Normativa F: RO/CRF - Normative RA, SMO, PST, OAC, OA, MI, D, NU: RO/REI - Normative CA, MA: RO/RIU

è funzione d'uso di
type: ObjectProperty
comment: This property relates the use function of an entity to the related entity. @en
comment: Questa proprietà collega la funzione d'uso di un'entità alla relativa entità.
domain: Funzione d'uso
label: is use function of @en
range: Thing
version info: stable @en
version info: stabile

Indagine archeometrica e diagnostica
type: Class
comment: This class represents a particular type of survey on a cultural property, that is an archaeometric and diagnostic survey (coring, geophysical prospecting, etc.). @en
comment: Questa classe rappresenta un tipo particolare di indagine su bene culturale, ovvero un'indagine archeometrica e diagnostica (carotaggi, prospezioni geofisiche, analisi di vario tipo).
label: Archaeometric and diagnostic survey @en
subclass of: Indagine
subclass of: Restriction
  all values from: Agent
  on property: ha operatore dell'attività
subclass of: Restriction
  all values from: Tipo di indagine archeometrica e diagnostica
  on property: ha tipo di indagine archeometrica e diagnostica
subclass of: Restriction
  all values from: Agent
  on property: ha finanziatore dell'attività
subclass of: Restriction
  all values from: Literal
  on property: referto
subclass of: Restriction
  all values from: Agent
  on property: ha responsabile dell'attività
subclass of: Restriction
  all values from: Motivo di indagine
  on property: ha motivo di indagine
version info: stabile
version info: stable @en
iccd norm tag: ICCD Normativa Trasversale 4.00: RE/IND - ICCD normative di versioni precedenti: RE/AIN

Motivo di indagine
type: Class
comment: This class represents the main motivation of a survey. @en
comment: Questa classe rappresenta il motivo principale che ha determinato una ricognizione archeologica o uno scavo archeologico.
label: Survey Motivation @en
subclass of: Description
subclass of: Restriction
  on property: è motivo di indagine di
  some values from: Indagine
version info: stable @en
version info: stabile

ha responsabile scientifico della ricerca
type: ObjectProperty
comment: This property relates a research to the research's scientific responsible. In the ontology this relationship is modelled also by the class AgentRole which allows more expressiveness. @en
comment: Questa proprietà collega una ricerca al responsabile scientifico della ricerca. La relazione tra il ruolo e l'agente che lo riveste è espressa nel nome della proprietà, che quindi ne fornisce una rappresentazione semplificata, con ridotta espressività. Nell'ontologia questa relazione è modellata anche, in maniera più espressiva, dalla classe AgentRole, che permette di collegare l'agente e il suo ruolo.
domain: Ricerca
label: has research scientific director @en
range: Agent
sub property of: ha agente correlato
inverse of: è responsabile scientifico della ricerca di
version info: stable @en
version info: stabile
iccd norm tag: ICCD Normativa SM e BDM 4.00: DR/DRR

Indagine su bene archeologico
type: Class
comment: This class represents a particular type of survey on a cultural property, that is a survey on anthropological materials (e.g.: chemical analysis, histological analysis, CT scan, etc.). @en
comment: Questa classe rappresenta un'indagine su una tipologia particolare di bene archeologico, ovvero i reperti antropologici (es.: analisi istologica, analisi chimica, TC, etc.).
label: Archaeological property survey @en
subclass of: Indagine
subclass of: Restriction
  all values from: Tipo di indagine su bene archeologico
  on property: ha tipo di indagine su bene archeologico
subclass of: Restriction
  all values from: Motivo di indagine
  on property: ha motivo di indagine
subclass of: Restriction
  all values from: Literal
  on property: documentazione tecnica
version info: stable @en
version info: stabile
iccd norm tag: ICCD Normativa AT 3.01: IN/INI

Posizione della riproduzione
type: Class
comment: Questa classe rappresenta la posizione fisica della riproduzione della stampa all'interno della pubblicazione, che rappresenta quindi una derivazione della stampa stessa.
comment: This class represents the phisical position of a printed reproduction in a publication. @en
label: Reproduction position @en
subclass of: Location
subclass of: Restriction
  on property: è posizione della riproduzione di
  some values from: Riproduzione
subclass of: Restriction
  all values from: Literal
  on property: numero di pagina o tavola
disjoint with: Unità stratigrafica
version info: stable @en
version info: stabile
iccd norm tag: ICCD Normativa S 3: RO/ADL/ADLP

è opera collegata coinvolta in
type: ObjectProperty
comment: This property relates a work related to a cultural property (e.g.: a preparatory work, a prototype, a copy, a reuse, etc.) to the situation in which that work is related to the cultural property itself. @en
comment: Questa proprietà collega un'opera collegata a un bene culturale al rapporto tra l'opera e il bene culturale (es.: un lavoro preparatorio, un prototipo, una copia, un reimpiego di tutto il bene o di una sua parte, ecc.)
domain: CulturalEntity
label: is related work involved in @en
range: Rapporto con opera collegata
version info: stable @en
version info: stabile

è rapporto con opera collegata di
type: ObjectProperty
comment: This property, inverse of 'has related work situation', relates a situation in which a cultural property is related to another work, that could even be another cultural property, to the cultural property. @en
comment: Questa proprietà, inversa di 'ha rapporto con opera collegata', collega la relazione tra il bene culturale e un'altra opera che ne costituisce una fase preparatoria o che ne rappresenta la fase finale al bene culturale stesso.
domain: Rapporto con opera collegata
label: is related work situation of @en
range: CulturalEntity
version info: stable @en
version info: stabile

ha proprietario
type: ObjectProperty
comment: Questa proprietà collega una condizione giuridica al proprietario dell'oggetto che si trova in quella condizione.
comment: This property relates a legal situation to the owner of the object that is in that legal situation. @en
domain: Situazione giuridica
label: has owner @en
range: Agent
sub property of: ha agente correlato
inverse of: è proprietario in
version info: stabile
version info: stable @en
iccd norm tag: ICCD Normativa Trasversale 4.00: TU/CDG/CDGS

Interpretazione del sesso
type: Class
comment: This class represents the interpretation of the sex of an anthropological material. @en
comment: Questa classe rappresenta la stima del sesso di un reperto antropologico.
label: Sex interpretation @en
subclass of: Interpretazione
subclass of: Restriction
  on property: sesso stimato
  some values from: Literal
subclass of: Restriction
  on property: è interpretazione del sesso di
  some values from: CulturalEntity
version info: stabile
version info: stable @en
iccd norm tag: ICCD Normativa AT: DA/STS

è emittente in
type: ObjectProperty
comment: Questa è la proprietà inversa di "ha emittente".
comment: This is the inverse property of "has issuer". @en
domain: Agent
label: is issuer in @en
range: Emissione di moneta
sub property of: è agente correlato a
version info: stabile
version info: stable

è documentazione di
type: ObjectProperty
comment: This property relates a documentation to an entity. For example, it can relates a documentation concerning a cultural property described in a catalogue record to that cultural property. @en
comment: Questa proprietà collega una documentazione a un'entità che viene documentata. Per esempio, può collega una documentazione che riguarda il bene descritto in una scheda di catalogo al bene stesso.
domain: Documentazione
label: is documentation of @en
range: Thing
version info: stabile
version info: stable @en
iccd norm tag: ICCD Normativa Trasversale 4.00: tutti i campi strutturati di DO tranne BIB

Affidabilità
type: Class
comment: This class represents the reliability level of detected information relative to photo interpretation rendering. @en
comment: Questa classe rappresenta il livello di affidabilità delle informazioni rilevate nell'indagine di fotointerpretazione/fotorestituzione.
label: Reliability @en
subclass of: Characteristic
subclass of: Restriction
  all values from: Fotointerpretazione e fotorestituzione
  on property:
    inverse of: ha affidabilità
version info: stable @en
version info: stabile
iccd norm tag: ICCD Normativa Trasversale 4.00: RE/FOI/FOIO

Metodo di individuazione
type: Class
comment: This class represents the method of detection that allowed the detection of a cultural property and which is indicative of the type and consistency of some information in the catalogue record that describes it (e.g.: coring, archive data, oral sources). @en
comment: Questa classe rappresenta la modalità di individuazione che ha consentito l'individuazione di un bene culturale e che è indicativa della tipologia e della consistenza di alcune informazioni presenti nella scheda di catalogo che lo descrive (es.: carotaggio, dati di archivio, fonti orali).
label: Detection Method @en
subclass of: Method
subclass of: Restriction
  on property: è metodo di individuazione di
  some values from: CulturalEntity
version info: stabile
version info: stable @en
iccd norm tag: ICCD Normativa Trasversale 4.00: OG/OGM

codice d'inventario
type: DatatypeProperty
comment: This property represents the inventory identifier attributed by a juridical container to a cultural property. @en
comment: Questa proprietà rappresenta il codice di inventario nella forma numerica o alfanumerica attribuita dalla struttura conservativa (soprintendenza, museo, galleria, deposito, ecc.) che ha effettuato l'inventariazione del bene.
domain: Inventario
label: inventory identifier @en
range: Literal
sub property of: identifier
version info: stabile
version info: stable @en
iccd norm tag: UB/INV/INVN

ha cronologia
type: ObjectProperty
comment: Questa proprietà collega un'entità alla sua cronologia.
comment: This property relates an entity to its dating. @en
domain: Thing
label: has dating @en
range: Cronologia
sub property of: hasSituation
inverse of: è cronologia di
version info: stable @en
version info: stabile
iccd norm tag: ICCD Normativa Trasversale 4.00: DT - ICCD Normative F, RA, SMO, PST, S, OAC, OA, MI, D, NU: RO/ROF

collocazione dell'opera derivata
type: DatatypeProperty
comment: Questa proprietà rappresenta la localizzazione geografica e collocazione specifica dell'opera derivata dal bene culturale.
comment: This property represents derivated work's geographical and specific location. @en
domain: Opera derivata
label: derivated work location @en
range: Literal
version info: stable @en
version info: stabile
iccd norm tag: ICCD Normative F, RA, SMO, PST, S, OAC, OA, MI, D, NU: RO/ROF/ROFC - Normativa S: RO/COP/COPC - Normativa F: RO/CRF/CRFC

Attribuzione Alternativa di Autore
type: Class
comment: Questa classe rappresenta un'attribuzione di autore superata, alternativa o tradizionale.
comment: This class represents an authorship attribution alternative to the preferred one. @en
label: Alternative Authorship Attribution @en
subclass of: Attribuzione di Autore o responsabilità
subclass of: Restriction
  all values from: Literal
  on property: intervento dell'autore
subclass of: Restriction
  on property: ha autore attribuito
  some values from: Agent
version info: stabile
version info: stable @en
iccd norm tag: AU/AAT

è opera collegata a
type: ObjectProperty
comment: Questa è la proprietà inversa a "ha opera collegata".
comment: This is the inverse property of "has related work". @en
domain: CulturalEntity
label: is work related to @en
range: CulturalEntity
version info: stabile
version info: stable @en

ha responsabile scientifico dell'indagine
type: ObjectProperty
comment: This property relates a survey to its scientific director. @en
comment: Questa proprietà collega un'indagine al suo responsabile scientifico.
domain: Indagine
label: has survey scientific director @en
range: Agent
sub property of: ha agente correlato
inverse of: è responsabile scientifico dell'indagine di
version info: stabile
version info: stable @en
iccd norm tag: ICCD Normativa Trasversale 4.00: RE/RCG/RCGA; RE/DSC/DSCA; RE/FOI/FOIS

è edizione di
type: ObjectProperty
comment: This property relates an entity's edition to the entity. @en
comment: Questa proprietà collega un'edizione di un'entità all'entità stessa.
domain: Edizione
label: is edition of @en
range: Thing
version info: stabile
version info: stable @en
iccd norm tag: ICCD Normative VeAC e AT 3.01: DO/BSE/BSEN - Normativa S 3.00: RO/ADL/ADLE.

Tipo di indagine di rilevamento
type: Class
comment: Questa classe rappresenta il tipo di indagine di rilevamento (rilevamento nel contesto/ rilevamento decontestualizzato).
comment: This class represents the type of observation survey (in the context / out of the context). @en
label: Observation survey type @en
subclass of: Type
version info: stable @en
version info: stabile
iccd norm tag: ICCD Normativa BDI 4.00: LA/PRM

Tipo di uso non disponibile
type: Tipo d'uso
type: NamedIndividual
comment: This individual represents the lack of available data regarding the type of use of a cultural entity. @en
comment: Questo individuo rappresenta la mancanza di dati disponibili relativamente al tipo di uso di un bene.
label: Use type unavailable @en
version info: stable @en
version info: stabile

Uso strutturale
type: Specifiche del tipo d'uso
type: NamedIndividual
comment: This individual represents cultural entity's structural use specifications. @en
comment: Questo individuo rappresenta le specifiche d'uso strutturale di un bene.
label: Structural use @en
version info: stable @en
version info: stabile

identificativo di unità documentaria
type: DatatypeProperty
type: FunctionalProperty
comment: This property represents the identifier of an archival record. @en
comment: Questa proprietà rappresenta l'identificativo di un'unità documentaria.
domain: Unità documentaria
label: archival record identifier @en
range: Literal
sub property of: identifier
version info: stable @en
version info: stabile
iccd norm tag: ICCD Normativa FF: PA/PAC/PACI; PA/PAC/PACA

motivo di uscita dalla collezione
type: DatatypeProperty
comment: Questa proprietà rappresenta il motivo che ha determinato l'uscita da una collezione di un bene culturale.
comment: This property represents the reason that led a cultural entity to the exit from a collection. @en
domain: Appartenenza a Collezione
label: collection leaving reason @en
range: Literal
version info: stable @en
version info: stabile
iccd norm tag: UB/COL/COLM

è tipo di certificazione di esportazione o importazione di
type: ObjectProperty
comment: This property relates the type (i.e. delivery confirmation certification, free movement certification etc) of an import-export certification of a cultural entity to the rrelated certification. @en
comment: Questa proprietà collega la tipologia (es.: attestato di libera circolazione, licenza di esportazione definitiva, ecc) di una certificazione amministrativa di circolazione ed esportazione/importazione di un bene culturale alla relativa certificazione.
domain: Tipo di certificazione di esportazione o importazione
label: is export import certification type of @en
range: Certificazione di importazione o esportazione
sub property of: isTypeOf
version info: stabile
version info: stable @en

ha fonico dell'indagine
type: ObjectProperty
comment: Questa proprietà collega un'indagine di rilevamento di un bene demo-etno-antropologico al fonico professionista (diverso dal rilevatore) che ha effettuato la registrazione sonora. La relazione tra il ruolo e l'agente che lo riveste è espressa nel nome della proprietà, che quindi ne fornisce una rappresentazione semplificata, con ridotta espressività. Nell'ontologia questa relazione è modellata anche, in maniera più espressiva, dalla classe AgentRole, che permette di collegare l'agente e il suo ruolo.
comment: This property relates an observation survey of a demo-etno-antropologic entity to the sound engineer who recorded it. In the ontology this relationship is modelled also by the class AgentRole which allows more expressiveness. @en
domain: Indagine di rilevamento
label: has survey sound engineer @en
range: Agent
sub property of: ha agente correlato
inverse of: è fonico dell'indagine di
version info: stabile
version info: stable @en
iccd norm tag: ICCD Normativa BDI 3.00: DR/DRF

documentazione tecnica
type: DatatypeProperty
comment: Questa proprietà rappresenta la documentazione relativa alle informazioni rilevate nel corso dell'indagine su reperto antropologico.
comment: This property represents documentation relating to information collected during survey on anthropological evidence. @en
domain: Indagine su bene archeologico
label: technical documentation @en
range: Literal
version info: stable @en
version info: stabile
iccd norm tag: ICCD Normativa AT 3.01: IN/INI/INIZ

è stato emittente in
type: ObjectProperty
comment: This is the inverse property of "has issuing state". @en
comment: Questa è la proprietà inversa di "ha stato emittente".
domain: Agent
label: is issuing state in @en
range: Emissione di moneta
sub property of: è agente correlato a
version info: stable @en
version info: stabile

Riuso
type: NamedIndividual
type: Specifiche del tipo d'uso
type: Class
comment: This class represents the reuse of a cultural property or of one of its parts. @en
comment: This class represents cultural entity's reuse. @en
comment: Questa classe rappresenta il riuso subito dal bene catalogato o da una sua parte.
label: Reuse @en
subclass of: Opera derivata
version info: provvisoria @en
version info: stabile
version info: stable @en
iccd norm tag: ICCD Normative RA, SMO, PST, OAC, OA, MI, NU: RO/REI - ICCD Normative CA, MA: RO/RIU - ICCD Normativa F: ROP/CRF/CRFT = 'reimpiego'

sono diritti d'autore di
type: ObjectProperty
comment: This is the inverse property of "is copyright of". @en
comment: Questa è la proprietà inversa di "ha diritti d'autore".
domain: Diritti d'autore
label: is copyright of @en
range: Thing
version info: stabile
version info: stable @en

ha datazione alternativa
type: ObjectProperty
comment: This property relates an alternative dating to its type. @en
comment: Questa proprietà collega una datazione alternativa con la sua tipologia.
domain: Datazione alternativa
label: has alternative dating type @en
range: Tipo di datazione alternativa
sub property of: hasType
inverse of: è datazione alternativa di
version info: stabile
version info: stable @en
iccd norm tag: ICCD Normativa Trasversale: DT/ADT/ADTT

Immagine di indagine
type: Class
comment: This class represents the image analysed during a photo interpretation or rendering survey. @en
comment: Questa classe rappresenta l'immagine presa in esame nel corso di una fotointerpretazione o fotorestituzione.
label: Survey Image @en
subclass of: Object
subclass of: Restriction
  on property: è immagine di indagine
  some values from: Fotointerpretazione e fotorestituzione
subclass of: Restriction
  all values from: Literal
  on property: identificativo immagine di indagine
subclass of: Restriction
  all values from: Tipo di immagine di indagine
  on property: ha tipo di immagine di indagine
version info: stabile
version info: stable @en
iccd norm tag: ICCD Normativa Trasversale 4.00: RE/FOI/FOIT + FOID

Riproduzione
type: Class
comment: This class represents the reproduction of an image, that is, or was, part of a publication. @en
comment: Questa classe rappresenta la riproduzione dell'immagine contenuta nella pubblicazione di cui la stampa è, o è stata, parte integrante.
label: Reproduction @en
subclass of: Object
subclass of: Restriction
  on property: è riproduzione di
  some values from: Stampa in pubblicazione
subclass of: Restriction
  all values from: Posizione della riproduzione
  on property: ha posizione della riproduzione
version info: stable @en
version info: stabile
iccd norm tag: ICCD Normativa S 3: RO/ADL

ha età della morte stimata
type: ObjectProperty
comment: Questa proprietà collega un reperto antropologico alla stima dell'età della morte.
comment: This property relates an antropologic artifact to the interpretation of its age of death. @en
domain: CulturalEntity
label: has age of death interpretation @en
range: Interpretazione dell'età della morte
sub property of: hasSituation
inverse of: è età della morte stimata di
version info: stabile
version info: stable @en

ha moneta membro
type: ObjectProperty
comment: Questa proprietà collega una serie di monete a una moneta che ne è membro.
comment: This property relates a numismatic series to a coin that is member of it. @en
domain: Serie numismatica
label: has coin member @en
range: CulturalEntity
sub property of: hasMember
inverse of: è moneta membro di
version info: stabile
version info: stable @en

è zecchiere in
type: ObjectProperty
comment: This is the inverse property of "has minter". @en
comment: Questa è la proprietà inversa di "ha zecchiere".
domain: Agent
label: in minter in @en
range: Emissione di moneta
sub property of: è agente correlato a
version info: stabile
version info: stable @en

Tipo di Titolo
type: Class
comment: Questa classe rappresenta il tipo di titolo di un oggetto (es.: originario, alternativo).
comment: This class represents the type of an object title (e.g. original, alternative) @en
label: Title Type @en
subclass of: Type
version info: stable @en
version info: stabile
iccd norm tag: ICCD Normativa Trasversale: DA/AID/AIDN; DA/AID/AIDT - Normativa S e MI: OG/SGT/SGTP Normativa F: SG/SGL/SGLA; SG/SGL/SGLT; SG/SGL/SGLL - Altre normative di versioni precedenti alla 4.00: OG/SGT/SGTR; OG/SGT/SGTT - Normative VeAC e AT: DO/BSE/BSET e BSEC.

Edizione
type: Class
comment: Questa classe rappresenta l'edizione di un'entità. Per esempio, l'edizione cartacea o digitale di un bene culturale o di un'opera collegata a un bene culturale (ad es. una pubblicazione contenente una stampa).
comment: This class represents the edition of an entity (e.g. the print edition of a cultural property). @en
label: Edition @en
subclass of: Object
subclass of: Restriction
  all values from: Agent
  on property: ha autore secondario
subclass of: Restriction
  all values from: Agent
  on property: ha editore
subclass of: Restriction
  all values from: Agent
  on property: ha autore
subclass of: Restriction
  on property: è edizione di
  some values from: Thing
subclass of: Restriction
  all values from: Literal
  on property: time
subclass of: Restriction
  all values from: Literal
  on property: luogo dell'edizione
subclass of: Restriction
  all values from: Titolo
  on property: ha titolo
version info: stable @en
version info: stabile
iccd norm tag: ICCD Normative VeAC e AT 3.01: DO/BSE/BSEN - Normativa S 3.00: RO/ADL/ADLE.

modalità di uso
type: FunctionalProperty
type: DatatypeProperty
domain: Uso
label: use conditions @en
range: Literal
version info: stabile
version info: stable @en
iccd norm tag: ICCD Normativa Trasversale 4.00: UT/UTU/UTUM - BDM 2.00: UT/UTM - SMO, PTS 3.01: DA/UTM

ha origine dell'anomalia
type: ObjectProperty
comment: Questa proprietà collega un'anomalia rilevata durante una fotointerpretazione o fotorestituzione all'origine dell'anomalia (naturale, antropica, incerta).
comment: This property relates an anomaly detected during a photo interpretation or rendering survey to the origin of the anomaly (e.g. natural, unsure). @en
domain: Anomalia
label: has anomaly origin @en
range: Origine dell'anomalia
sub property of: hasCharacteristic
inverse of: è origine dell'anomalia di
version info: stabile
version info: stable @en
iccd norm tag: ICCD Normativa Trasversale 4.00: RE/FOI/FOIA

Emissione di moneta
type: Class
comment: Questa classe rappresenta l'emissione di una moneta, intesa come un evento collocato nel tempo, cui partecipano diversi agenti con diversi ruoli (Stato emittente, Zecca, Monetiere, etc.)
comment: This class represents the issuance of a coin, at a particular time and with different agents participanting to it (Mint, Issuing State, etc.) @en
label: Coin issuance @en
subclass of: Situation
subclass of: Restriction
  all values from: Agent
  on property: ha Stato emittente
subclass of: Restriction
  all values from: Agent
  on property: ha zecchiere
subclass of: Restriction
  on property: è emissione di moneta
  some values from: CulturalEntity
subclass of: Restriction
  all values from: Agent
  on property: ha zecca
subclass of: Restriction
  all values from: Agent
  on property: ha soggetto emittente
version info: stabile
version info: stable @en
iccd norm tag: ICCD Normativa NU: DA/AUE - ICCD Normativa OA (dopo il rilascio della specifica scheda NU nel 2004 la scheda OA non è stata più utilizzata per la catalogazione di monete e medaglie): AU/EDT

ha titolare dei diritti d'autore
type: ObjectProperty
comment: This property relates an entity's copyright to its copyright holder. In the ontology this relationship is modelled also by the class AgentRole which allows more expressiveness. @en
comment: Questa proprietà collega i diritti d'autore di un'entità al titolare dei diritti d'autore. Questa proprietà fornisce una rappresentazione semplificata della relazione, il cui valore viene esplicitato nel nome della proprietà. La stessa relazione viene anche modellata nell'ontologia, in maniera più espressiva, per mezzo della classe AgentRole, che permette di collegare un agente al ruolo che ha rivestito (in questo caso, al ruolo di "titolare dei diritti d'autore").
domain: Diritti d'autore
label: has copyright holder @en
range: Agent
sub property of: ha agente correlato
inverse of: è titolare dei diritti d'autore in
version info: stable @en
version info: stabile
iccd norm tag: ICCD Normativa F 4.00 e OAC: TU/CPR/CPRN

Occasione legata al ciclo della vita
type: Class
comment: This class represents a circumstance related to life cycles (ceremonies, custom, celebration) @en
comment: Questa classe rappresenta un'occasione legata ai cicli della vita (cerimonie, riti, feste).
label: Life cycle circumstance @en
subclass of: Occasione
version info: stabile
version info: stable @en
iccd norm tag: ICCD Normativa BDI 4.00: CA/CAO/CAOV

riproduce
type: ObjectProperty
comment: This property relates the reproduction of an print in a publication to the print itself. @en
comment: Questa proprietà collega la riproduzione dell'immagine contenuta nella pubblicazione di cui la stampa è, o è stata, parte integrante con la stampa stessa.
domain: Riproduzione
label: reproduces @en
range: CulturalEntity
version info: stable @en
version info: stabile
iccd norm tag: ICCD Normativa S 3: RO/ADL

Origine incerta
type: Origine dell'anomalia
type: NamedIndividual
label: Uncertain origin @en

è sottospecie in
type: ObjectProperty
comment: Questa proprietà collega una sottospecie alla tassonomia in cui è classificata.
comment: This property relates a subspecies to the biological taxon in which it is classified. @en
domain: Sottospecie
label: is subspecies in @en
range: Tassonomia biologica
sub property of: isConceptOf
version info: stable @en
version info: stabile

Tipo di mutamento condizione materiale
type: Class
comment: This class represents the type of change of availability of a cultural property (e.g. theft, distruction) @en
comment: Questa classe rappresenta il tipo di mutamento di condizione materiale di un bene culturale (es.: furto, distruzione, recupero).
label: Change of availability type @en
subclass of: Type
version info: stabile
version info: stable @en
iccd norm tag: ICCD Normativa Trasversale 4.00: TU/ALN/ALNT

è circostanza di
type: ObjectProperty
comment: Questa proprietà, inversa di 'ha circostanza', collega l'occasione che ha determinato una situazione (es. la committenza di un bene culturale, l'uso di un bene culturale ecc.) alla relativa situazione.
comment: This property, inverse of 'has circumstance' relates the circumstance which led to a situation (e.g. a cultural entity committment, a cultural entity use, etc.) to the related situation. @en
domain: Occasione
label: is circumstance of @en
range: Thing
sub property of: isSituationOf
version info: stabile
version info: stable @en

è responsabile dell'immissione in patrimonio di
type: ObjectProperty
comment: Questa proprietà collega il responsabile dell'inventariazione patrimoniale del bene all'inventario patrimoniale.
comment: This property relates the agent responsible for the cultural entity's inventory to the current inventory. @en
domain: Agent
label: is responsible for insertion of @en
range: Inventario Patrimoniale
sub property of: è agente correlato a
version info: stable @en
version info: stabile

è intervento ammesso da
type: ObjectProperty
comment: Questa proprietà, inversa a "ha intervento ammesso", collega un intervento allo strumento urbanistico-territoriale che ammette quell'intervento.
comment: This property, inverse of "has eligible intervention", relates an intervention to the urban planning instrument that finds eligible that intervention. @en
domain: Intervento ammesso
label: is intervention eligible by @en
range: Strumento urbanistico-territoriale
version info: stable @en
version info: stabile

è età della morte stimata di
type: ObjectProperty
comment: This property relates the age of death interpretation of an antropologic artifact to the its antropologic artifact. @en
domain: Interpretazione dell'età della morte
is defined by: Questa proprietà collega la stima della morte di un reperto antropologico al suo reperto archeologico.
label: is age of death interpretation of @en
range: CulturalEntity
sub property of: isSituationOf
version info: stable @en
version info: stabile

Occasione legata al lavoro
type: Class
comment: This class represents a circumstance related to work (e.g.: agriculture, bakery) @en
comment: Questa classe rappresenta un'occasione connessa al lavoro (es.: panificazione, agricoltura)
label: Work circumstance @en
subclass of: Occasione
version info: stable @en
version info: stabile
iccd norm tag: ICCD Normativa BDI 4.00: CA/CAO/CAOL

è stato realizzato in
type: ObjectProperty
comment: Questa proprietà collega un bene culturale a un altro bene culturale collegato, che ne costituisce la sede di produzione/realizzazione.
comment: This property relates a cultural entity to a connected cultural entity which constitutes its production site. @en
domain: CulturalEntity
label: ha luogo di creazione
label: has creation location @en
range: CulturalEntity
sub property of: ha opera collegata
inverse of: è luogo di realizzazione di
version info: stable @en
version info: stabile
iccd norm tag: ICCD Normativa Trasversale 4.00: RV/RSE/RSER = 'è stato realizzato in' (versioni precedenti: 'sede di realizzazione')

Categoria sociale dell'utente
type: Class
comment: This class represents the social category of a user (e.g. of a cultural property) @en
comment: Questa classe rappresenta la categoria sociale a cui appartiene l'utente del bene.
label: User social category @en
subclass of: Category
version info: stabile
version info: stable @en
iccd norm tag: ICCD Normative BDM 2.00: UT/UTN/UTNC

provenienza
type: DatatypeProperty
comment: This property represents origin of the cultural entity acquired in the heritage. @en
comment: Questa proprietà rappresenta, a testo libero, la provenienza del bene acquisito nel patrimonio.
domain: Inventario Patrimoniale
label: provenance @en
range: Literal
version info: stabile
version info: stable @en
iccd norm tag: ICCD Normativa Trasversale 4.00: UB/INP/INPP

ha certificazione di esportazione/importazione
type: ObjectProperty
comment: Questa proprietà collega un bene culturale a una certificazione amministrativa per la circolazione e l'esportazione/importazione che riguarda il bene stesso.
comment: This property relates a cultural entity to its import-export certification. @en
domain: CulturalEntity
label: has export/import certification @en
range: Certificazione di importazione o esportazione
inverse of: è certificato di importazione/esportazione di
version info: stable @en
version info: stabile
iccd norm tag: ICCD Normativa Trasversale 4.00: TU/ESP

ha ricerca
type: ObjectProperty
comment: This property relates a culural entity to the research, which is the context where the enity's cataloguing record has been produced. @en
comment: Questa proprietà collega un bene culturale alla ricerca nell'ambito della quale è stata redatta la scheda.
domain: CulturalEntity
label: has research @en
range: Ricerca
inverse of: è ricerca su
version info: stabile
version info: stable @en
iccd norm tag: ICCD Normativa SM e BDM 4.00: DR/DRT

è specie in
type: ObjectProperty
comment: Questa proprietà collega una specie alla tassonomia in cui è classificata.
comment: This property relates a species to the biological taxon in which it is classified. @en
domain: Specie
label: is species in @en
range: Tassonomia biologica
sub property of: isConceptOf
version info: stabile
version info: stable @en

è stima di
type: ObjectProperty
comment: This property relates an estimate of an entity to that entity. @en
comment: Questa proprietà collega una stima di un'entità all'entità stimata.
domain: Stima
label: is estimate of @en
range: Thing
sub property of: isSituationOf
version info: stable @en
version info: stabile

Attribuzione di Ambito Culturale
type: Class
comment: This class represents the attribution of a cultural scope, to which the cultural property is related (e.g.: neoclassical, Milanese manifacturing, etc.) @en
comment: Questa classe rappresenta l'attribuzione di un ambito culturale a cui può essere riferito il bene culturale. Per l'ambito culturale si usano definizioni quali: ambito, cultura, periodo, produzione, scuola, manifattura, ecc.; a questi termini segue la qualificazione geografica o il nome dell'ambito, della cultura, del periodo, della produzione, della scuola, della manifattura, ecc.
label: Cultural Scope Attribution @en
subclass of: Attribuzione di Autore o responsabilità
subclass of: Restriction
  on property: ha ambito culturale
  some values from: Ambito culturale
version info: stable @en
version info: stabile
iccd norm tag: AU/ATB

Datazione alternativa
type: Class
comment: This class represents an alternative dating of a cultural property (e.g.: an obsolete dating, a dating based on another method of dating). @en
comment: Questa classe rappresenta una eventuale altra datazione che può riguardare un bene culturale (es.: datazione tradizionale, altro metodo di datazione).
label: Alternative dating @en
subclass of: Cronologia
subclass of: Restriction
  on property: ha datazione alternativa
  some values from: Tipo di datazione alternativa
version info: stabile
version info: stable @en
iccd norm tag: ICCD Normativa Trasversale: DT/ADT.

ha metodo di individuazione
type: ObjectProperty
comment: This property relates a cultural property to the detection method that allowed the detection of the cultural property. @en
comment: Questa proprietà collega un bene culturale alla modalità di individuazione che ne ha permesso l'individuazione.
domain: CulturalEntity
label: has detection method @en
range: Metodo di individuazione
sub property of: hasMethod
inverse of: è metodo di individuazione di
version info: stabile
version info: stable @en
iccd norm tag: ICCD Normativa Trasversale 4.00: OG/OGM

Documentazione video-cinematografica
type: Class
comment: Questa classe rappresenta la documentazione video-cinematografica relativa a un oggetto, per esempio a un bene culturale
comment: This class represents the film documentation of an object, e.g. a cultural property. @en
label: Video documentation @en
subclass of: Documentazione
subclass of: Restriction
  on property: ha formato
  some values from: Class
    intersection of: Tipo di documentazione
    intersection of: Formato
version info: stabile
version info: stable @en
iccd norm tag: VDC

Inventario Patrimoniale
type: Class
comment: This class represents the current inventory of a cultural property, e.g. patrimonial informations.
comment: Questa classe rappresenta un inventario patrimoniale, che registra le informazioni amministrative relative alla situazione patrimoniale del bene.
label: Current Inventory @en
subclass of: Inventario
subclass of: Restriction
  on property: ha categoria SEC
  some values from: Categoria SEC
subclass of: Restriction
  on property: modalità di acquisizione
  some values from: Literal
subclass of: Restriction
  on property: cultural property inventory description
  some values from: Literal
subclass of: Restriction
  on property: ha codice SEC
  some values from: Codice SEC
subclass of: Restriction
  on property: provenienza
  some values from: Literal
subclass of: Restriction
  on property: ha responsabile dell'immissione in patrimonio
  some values from: Agent
subclass of: Restriction
  on property: causale RCS
  some values from: Literal
version info: stabile
version info: stable @en
iccd norm tag: ICCD Normativa Trasversale: UB/INP

historicalBiographicalInformation
type: DatatypeProperty
comment: This property represents historical biographical information about an agent. @en
comment: Questa proprietà rappresenta informazioni di natura storico biografica relative a un agente.
domain: Agent
range: Literal

Occasione
type: Class
comment: This class represents a circumstance that influenced a particular situation, e.g. the circumstance for which a cultural property was commissioned, tha circumstance in which a cultural property was used, etc. @en
comment: Questa classe rappresenta un'occasione che ha determinato una certa situazione, per esempio l'occasione per cui è stato commissionato un bene culturale, l'occasione che ha determinato la ripresa di un bene fotografico, l'occasione d'uso di un bene, l'occasione di un bene demoetnoantropologico immateriale.
label: Occasion @en
label: Circumstance @en
subclass of: Situation
subclass of: Restriction
  all values from: Tipo di circostanza
  on property: ha tipo di circostanza
subclass of: Restriction
  on property: è circostanza di
  some values from: Thing
version info: stable @en
version info: stabile
iccd norm tag: ICCD Normativa Trasversale: UT/UTU/UTUO - Normativa BDM: UT/UTO; AU/CMM/CMMC - Normativa VeAC: AU/FRU/FRUC - Normativa F: LR/LRO - Normativa BDI: CA

Scarsa affidabilità
type: Affidabilità
type: NamedIndividual
label: Insufficient reliability @en

Appartenenza a Collezione
type: Class
comment: This class represents the membership of a cultural property in a collection. @en
comment: Questa classe rappresenta l'appartenenza di un bene culturale a una collezione, in un certo intervallo di tempo. Uno stesso bene culturale può aver fatto parte di più collezioni nel corso del tempo.
label: Collection Membership @en
subclass of: Appartenenza
subclass of: Restriction
  all values from: TimeInterval
  on property: atTime
subclass of: Restriction
  on property: ha membro di collezione
  some values from: CulturalEntity
subclass of: Restriction
  all values from: Literal
  on property: motivo di uscita dalla collezione
subclass of: Restriction
  all values from: Literal
  on property: codice inventario bene in collezione
subclass of: Restriction
  all values from: CollectionCulEnt
  on property: ha collezione
subclass of: Restriction
  all values from: Literal
  on property: valore del bene culturale
version info: stable @en
version info: stabile
iccd norm tag: UB/COL

diagnosi
type: DatatypeProperty
comment: This property represents the diagnosis of an anthropological finding paleopathology. @en
comment: Questa proprietà rappresenta la diagnosi di una paleopatologia di un reperto antropologico.
domain: Indagine su paleopatologia
label: diagnosis @en
range: Literal
version info: stabile
version info: stable @en
iccd norm tag: ICCD Normativa AT: PT/PTC/PTCD

Tipo di immagine di indagine
type: Class
comment: Questa classe rappresenta un tipo di immagine analizzata in una indagine di fotointerpretazione e restituzione (fotografia aerea o fotografia satellitare).
comment: This class represents the type of image analysed during a photo interpretation or rendering survey (aerial photograph, satellite photograph). @en
label: Survey image type @en
subclass of: Type
version info: stabile
version info: stable @en
iccd norm tag: ICCD Normativa Trasversale 4.00: RE/FOI/FOIT

codice univoco ICCD dello scavo archeologico
type: DatatypeProperty
type: FunctionalProperty
comment: Questa proprietà rappresenta il codice, assegnato dall'ICCD, che individua lo scavo archeologico in modo univoco a livello nazionale.
comment: This property represents the code, assigned by the ICCD, which identifies the archaeological excavation unequivocally at national level. @en
domain: Scavo archeologico
label: archaeological excavation ICCD identifier @en
range: Literal
sub property of: ICCDIdentifier
version info: stable @en
version info: stabile
iccd norm tag: ICCD Normativa Trasversale 4.00: RE/DSC/DSCK

Serie numismatica
type: Class
comment: This class represents the series which a particular coin is part of. @en
comment: Questa classe rappresenta la serie della quale una moneta fa parte (es.: Greca, Romana Repubblicana, Barbarica).
label: Numismatic series @en
subclass of: Collection
subclass of: Restriction
  all values from: CulturalEntity
  on property: ha moneta membro
version info: stabile
version info: stable @en
iccd norm tag: ICCD Normativa NU: OG/OGT/OGTR

Rapporto con opera collegata
type: Class
comment: This class represents a situation in which a cultural property is related to another work, that could even be another cultural property. The cultural property stage is defined referring to this relationship with a related work, that can represent a preparatory, a final phase or a derivation of the cultural property. When the relationship is between two cultural properties, when possible, the nature of the relationship is specified (e.g.: finding location) @en
comment: Questa classe rappresenta la relazione, il rapporto, tra il bene culturale in esame e un'altra opera, che può anche essere un bene culturale. In riferimento a questo rapporto, si definisce lo stadio di realizzazione del bene culturale in rapporto con l'oggetto che ne costituisce una fase preparatoria o che ne rappresenta la fase finale o che ne rappresenta una derivazione. Nel caso di una relazione tra un bene culturale e un altro bene culturale, in riferimento a questo rapporto si definisce, se possibile, il tipo di relazione tra i due beni (es.: luogo di realizzazione, luogo di ritrovamento, etc.).
label: Related work situation @en
subclass of: Situation
subclass of: Restriction
  on property: è rapporto con opera collegata di
  some values from: CulturalEntity
subclass of: Restriction
  on property: coinvolge opera collegata
  some values from: CulturalEntity
subclass of: Restriction
  all values from: Stadio del bene culturale
  on property: ha fase di realizzazione
description: An example of usage of the class 'Related work situation' is the following: resource:RelatedWorkSituation/0300199368-preparatory-final-work-1 a cd:RelatedWorkSituation ; rdfs:label "Relation 1 between the cultural property 0300199368 and preparatory or final work"@en ; cd:hasCulturalPropertyStage resource:CulturalPropertyStage/bozzetto ; cd:hasRelatedWork resource:FinalWork/0300199368-dipinto . @en
description: Un esempio d'uso della classe 'Rapporto con opera collegata' è il seguente: resource:RelatedWorkSituation/0300199368-preparatory-final-work-1 a cd:RelatedWorkSituation ; rdfs:label "Relation 1 between the cultural property 0300199368 and preparatory or final work"@en , "Rapporto 1 tra il bene culturale 0300199368 e opera originale o finale"@it ; cd:hasCulturalPropertyStage resource:CulturalPropertyStage/bozzetto ; cd:hasRelatedWork resource:FinalWork/0300199368-dipinto .
version info: stable @en
version info: stabile

nome del file digitale
type: DatatypeProperty
comment: Questa proprietà rappresenta il nome del file digitale che riproduce il documento, nel caso della documentazione allegata alla scheda di catalogo.
comment: This property represents the name of the digital file that reproduces the document. @en
domain: Documentazione
label: digital filename @en
range: Literal
sub property of: name
version info: stabile
version info: stable @en
iccd norm tag: FTAK, DRAK, VDCK, REGK, FNTK

Fruizione
type: Class
comment: Questa classe rappresenta un'occasione in cui il capo oggetto di catalogazione è stato indossato da una o più persone, sia perché ad esse destinato sia perché, ad esse pervenuto, hanno potuto riadattarlo a loro nuove esigenze.
comment: This class represents a circumstance in which a garment, catalogued as a cultural property, was worn by one or more people. @en
label: Fruition @en
subclass of: Interpretazione
subclass of: Restriction
  on property: ha utente
  some values from: Agent
subclass of: Restriction
  on property: è fruizione di
  some values from: CulturalEntity
subclass of: Restriction
  all values from: Occasione
  on property: ha circostanza
version info: stable @en
version info: stabile
iccd norm tag: Normativa VeAC: AU/FRU

data di comunicazione di avvio
type: FunctionalProperty
type: DatatypeProperty
comment: This property represents date of interest declaration communication to the owner or holder. @en
comment: Questa proprietà rappresenta la data (nella forma “aaaa/mm/gg”) della comunicazione di avvio del procedimento di dichiarazione di interesse al proprietario, possessore o detentore.
domain: Provvedimento di tutela
label: opening notice date @en
range: dateTime
sub property of: date
version info: stable @en
version info: stabile
iccd norm tag: ICCD Normativa Trasversale 4.00: TU/NVC/NVCI

è tipo di opera derivata di
type: ObjectProperty
comment: This property relates the type of a work derivated from a cultural entity to its work derivated. @en
comment: Questa proprietà collega il tipo di opera derivata da un bene culturale alla relativa opera derivata.
domain: Tipo di opera derivata
label: is derivated work type of @en
range: Opera derivata
sub property of: isTypeOf
version info: stable @en
version info: stabile

ha tipo di opera derivata
type: ObjectProperty
comment: Questa proprietà collega un'opera derivata da un bene culturale al tipo di opera derivata.
comment: This property relates a work derivated from a cultural entity to its type. @en
domain: Opera derivata
label: has derivated work type @en
range: Tipo di opera derivata
sub property of: hasType
inverse of: è tipo di opera derivata di
version info: stable @en
version info: stabile
iccd norm tag: ICCD Normativa F: RO/CRF/CRFT - Normativa S: RO/ADL/ADLL - Normative RA, SMO, PST, S, OA, MI, D, NU: RO/REI/REIT - Normative CA, MA: RO/RIU/RIUT

è tipo di mutamento condizione materiale di
type: ObjectProperty
comment: This property relates the event type (i.e. theft, destruction, recovery) of a cultural entity change of availability to the change itself. @en
comment: Questa proprietà collega il tipo di evento (es.: furto, distruzione, recupero) di mutamento di condizione materiale di un bene culturale al mutamento stesso.
domain: Tipo di mutamento condizione materiale
label: is change of availability type of @en
range: Mutamento condizione materiale
sub property of: isTypeOf
version info: stable @en
version info: stabile

Opera finale
type: Class
comment: Questa classe rappresenta un'entità collegata a un bene culturale, che ne costituisce la fase finale.
comment: This class represents an entity related to a cultural property, as its final stage. @en
label: Final work @en
subclass of: Opera preparatoria o finale
disjoint with: Opera preparatoria
version info: stable @en
version info: stabile
iccd norm tag: ICCD Normative F, RA, SMO, PST, S, OAC, OA, MI, D, NU: se RO/ROF/ROFF rappresenta uno stadio del bene catalogato riconducibile a una fase preparatoria, per cui è possibile dedurre che l'opera collegata al bene è una sua fase finale.

ha operatore dell'attività
type: ObjectProperty
comment: This property relates an activity to the agent who performed the activity. In the ontology this relationship is modelled also by the class AgentRole which allows more expressiveness. @en
comment: Questa proprietà collega un'attività (per esempio, un'indagine o un intervento su un bene culturale) all'operatore dell'attività. La relazione tra il ruolo e l'agente che lo riveste è espressa nel nome della proprietà, che quindi ne fornisce una rappresentazione semplificata, con ridotta espressività. Nell'ontologia questa relazione è modellata anche, in maniera più espressiva, dalla classe AgentRole, che permette di collegare l'agente e il suo ruolo.
domain: Activity
label: has activity operator @en
range: Agent
sub property of: ha agente correlato
inverse of: è operatore dell'attività
version info: stable @en
version info: stabile
iccd norm tag: ICCD Normativa Trasversale: RE/IND/INDN; CO/RST/RSTN - ICCD Normativa SM e BDM 4.00: DR/DRL - ICCD normative di versioni precedenti: RE/AIN/AINR

Stampa in pubblicazione
type: Class
comment: This class represents a publication of which a print is, or was, part. @en
comment: Questa classe rappresenta la pubblicazione di cui una stampa è, o è stata, parte integrante.
label: Print in publication @en
subclass of: Opera derivata
version info: stabile
version info: stable @en
iccd norm tag: ICCD Normativa S 3: RO/ADL

Ispezione
type: Class
comment: This class represents a particular type of survey on a cultural property, that is an inspection carried out to verify the condition of a cultural property. @en
comment: Questa classe rappresenta un tipo particolare di indagine su bene culturale, ovvero un'ispezione effettuata per constatare lo stato del bene.
label: Inspection @en
subclass of: Indagine
subclass of: Restriction
  all values from: Agent
  on property: ha responsabile dell'attività
version info: stable @en
version info: stabile
iccd norm tag: ICCD Normativa Trasversale 4.00: CM/ISP

numero di pagina o tavola
type: DatatypeProperty
comment: Questa proprietà rappresenta le informazioni relative al numero della pagina o numero della tavola della pubblicazione in cui compare la stampa.
comment: This property represents information about page number or table number of publication in which the print appears. @en
domain: Posizione della riproduzione
label: page or table number @en
range: Literal
version info: stabile
version info: stable @en
iccd norm tag: ICCD Normativa S 3: RO/ADL/ADLN

è tipo di indagine archeometrica e diagnostica di
type: ObjectProperty
comment: This property relates the type of an arecheometric diagnostic survey (i.e. thermal imaging, coring) to the survey itself . @en
comment: Questa proprietà collega il tipo d'indagine archeometrica e diagnostica (es.: analisi della malta, carotaggio, termografia, etc.) alla relativa indagine.
domain: Tipo di indagine archeometrica e diagnostica
label: is archaeometric diagnostic survey type of @en
range: Indagine archeometrica e diagnostica
sub property of: isTypeOf
version info: stabile
version info: stable @en

ha tipo di indagine di rilevamento
type: ObjectProperty
comment: Questa proprietà collega un'indagine di rilevamento al tipo di indagine di rilevamento (nel contesto/decontestualizzato).
comment: This property relates an observation survey to the type of observation survey (in the context, out of context). @en
domain: Indagine di rilevamento
label: has observation survey type @en
range: Tipo di indagine di rilevamento
sub property of: hasType
inverse of: è tipo di indagine di rilevamento di
version info: stable @en
version info: stabile
iccd norm tag: ICCD Normativa BDI 4.00: LA/PRM

ha membro di unità archivistica complessa
type: ObjectProperty
comment: Questa proprietà, inversa a "è membro di unità archivistica complessa", collega l'appartenenza di un bene culturale a un'unità archivistica al bene coinvolto nella relazione.
comment: This property relates the membership of a cultural entity to an archival record set. It is the inverse property of "isMemberofArchivalRecordSet". @en
domain: Appartenenza a unità archivistica complessa
label: has member of archival record set @en
range: CulturalEntity
inverse of: è membro di un'unità archivistica complessa di
version info: stable @en
version info: stabile
iccd norm tag: ICCD Normativa F: UB/UBF

Tassonomia biologica
type: Class
comment: This class represents a biological taxon. @en
comment: Questa classe rappresenta una tassonomia biologica, ossia i criteri con cui si ordinano gli organismi in un sistema di classificazione.
label: Biological taxon @en
subclass of: Classification
subclass of: Restriction
  max qualified cardinality: 1
  on class: Specie
  on property: ha specie
subclass of: Restriction
  on property: è tassonomia biologica di
  some values from: Thing
subclass of: Restriction
  max qualified cardinality: 1
  on class: Sottospecie
  on property: ha sottospecie
subclass of: Restriction
  max qualified cardinality: 1
  on class: Genere
  on property: ha genere
version info: stable @en
version info: stabile
iccd norm tag: ICCD Normativa AT: OG/OGS

codice univoco ICCD dell'autore
type: DatatypeProperty
type: FunctionalProperty
comment: Questa proprietà permette di associare il codice univoco ICCD a un autore.
comment: This property allows you to associate the unique ICCD code with an author. @en
domain: Agent
label: author ICCD identifier @en
range: Literal
sub property of: ICCDIdentifier
version info: stable @en
version info: stabile
iccd norm tag: ICCD Normativa Trasversale 4.00: AU/AUT/AUTK

ha condizione giuridica
type: ObjectProperty
comment: Questa proprietà collega un'entità, per esempio un bene culturale, alla sua condizione giuridica.
comment: This property relates an entity, for example a cultural entity, to its legal situation. @en
domain: Thing
label: has legal situation @en
range: Situazione giuridica
sub property of: hasSituation
inverse of: è condizione giuridica di
version info: stabile
version info: stable @en
iccd norm tag: ICCD Normativa Trasversale 4.00: TU/CDG

è riproduzione di
type: ObjectProperty
comment: This is the inverse property of "has reproduction". @en
comment: Questa è la proprietà inversa di "ha riproduzione".
domain: Riproduzione
label: is reproduction of @en
range: Stampa in pubblicazione
version info: stable @en
version info: stabile

Occasione indeterminata
type: Class
comment: This class represents an indeterminate circumstance, when the cultural property is not related to a determinate circumstance, but takes place in an extemporaneous and contingent way (e.g.: a musical performance, a narration, a game). @en
comment: Questa classe rappresenta un'occasione indeterminata, cioè quando il bene non è in rapporto con una precisa occasione o scadenza, ma si realizza in modo del tutto estemporaneo e contingente. Occasioni indeterminate possono essere, per esempio, un'esecuzione musicale, una narrazione, un gioco, etc.
label: Indeterminate circumstance @en
subclass of: Occasione
disjoint with: Occasione legata al ciclo produttivo
disjoint with: Occasione legata al ciclo della vita
disjoint with: Occasione legata alla socialità quotidiana
disjoint with: Occasione legata al lavoro
disjoint with: Occasione legata al ciclo dell'anno
disjoint with: Occasione legata al ciclo stagionale
version info: stable @en
version info: stabile
iccd norm tag: ICCD Normativa BDI 4.00: CA/CAO/CAOI

indicazioni cronologiche relative a un agente
type: DatatypeProperty
comment: Questa proprietà permette di associare delle indicazioni cronologiche generiche (le date di nascita e di morte o, quando queste sono ignote, le date di attività), anche sotto forma testuale, a un agente.
comment: This property allows you to associate generic chronological indications to an agent. @en
domain: Agent
label: agent date @en
range: Literal
version info: stabile
version info: stable @en

è soggetto fonte dell'acquisizione di
type: ObjectProperty
comment: This property relates the previous owner of a cultural property to the acquisition by a new owner. @en
comment: Questa proprietà, inversa a "ha soggetto fonte di acquisizione", collega il soggetto fonte dell'acquisizione di un bene all'acquisizione stessa.
domain: Agent
label: is previous owner of @en
range: Acquisizione
sub property of: è agente correlato a
version info: stable @en
version info: stabile
iccd norm tag: ICCD Normativa Trasversale 4.00: TU/ACQ/ACQN

Certificazione di importazione o esportazione
type: Class
comment: This class represents the export/import certification of a cultural property. @en
comment: Questa classe rappresenta una certificazione amministrativa per la circolazione e l'esportazione/importazione di un bene culturale.
label: Export import certification @en
subclass of: Object
subclass of: Restriction
  on property: è certificato di importazione/esportazione di
  some values from: CulturalEntity
subclass of: Restriction
  on property: has export import certification type
  some values from: Tipo di certificazione di esportazione o importazione
subclass of: Restriction
  all values from: Agent
  on property: ha ufficio esportazione
version info: stabile
version info: stable @en
iccd norm tag: ICCD Normativa Trasversale 4.00: TU/ESP

Intervento ammesso
type: Class
comment: This class represents the intervention considered eligible by a specific urban planning instrument related to a cultural property. @en
comment: Questa classe rappresenta il tipo di intervento ammesso da una normativa specifica, ovvero da un piano regolatore generale e particolareggiato o da un piano paesaggistico che interessa un bene culturale.
label: Eligible intervention @en
subclass of: Intervento
subclass of: Restriction
  all values from: Strumento urbanistico-territoriale
  on property: è intervento ammesso da
version info: stabile
version info: stable @en
iccd norm tag: ICCD Normativa Trasversale 4.00: TU/STU/STUN

è autore attribuito in
type: ObjectProperty
comment: Questa è la proprietà inversa a "ha autore attribuito".
comment: This is the inverse property of "has attributed author". @en
domain: Agent
label: is attributed author in @en
range: Class
  union of: Attribuzione Alternativa di Autore
  union of: Attribuzione Primaria di Autore
sub property of: è agente correlato a
version info: stabile
version info: stable @en

è certificato di importazione/esportazione di
type: ObjectProperty
comment: This property relates an export import certification to a cultural entity. @en
comment: Questa proprietà collega un certificato di importazione/esportazione a un'entità culturale.
domain: Certificazione di importazione o esportazione
label: is export import certification of @en
range: CulturalEntity
version info: stabile
version info: stable @en

ha contesto di rinvenimento
type: ObjectProperty
comment: Questa proprietà collega un bene culturale, in particolare un reperto antropologico, al suo contesto di rinvenimento.
comment: This property relates a cultural property, and in particular an anthropological material, to its finding context. @en
domain: CulturalEntity
label: has finding context @en
range: Contesto di rinvenimento
sub property of: hasSituation
inverse of: è contesto di rinvenimento di
version info: stabile
version info: stable @en
iccd norm tag: ICCD Normativa AT 3.01: OG/OGC

è datazione alternativa di
type: ObjectProperty
comment: This property relates the type of an alternative dating to the related dating. @en
comment: Questa proprietà collega la tipologia di datazione alternativa con la relativa datazione.
domain: Tipo di datazione alternativa
label: is alternative dating type @en
range: Datazione alternativa
sub property of: isTypeOf
version info: stabile
version info: stable @en

è unità stratigrafica di
type: ObjectProperty
comment: This property relates the stratigraphic unit from which a cultural property has been found to the related archeological excavation. @en
comment: Questa proprietà collega l'unità stratigrafica dalla quale proviene il bene rinvenuto nello scavo al relativo scavo archeologico.
domain: Unità stratigrafica
label: is stratigraphic unit of @en
range: Scavo archeologico
sub property of: isLocationOf
version info: stabile
version info: stable @en

Epigrafico
type: Specifiche del tipo d'uso
type: NamedIndividual
comment: This individual represents cultural entity's epigraphic use. @en
comment: Questo individuo rappresenta le specifiche d'uso epigrafico di un bene.
label: Epigraphic @en
version info: stable @en
version info: stabile

ha tipo di indagine su bene archeologico
type: ObjectProperty
comment: Questa proprietà collega un'indagine su un bene archeologico al tipo di indagine.
comment: This property relates a survey on an archaeological property to the type of survey. @en
domain: Indagine su bene archeologico
label: has archaeological property survey type @en
range: Tipo di indagine su bene archeologico
sub property of: hasType
inverse of: è tipo di indagine su bene archeologico
version info: stabile
version info: stable @en
iccd norm tag: ICCD Normativa AT 3.00: IN/INI/INIT

Genere della documentazione
type: Class
comment: This class represents the category associated to a documentation (e.g. attached documentation, existing documentation). @en
comment: Questa classe rappresenta la categoria della documentazione. Nel contesto delle normative per la catalogazione ICCD, questa classe ha un vocabolario chiuso definito in due tipi: documentazione allegata e documentazione esistente.
label: Documentation category @en
subclass of: Category
version info: stable @en
version info: stabile
iccd norm tag: FTAX, DRAX, VDCX, REGX, FNTX, ADMX (solo v. 3.00 e 3.01)

ha tipo di bibliografia
type: ObjectProperty
comment: Questa proprietà collega la bibliografia al tipo di riferimento bibliografico.
comment: This property relates a bibliography to its bibliography type. @en
domain: Bibliografia
label: has bibliography type @en
range: Tipo di bibliografia
sub property of: hasType
inverse of: è tipo di bibliografia di
version info: stable @en
version info: stabile
iccd norm tag: BIB/BIBF

ha categoria sociale dell'utente
type: ObjectProperty
comment: This property relates the user of a cultural property to its social category. @en
comment: Questa proprietà collega l'utente di un bene culturale con la sua categoria sociale.
domain: Agent
label: has user social category @en
range: Categoria sociale dell'utente
sub property of: hasCategory
version info: stabile
version info: stable @en
iccd norm tag: ICCD Normative BDM 2.00: UT/UTN/UTNC

ha zecchiere
type: ObjectProperty
comment: This property relates the coin issuance to the minter. In the ontology this relationship is modelled also by the class AgentRole which allows more expressiveness. @en
comment: Questa proprietà collega l'emissione della moneta allo zecchiere, monetiere, maestro di zecca. Questa proprietà, esprimendo il significato della relazione nel nome, dà una rappresentazione semplificata della relazione che lega questa entità e l'agente; la stessa relazione è rappresentata attraverso una n-ary relation, arco-core:AgentRole, che permette di collegare l'agente al ruolo che riveste nei confronti dell'entità.
domain: Emissione di moneta
label: has minter @en
range: Agent
sub property of: ha agente correlato
inverse of: è zecchiere in
version info: stable @en
version info: stabile
iccd norm tag: ICCD Normativa NU: DA/AUE/AUEZ

è committente in
type: ObjectProperty
comment: This property relates an agent that is committent of a cultural property to the identification of the commission of that cultural property. @en
comment: Questa proprietà collega una persona o istituzione committente a una situazione in cui viene indicata la committenza di un bene culturale.
domain: Agent
label: is committent in @en
range: Committenza
sub property of: è agente correlato a
version info: stable @en
version info: stabile
iccd norm tag: ICCD Normativa Trasversale 4.00: AU/CMM/CMMN

codice identificativo locale dell'agente
type: DatatypeProperty
type: FunctionalProperty
comment: This property represents the identification code, which identifies the author's reference unambiguously in the context of a local repertoire, of an agent. @en
comment: Questa proprietà rappresenta il codice identificativo, che individua il riferimento autoriale in modo univoco nell'ambito di un repertorio locale, di un agente, per esempio di un autore di un bene culturale o di un agente che riveste una responsabilità nei confronti del bene (es.: editore, stampatore, etc.).
domain: Agent
label: agent local identifier @en
range: Literal
sub property of: localIdentifier
version info: stabile
version info: stable @en
iccd norm tag: ICCD Normativa Trasversale 4.00: AU/AUT/AUTH - ICCD Normativa F 4.00: RO/CRF/CRFX; PD/PDF/PDFH - ICCD Normativa F 3.00: RO/CRF/CRFH

ha tipo di acquisizione
type: FunctionalProperty
type: ObjectProperty
comment: This property relates a cultural entity's acquisition to its acquisition type (i.e. donation, seizure). @en
comment: Questa proprietà collega un'acquisizione di un bene culturale al tipo di acquisizione (es.: donazione, alienazione, confisca).
domain: Acquisizione
label: has acquisition type @en
range: Tipo di acquisizione
sub property of: hasType
inverse of: è tipo di acqusizione di
version info: stabile
version info: stable @en
iccd norm tag: ICCD Normativa Trasversale 4.00: TU/ACQ/ACQT

ha responsabile dell'attività
type: ObjectProperty
comment: Questa proprietà collega un'attività (per esempio, un'indagine o un intervento su un bene culturale) all'ente o al soggetto responsabile del rilevamento. La relazione tra il ruolo e l'agente che lo riveste è espressa nel nome della proprietà, che quindi ne fornisce una rappresentazione semplificata, con ridotta espressività. Nell'ontologia questa relazione è modellata anche, in maniera più espressiva, dalla classe AgentRole, che permette di collegare l'agente e il suo ruolo.
comment: This property relates an activity to the institution or the survey's responsible entity. In the ontology this relationship is modelled also by the class AgentRole which allows more expressiveness. @en
domain: Activity
label: has activity responsible @en
range: Agent
sub property of: ha agente correlato
inverse of: è responsabile dell'attività
version info: stable @en
version info: stabile
iccd norm tag: ICCD Normativa Trasversale 4.00: RE/RCG/RCGR; RE/DSC/DSCF; RE/IND/INDE; RE/FOI/FOIE - Normativa SM e BDM 4.00: DR/DRV

è tipo di indagine su bene archeologico
type: ObjectProperty
comment: This property relates the type of a survey to the related survey on an archaeological property. @en
comment: Questa proprietà collega il tipo di indagine alla relativa indagine su un bene archeologico.
domain: Tipo di indagine su bene archeologico
label: is archaeological property survey type of @en
range: Indagine su bene archeologico
sub property of: isTypeOf
version info: stabile
version info: stable @en

è tipo di circostanza di
type: ObjectProperty
comment: This property relates the type of circumstance to the related circumstance. @en
comment: Questa proprietà collega il tipo di occasione con la relativa occasione.
domain: Tipo di circostanza
label: is circumstance type of @en
range: Occasione
sub property of: isTypeOf
version info: stable @en
version info: stabile

Fondo archivistico
type: Class
comment: Questa classe rappresenta un fondo archivistico.
comment: This class represents an archival fonds. @en
label: Archival fonds @en
subclass of: Unità archivistica complessa
subclass of: Restriction
  all values from: Serie archivistica
  on property: hasComponent
is native to: BornDigitalArchives ODP.owl
version info: stabile
version info: stable @en
iccd norm tag: ICCD Normativa F: UB/UBF/UBFP

ha responsabile dell'immissione in patrimonio
type: ObjectProperty
comment: Questa proprietà, rappresentazione semplificata della relazione n-ary Agent Role, che rappresenta una situazione in cui un agente riveste un ruolo, collega un inventario patrimoniale al responsabile dell'inventariazione patrimoniale del bene.
comment: This property relates a current inventory to the agent responsible for the cultural entity's inventory. In the ontology this relationship is modelled also by the class AgentRole which allows more expressiveness. @en
domain: Inventario Patrimoniale
label: has responsible for insertion @en
range: Agent
sub property of: ha agente correlato
inverse of: è responsabile dell'immissione in patrimonio di
version info: stable @en
version info: stabile
iccd norm tag: ICCD Normativa Trasversale 4.00: UB/INP/INPE

sesso stimato
type: FunctionalProperty
type: DatatypeProperty
comment: Questa proprietà rappresenta il sesso stimato nel contesto della stima del sesso di un reperto antropologico.
comment: This property represents anthropological finding estimated sex. @en
domain: Interpretazione del sesso
label: estimated sex @en
range: Literal
version info: stable @en
version info: stabile

Scavo archeologico
type: Class
comment: This class represents a particular type of survey on a cultural property, that is an archaeological (stratigraphic) excavation. @en
comment: Questa classe rappresenta un tipo particolare di indagine su bene culturale, ovvero uno scavo archeologico, inteso come scavo stratigrafico.
label: Archaeological excavation @en
subclass of: Indagine
subclass of: Restriction
  all values from: Metodo di indagine
  on property: ha metodo di indagine
subclass of: Restriction
  all values from: Motivo di indagine
  on property: ha motivo di indagine
subclass of: Restriction
  all values from: Unità stratigrafica
  on property: ha unità stratigrafica
subclass of: Restriction
  all values from: Agent
  on property: ha responsabile scientifico dell'indagine
subclass of: Restriction
  all values from: Deposizione funeraria
  on property: ha deposizione funeraria
subclass of: Restriction
  all values from: Agent
  on property: ha responsabile dell'attività
subclass of: Restriction
  all values from: Literal
  on property: codice univoco ICCD dello scavo archeologico
subclass of: Restriction
  all values from: Literal
  on property: codice identificativo locale dello scavo archeologico
subclass of: Restriction
  all values from: Literal
  on property: settore ambiente quadrato
version info: stable @en
version info: stabile
iccd norm tag: ICCD Normativa Trasversale 4.00: RE/DSC

Unità archivistica complessa
type: Class
comment: Questa classe rappresenta un'unità archivistica complessa (fondo, serie, sottoserie, etc.) di cui un bene culturale può fare parte.
comment: This class represents an archival record set (fonds, series, subseries) of which a cultural property can be member. @en
label: Archival record set @en
subclass of: Collection
subclass of: Restriction
  all values from: Titolo
  on property: ha titolo
subclass of: Restriction
  all values from: Literal
  on property: identificativo di unità archivistica complessa
subclass of: Restriction
  all values from: Class
    union of: Unità documentaria
    union of: Unità archivistica complessa
  on property: hasPart
is native to: BornDigitalArchives ODP.owl
description: Un esempio d'uso di una delle sottoclassi di 'Unità archivistica complessa' è il seguente: resource:ArchivalSubseries/museo-civico-romano a cd:ArchivalSubseries ; rdfs:label "Museo Civico Romano" ; cd:isArchivalRecordSetIn resource:ArchivalRecordSetMembership/1201251092 ; core:isComponentOf resource:ArchivalSeries/brescia .
description: An example of usage of on of the subclasses of the class 'Archival Record Set' is the following: resource:ArchivalSubseries/museo-civico-romano a cd:ArchivalSubseries ; rdfs:label "Museo Civico Romano" ; cd:isArchivalRecordSetIn resource:ArchivalRecordSetMembership/1201251092 ; core:isComponentOf resource:ArchivalSeries/brescia . @en
version info: stabile
version info: stable @en
iccd norm tag: ICCD Normativa F: UB/UBF

identificativo di unità archivistica complessa
type: FunctionalProperty
type: DatatypeProperty
comment: This property represents the identifier of an archival record set. @en
comment: Questa proprietà rappresenta l'identificativo di un'unità archivistica complessa.
domain: Unità archivistica complessa
label: archival record set identifier @en
range: Literal
sub property of: identifier
version info: stable @en
version info: stabile
iccd norm tag: ICCD Normativa FF: PA/PAC/PACI; PA/PAC/PACA

ha indagine
type: ObjectProperty
comment: This property relates a cultural entity's acquisition to its acquisition type. @en
comment: Questa proprietà collega un bene culturale a un'indagine effettuata sul bene stesso, per la sua individuazione, per il suo studio e per l'approfondimento delle sue caratteristiche tecniche.
domain: CulturalEntity
label: has survey @en
range: Indagine
inverse of: è indagine su
version info: stable @en
version info: stabile
iccd norm tag: ICCD Normativa Trasversale 4.00: RE; CM/ISP - ICCD Normative NU, RA, BNB, MA, CA: RS/ALB - ICCD Normativa AT 3.00: IN/INI - Normativa BDM e SM 4.00: DR

è metodo di indagine di
type: ObjectProperty
comment: Questa proprietà collega il metodo adottato nel corso di un'indagine all'indagine stessa.
comment: This property relates the method adopted in a survey to the survey itself. @en
domain: Metodo di indagine
label: is survery method of @en
range: Indagine
sub property of: isMethodOf
version info: stabile
version info: stable @en

ha tipo di immagine di indagine
type: ObjectProperty
comment: This property relates a survey image to its type (i.e. aerial photograph, Satellite photograph). @en
comment: Questa proprietà collega una immagine di indagine al suo tipo (fotografia aerea o fotografia satellitare).
domain: Immagine di indagine
label: has survey image type @en
range: Tipo di immagine di indagine
sub property of: hasType
inverse of: è tipo di immagine di indagine di
version info: stable @en
version info: stabile
iccd norm tag: ICCD Normativa Trasversale 4.00: RE/FOI/FOIT

è attribuzione di autore/responsabilità di
type: ObjectProperty
comment: Property that links an authorship attribution referred to a cultural entity to that cultural entity. @en
comment: Proprietà che lega un'attribuzione di autore o di responsabilità relativa a un'entità culturale all'entità culturale stessa.
domain: Attribuzione di Autore o responsabilità
label: is authorship attribution of @en
range: CulturalEntity
sub property of: isSituationOf
version info: stabile
version info: stable @en
iccd norm tag: ICCD Normativa Trasversale 4.00: AU/AUT; AU/ATB; AU/AAT

riferimento bibliografico completo
type: DatatypeProperty
type: FunctionalProperty
comment: This property represents the complete bibliographic reference. @en
comment: Questa proprietà rappresenta il riferimento bibliografico completo.
domain: Bibliografia
label: complete bibliographic reference @en
range: Literal
version info: stable @en
version info: stabile
iccd norm tag: ICCD Normativa Trasversale 4.00: DO/BIB/BIBM; RE/RCG/RCGS - versioni precedenti: DO/BIL

ha strumento urbanistico-territoriale
type: ObjectProperty
comment: This class relates a cultural property to the related urban planning instrument. @en
comment: Questa proprietà collega un bene culturale a uno strumento urbanistico-territoriale, ovvero a un piano regolatore generale e particolareggiato o a un piano paesaggistico che interessa il bene stesso.
domain: CulturalEntity
label: has urban planning instrument @en
range: Strumento urbanistico-territoriale
inverse of: è strumento urbanistico-territoriale di
version info: stable @en
version info: stabile
iccd norm tag: ICCD Normativa Trasversale 4.00: TU/STU

note di reperimento
type: DatatypeProperty
comment: Questa proprietà rappresenta le note relative alle modalità di individuazione e di reperimento del bene in esame, in forma di testo libero. Possono essere integrative rispetto a quanto rappresentato come Scavo Archeologico o Ricognizione Archeologica, oppure possono essere le uniche informazioni registrate sull'individuazione e il reperimento del bene, in quelle situazioni in cui i dati a disposizione non consentono di compilare le schede di Authority file RCG-Ricognizione archeologica e/o DSC-Scavo archeologico. Vengono quindi collegate direttamente al bene.
comment: This property represents notes relating to methods for identifying and finding the cultural property in question. @en
domain: CulturalEntity
label: finding note @en
range: Literal
sub property of: note
version info: stable @en
version info: stabile
iccd norm tag: ICCD Normativa Trasversale 4.00: RE/RES - ICCD Normativa RA 2.00: RP/SPR; RP/ROC/ROCC; RP/ROC/ROCI

valore stimato
type: FunctionalProperty
type: DatatypeProperty
comment: This property represents the value estimated in the context of an estimate process. @en
comment: Questa proprietà rappresenta il valore stimato durante il processo di stima di un'entità.
domain: Stima
label: estimated value @en
range: Literal
version info: stabile
version info: stable @en

ha collezionista
type: ObjectProperty
comment: Questa proprietà collega una collezione di beni culturali al collezionista.
comment: This property relates a collection of cultural properties to its collector. @en
domain: CollectionCulEnt
label: has collector @en
range: Agent
sub property of: ha agente correlato
inverse of: è collezionista di
version info: stabile
version info: stable @en
iccd norm tag: UB/COL/COLN

ha ufficio esportazione
type: ObjectProperty
comment: This property relates an export/import certification to the certifying Export Department. @en
comment: Questa proprietà collega una certificazione di importazione/esportazione al'Ufficio Esportazione che ha emesso la certificazione.
domain: Certificazione di importazione o esportazione
label: has export office @en
range: Agent
sub property of: ha agente correlato
inverse of: è ufficio esportazione di
version info: stabile
version info: stable @en
iccd norm tag: ICCD Normativa Trasversale 4.00: TU/ESP/ESPU

ha evento relativo a datazione
type: ObjectProperty
comment: Questa proprietà collega una cronologia a un evento relativo al bene culturale, cui si riferisce la specifica cronologia.
comment: This property relates a dating to an event involving the cultural property, which the dating is about. @en
domain: Cronologia
label: has event related to dating @en
range: EventOrSituation
inverse of: è evento relativo alla datazione di
version info: stabile
version info: stable @en
iccd norm tag: DTN/DTNS; se non c'è, Event = "realizzazione"

è professione di
type: ObjectProperty
comment: This is the inverse property of "has profession". @en
comment: Questa è la proprietà inversa di "ha professione".
domain: Professione
label: is profession of @en
range: Agent
version info: stabile
version info: stable @en

Origine naturale
type: Origine dell'anomalia
type: NamedIndividual
label: Natural origin @en

Soggetto
type: Class
comment: This class represents the subject of a cultural property, or its ornamental motif. @en
comment: Questa classe rappresenta il soggetto rappresentato da un bene culturale o il suo motivo decorativo.
label: Subject @en
subclass of: Topic
subclass of: Restriction
  on property: è soggetto di
  some values from: Thing
version info: stable @en
version info: stabile
iccd norm tag: ICCD Normativa Trasversale: DA/AID/AIDI - Normativa F: SG/SGT/SGTI - Altre normative di versioni precedenti alla 4.00: OG/SGT/SGTI - ICCD Normative F, RA, SMO, PST, S, OAC, OA, MI, D, NU: RO/ROF/ROFS

è operatore dell'attività
type: ObjectProperty
comment: Questa è la proprietà inversa di "ha operatore dell'attività".
comment: This is the inverse property of "has activity operator". @en
domain: Agent
label: is activity operator of @en
range: Activity
sub property of: è agente correlato a
version info: stable @en
version info: stabile

Diritti d'autore scaduti
type: Class
comment: Questa classe rappresenta i diritti d'autore scaduti, relativi quindi a un oggetto, per esempio un bene culturale, diventato di pubblico dominio.
comment: This class represents an expired copyright, related to an object, e.g. a cultural property. @en
label: Expired Copyright @en
subclass of: Diritti d'autore
version info: stabile
version info: stable @en
iccd norm tag: ICCD Normativa F 4.00 e OAC: TU/CPR (if CPRD = 'scaduti' or 'diritti scaduti' or 'in pubblico dominio')

soggetto
type: DatatypeProperty
comment: Questa proprietà rappresenta il soggetto rappresentato da un bene culturale o il suo motivo decorativo.
comment: This property represents the subject of a cultural property, or its ornamental motif. @en
domain: CulturalEntity
label: subject @en
range: Literal
version info: stabile
version info: stable @en
iccd norm tag: ICCD Normativa Trasversale: DA/AID/AIDI - Normativa F: SG/SGT/SGTI - Altre normative di versioni precedenti alla 4.00: OG/SGT/SGTI

Tipo di analisi di laboratorio
type: Class
comment: This class represents the type of laboratory test (es.: chemical analysis) @en
comment: Questa classe rappresenta il tipo di analisi di laboratorio (es.: analisi metallurgica, analisi chimica, etc.)
label: Laboratory test type @en
subclass of: Type
version info: stable @en
version info: stabile
iccd norm tag: ICCD Normative NU, RA, BNB, MA, CA: RS/ALB/ALBT

Tipo di indagine archeometrica e diagnostica
type: Class
comment: Questa classe rappresenta il tipo di indagine archeometrica e diagnostica (es.: analisi della malta, carotaggio, termografia, etc.)
comment: This class represents the type of archaeometric and diagnostic survey (e.g. coring) @en
label: Archaeometric diagnostic survey type @en
subclass of: Type
version info: stable @en
version info: stabile
iccd norm tag: ICCD Normativa Trasversale 4.00: RE/IND/INDI - ICCD normative di versioni precedenti: RE/AIN/AINT

numero dell'item all'interno della sottoserie fotografica
type: DatatypeProperty
type: FunctionalProperty
comment: This property represents numbering of the photograph within the editorial photographic subseries. @en
comment: Questa proprietà rappresenta la numerazione della fotografia all'interno della sottoserie fotografica editoriale.
domain: Appartenenza a serie fotografica
label: photographic subseries item number @en
range: Literal
version info: unstable
version info: stabile
iccd norm tag: ICCD Normativa F: PD/SSI/SSIN

Titolo proprio
type: Tipo di Titolo
type: NamedIndividual
comment: Rappresenta il titolo proprio del soggetto di una stampa, di una matrice incisa o di una fotografia. Per titolo proprio di una stampa si intende il titolo principale nella forma in cui appare sulla stampa o sulla matrice stessa. Per titolo proprio (principale) di una fotografia, si intende nella forma in cui appare nell'immagine (o su uno dei suoi supporti, o nelle schede a campi testuali, o nei commenti sonori presenti all'interno del file contenente l'immagine digitale). Per la normativa F, Il titolo proprio include anche ogni eventuale titolo alternativo (altre denominazioni dell'opera che appaiano insieme al titolo principale) e, facoltativamente, i complementi del titolo proprio (ossia sottotitoli od ulteriori indicazioni che contribuiscono a qualificare più specificamente il contenuto dell'immagine).
comment: It represents the title proper to subject of a print, an engraved matrix or a photograph. @en
label: Proper title @en
version info: stable @en
version info: stabile
iccd norm tag: Normative S e MI: OG/SGT/SGTP - Normativa F: SFG/SGL/SGLT

Formato
type: Class
comment: This class represents the documentation format (e.g. jpeg, pdf, MP4) @en
comment: Questa classe rappresenta il formato della documentazione (es.: jpeg, A0, pdf, audiocassetta, MP4).
label: Format @en
subclass of: Description
subclass of: Restriction
  on property: è formato di
  some values from: Documentazione
version info: stable @en
version info: stabile
iccd norm tag: ICCD Normativa Trasversale 4.00: DO/FTA/FTAF, DO/DRA/DRAF, DO/FNT/FNTR (+ DO/VDC/VDCP, DO/REG/REGP)

è archiviato in
type: ObjectProperty
comment: Questa proprietà collega l'archivio e/o istituzione conservativa con la relativa documentazione costituita da fonti e documenti.
comment: This property relates the archive or conservative institution to the documentation made of sources and documents. @en
domain: Agent
label: is archived in @en
range: Fonti e documenti
sub property of: è agente correlato a
version info: stable @en
version info: stabile

ha archivio
type: ObjectProperty
comment: This property relates the documentation made of sources and documents to the archive or conservative institution. @en
comment: Questa proprietà collega una documentazione costituita da fonti e documenti all'archivio e/o istituzione conservativa.
domain: Fonti e documenti
label: has archive @en
range: Agent
sub property of: ha agente correlato
inverse of: è archiviato in
version info: stabile
version info: stable @en
iccd norm tag: ICCD Normativa Trasversale 4.00: DO/FNT/FNTN

è riutilizzato in
type: ObjectProperty
comment: Questa proprietà collega un bene culturale a un altro bene culturale collegato che lo riutilizza in tutto o in parte.
comment: This property relates a cultural entity to a connected cultural entity that reuse it or a part of it. @en
domain: CulturalEntity
label: is reused by @en
range: CulturalEntity
sub property of: ha opera collegata
inverse of: riutilizza
version info: stable @en
version info: stabile
iccd norm tag: ICCD Normativa Trasversale 4.00: RV/RSE/RSER = 'è riutilizzato in' (versioni precedenti: 'bene composto')

è area geografico-culturale di
type: ObjectProperty
comment: This property relates a cultural geographical area to the use of the cultural property which is present. @en
comment: Questa proprietà collega l'area geografico-culturale con l'uso del bene presente.
domain: Feature
label: is cultural geographic area of @en
range: Uso
version info: stabile
version info: stable @en

Occasione legata a fiere e mercati
type: Class
comment: This class represents a circumstance related to fairs, markets, festivals. @en
comment: Questa classe rappresenta un'occasione connessa a fiere, mercati, sagre.
label: Fair market circumstance @en
subclass of: Occasione
disjoint with: Occasione indeterminata
version info: stabile
version info: stable @en
iccd norm tag: ICCD Normativa BDI 4.00: CA/CAO/CAOF

ha tipo di mutamento condizione materiale
type: FunctionalProperty
type: ObjectProperty
comment: This property relates a cultural entity's change of availability to the event type (i.e. theft, destruction, recovery). @en
comment: Questa proprietà collega il mutamento di condizione materiale di un bene culturale al tipo di evento (es.: furto, distruzione, recupero).
domain: Mutamento condizione materiale
label: has change of availability type @en
range: Tipo di mutamento condizione materiale
sub property of: hasType
inverse of: è tipo di mutamento condizione materiale di
version info: stable @en
version info: stabile
iccd norm tag: ICCD Normativa Trasversale 4.00: TU/ALN/ALNT

ha ente schedatore dell'authority file
type: ObjectProperty
comment: Questa proprietà collega un'entità descritta in una scheda di Authority File all'ente schedatore dell'authority file stesso. Per esempio, l'attribuzione di un autore a un bene culturale, uno scavo archeologico, una ricognizione archeologica, una bibliografia. Questa proprietà, esprimendo il significato della relazione nel nome, dà una rappresentazione semplificata della relazione che lega questa entità, l'authority file, e l'ente schedatore dell'authority file.
comment: This property relates an entity described in a authority file to the file's cataloguing institution. @en
domain: Thing
label: has authority file cataloguing agency @en
range: Agent
sub property of: ha agente correlato
inverse of: è ente schedatore dell'authority file di
version info: stable @en
version info: stabile
iccd norm tag: ICCD Normativa Trasversale 4.00: AU/AUT/AUTJ; DO/BIB/BIBJ; RE/RCG/RCGJ; RE/DSC/DSCJ - ICCD Normativa F: PD/PDF/PDFJ

è intervento su
type: ObjectProperty
comment: Questa proprietà, inversa a "ha intervento", collega un intervento, a fini conservativi o di altro tipo, che ha interessato un bene culturale, al bene stesso.
comment: This property relates an intervention on a cultural property to that cultural property.
domain: Intervento
label: is intervention on @en
range: CulturalEntity
version info: stabile
version info: stable @en
iccd norm tag: ICCD Normativa Trasversale 4.00: CO/RST; normative di versioni precedenti: RS/RST - Normativa VeAC: CO/RIA - Normativa CA: RO/RIS

ha agente con responsabilità
type: ObjectProperty
comment: Questa proprietà collega l'individuazione di una responsabilità relativamente ai processi di produzione e di divulgazione che caratterizzano specificamente i beni fotografici all'agente che ha quella specifica responsabilità.
comment: This property relates the responsibility's identification to the agent which has that specific responsibility, focusing on the production process and dissemination of the photographic heritage. @en
domain: Responsabilità
label: has agent with responsibility @en
range: Agent
sub property of: ha agente correlato
inverse of: è agente con responsabilità in
version info: stabile
version info: stable @en
iccd norm tag: ICCD Normativa F e FF 4.00: PD/PDF/PDFN - ICCD Normativa F 3.00: PD/PDF/PDFN o PD/PDF/PDFB

Committenza
type: Class
comment: Questa classe rappresenta l'individuazione della committenza relativa a un bene culturale.
comment: This class represents the commission of a cultural property. @en
label: Commission @en
subclass of: Interpretazione
subclass of: Restriction
  all values from: Occasione
  on property: ha circostanza
subclass of: Restriction
  all values from: Agent
  on property: ha committente
subclass of: Restriction
  on property: è committenza di
  some values from: CulturalEntity
version info: stable @en
version info: stabile
iccd norm tag: ICCD Normativa Trasversale 4.00: AU/CMM

Serie fotografica
type: Class
comment: This class represents a photographic series, that is a set of photographs created or published as a unit, from a library sciences point of view. @en
comment: Questa classe rappresenta una serie editoriale fotografica, ovvero un insieme di immagini ideate o pubblicate come un'unica entità, esplicitamente legate tra di loro da un titolo o da una numerazione progressiva o da altri elementi che ne individuino inequivocabilmente l'unitarietà in senso biblioteconomico.
label: Photographic series @en
subclass of: Collection
subclass of: Restriction
  all values from: Appartenenza a serie fotografica
  on property: è serie fotografica in
subclass of: Restriction
  all values from: Sottoserie fotografica
  on property: hasPart
version info: stabile
version info: stable @en
iccd norm tag: ICCD Normativa Trasversale 4.00: PD/SFI

Controtipo
type: Class
comment: This class represents a facsimile of a cultural property, and in particular of a photography, that has the same format and technique. @en
comment: Questa classe rappresenta un controtipo di un bene culturale, specificamente di una fotografia, cioè una duplicazione realizzata nello stesso formato e nella stessa tecnica.
label: Facsimile @en
subclass of: Opera derivata
version info: stable @en
version info: stabile
iccd norm tag: ICCD Normativa F: RO/CRF/CRFT = 'controtipo'

ha categoria SEC
type: ObjectProperty
comment: This property relates a current inventory to the patrimonial category attributed to the cultural property based on the SEC classification. @en
comment: Questa proprietà collega un inventario patrimoniale alla categoria SEC attribuita al bene.
domain: Inventario Patrimoniale
label: has SEC category @en
range: Categoria SEC
sub property of: hasCategory
version info: stabile
version info: stable @en

ha fotografo dell'indagine
type: ObjectProperty
comment: Questa proprietà collega un'indagine di rilevamento di un bene demo-etno-antropologico al fotografo professionista (diverso dal rilevatore) che ha effettuato la ripresa. La relazione tra il ruolo e l'agente che lo riveste è espressa nel nome della proprietà, che quindi ne fornisce una rappresentazione semplificata, con ridotta espressività. Nell'ontologia questa relazione è modellata anche, in maniera più espressiva, dalla classe AgentRole, che permette di collegare l'agente e il suo ruolo.
comment: This property relates an observation survey of a demo-etno-antropologic entity to the professional photographer who took the shot. In the ontology this relationship is modelled also by the class AgentRole which allows more expressiveness. @en
domain: Indagine di rilevamento
label: has survey photographer @en
range: Agent
sub property of: ha agente correlato
inverse of: è fotografo dell'indagine di
version info: stable @en
version info: stabile
iccd norm tag: ICCD Normativa BDI 3.00: DR/DRG

ha bibliografia
type: ObjectProperty
comment: This property relates an entity to its bibliography. @en
comment: Questa proprietà collega un'entità alla sua bibliografia. Per esempio, nell'ambito del Catalogo Generale, collega un bene culturale alla bibliografia che riguarda il bene stesso, descritto in una scheda di catalogo.
domain: Thing
label: has bibliography @en
range: Bibliografia
inverse of: è bibliografia di
version info: stabile
version info: stable @en
iccd norm tag: ICCD Normativa Trasversale 4.00: DO/BIB; RE/RCG/RCGS

ha unità stratigrafica
type: ObjectProperty
comment: Questa proprietà collega uno scavo archeologico all'unità stratigrafica dalla quale proviene il bene rinvenuto nello scavo.
comment: This property relates an archeological excavation to the stratigraphic unit from which a cultural property has been found. @en
domain: Scavo archeologico
label: has stratigraphic unit @en
range: Unità stratigrafica
sub property of: hasLocation
inverse of: è unità stratigrafica di
version info: stabile
version info: stable @en
iccd norm tag: ICCD Normativa Trasversale 4.00: RE/DSC/DSCU

coinvolge opera collegata
type: ObjectProperty
comment: This property relates the situation in which a cultural property is related to another work with the related work itself (e.g.: a preparatory work, a prototype, a copy, a reuse, etc.). @en
comment: Questa proprietà collega il rapporto tra un bene culturale e un'opera collegata all'opera collegata stessa (es.: un lavoro preparatorio, un prototipo, una copia, un reimpiego di tutto il bene o di una sua parte, ecc.).
domain: Rapporto con opera collegata
label: involves related work @en
range: CulturalEntity
inverse of: è opera collegata coinvolta in
version info: stabile
version info: stable @en
iccd norm tag: ICCD Normative RA, SMO, PST, S, OAC, OA, MI, D, NU, CA, MA, F: RO

ha formato
type: ObjectProperty
comment: This property relates the documentation to its format. @en
comment: Questa proprietà collega la documentazione con il suo formato.
domain: Documentazione
label: has format @en
range: Formato
sub property of: hasDescription
inverse of: è formato di
version info: stable @en
version info: stabile
iccd norm tag: ICCD Normativa Trasversale: DO/FTA/FTAF, DO/DRA/DRAF, DO/DNT/FNTR

Titolo originario
type: Tipo di Titolo
type: NamedIndividual
label: Original title @en
iccd norm tag: ICCD Normativa FF: se PA/PAC/PACG = 'originaria'

Titolo principale
type: Tipo di Titolo
type: NamedIndividual
comment: This individual represents publication main title. @en
comment: Questo individuo rappresenta il titolo principale di una pubblicazione.
label: Main title @en
iccd norm tag: ICCD Normative VeAC e AT 3.01: DO/BSE/BSET

è tassonomia biologica di
type: ObjectProperty
comment: This property relates a taxon to a biological entity.
comment: Questa proprietà collega una tassonomia con un'entità biologica.
domain: Tassonomia biologica
label: is biological taxon of @en
range: Thing
sub property of: isClassificationOf
version info: stabile
version info: stable @en

ha collezione
type: ObjectProperty
comment: Questa proprietà collega l'appartenenza di un bene culturale a una collezione in un intervallo di tempo alla collezione coinvolta nella relazione
comment: This property relates a cultural property to the collection to which it belongs in a time span. @en
domain: Appartenenza a Collezione
label: has collection @en
range: CollectionCulEnt
inverse of: è collezione in
version info: stable @en
version info: stabile
iccd norm tag: UB/COL/COLD

è agente con responsabilità in
type: ObjectProperty
comment: Questa è la proprietà inversa a "ha agente con responsabilità".
comment: This is the inverse property of "has agent with responsibility". @en
domain: Agent
label: is agent with responsibility in @en
range: Responsabilità
sub property of: è agente correlato a
version info: stable @en
version info: stabile

è affidabilità di
type: ObjectProperty
comment: This property relates the reliability of the information collected during the survey to a photo interpretation rendering survey. @en
comment: Questa proprietà collega il livello di affidabilità delle informazioni rilevate nell'indagine a una fotointerpretazione o fotorestituzione.
domain: Affidabilità
label: is reliability of @en
range: Fotointerpretazione e fotorestituzione
sub property of: isCharacteristicOf
version info: stable @en
version info: stabile

ha tipo di intervento
type: ObjectProperty
comment: This property relates an intervention on a cultural property (i.e. conservation, interventions, reprocessing, restoring, etc.) to its intervention type. @en
comment: Questa proprietà collega un intervento, a fini conservativi o di altro tipo, che ha interessato un bene culturale al tipo di intervento.
domain: Intervento
label: has intervention type @en
range: Tipo di intervento
sub property of: hasType
inverse of: è tipo di intervento di
version info: stabile
version info: stable @en
iccd norm tag: ICCD Normativa Trasversale 4.00: valori di CO/RST/RSTI Normativa VeAC: CO/RIA (riadattamento/modifica) Normativa CA: RO/RIS (intervento successivo)

Criterio interpretativo
type: Class
comment: This class represents the criterion that motivated an interpretation (e.g. inscription, bibliography, documentation). @en
comment: Questa classe rappresenta il criterio o la motivazione che ha determinato una certa interpretazione (es.: bibliografia, documentazione, iscrizione).
label: Interpretation criterion @en
subclass of: Description
subclass of: Restriction
  on property: è criterio interpretativo di
  some values from: Thing
version info: stabile
version info: stable @en
iccd norm tag: ICCD Normativa Trasversale 4.00: AU/AUT/AUTM; AU/CMM/CMMF; AU/AAT/AATM; AU/ATB/ATBM; DT/DTM/DTMM; SG/SGT/SGTL - Normativa VeAC: AU/FRU/FRUF - Normativa MI 3.00: AU/DC/DDCF

ha zecca
type: ObjectProperty
comment: Questa proprietà collega l'emissione della moneta alla Zecca. Questa proprietà, esprimendo il significato della relazione nel nome, dà una rappresentazione semplificata della relazione che lega questa entità e l'agente; la stessa relazione è rappresentata attraverso una n-ary relation, arco-core:AgentRole, che permette di collegare l'agente al ruolo che riveste nei confronti dell'entità.
comment: This property relates the coin issuance to the Mint. In the ontology this relationship is modelled also by the class AgentRole which allows more expressiveness. @en
domain: Emissione di moneta
label: has mint @en
range: Agent
sub property of: ha agente correlato
inverse of: è zecca in
version info: stabile
version info: stable @en
iccd norm tag: ICCD Normativa NU: DA/ZEC - ICCD Normativa OA (dopo il rilascio della specifica scheda NU nel 2004 la scheda OA non è stata più utilizzata per la catalogazione di monete e medaglie): AU/EDT/EDTZ

ha autore
type: ObjectProperty
comment: This property relates an entity to its author. @en
comment: Questa proprietà collega una entità di qualsiasi tipo (documentazione, bene culturale, etc.) con il suo autore.
comment: This property relates a entity (i.e. documentation, cultural entity, etc.) to its author. @en
domain: Thing
label: has author @en
range: Agent
sub property of: ha agente correlato
inverse of: è autore di
property chain axiom: ha attribuzione di autore/responsabilità
property chain axiom: ha autore attribuito
version info: stabile
version info: stable @en
iccd norm tag: ICCD Normativa Trasversale: DO/FTA/FTAA, DO/DRA/DRAA, DO/VDC/VDCR, DO/REG/REGA, DO/FNT/FNTA, DO/BIB/BIBA - Normativa S 3: RO/ADL/ADLA - Normative VeAC e AT 3.01: DO/BSE/BSEA - Normativa MI 3.00: AU/DDC/DDCN

codice univoco ICCD della ricognizione archeologica
type: FunctionalProperty
type: DatatypeProperty
comment: This property represents the code, assigned by the ICCD, which identifies the field survey unequivocally at national level. @en
comment: Questa proprietà rappresenta il codice, assegnato dall'ICCD, che individua il la ricognizione archeologica in modo univoco a livello nazionale.
domain: Ricognizione archeologica
label: archaeological field survey ICCD identifier @en
range: Literal
sub property of: ICCDIdentifier
version info: stabile
version info: stable @en
iccd norm tag: ICCD Normativa Trasversale 4.00: RE/RCG/RCGK

Codifica Iconclass
type: DatatypeProperty
comment: This property represents the Iconclass code, for describing the subject or ornamental motif represented by the cultural property. @en
comment: Questa proprietà rappresenta la codifica iconclass che permette di descrivere, mediante un codice alfanumerico, il soggetto o il motivo decorativo rappresentato su un bene culturale.
domain: Thing
label: Iconclass Code @en
range: Literal
sub property of: identifier
version info: stable @en
version info: stabile

Metodo di indagine
type: Class
comment: This class represents the archeological survey method adopted. @en
comment: Questa classe rappresenta il metodo di scavo archeologico o di ricognizione archeologica adottato nel corso dell'indagine. (es.: sondaggio, per strati stratigrafici, occasionale, sistematico, etc.)
label: Survey method @en
subclass of: Method
subclass of: Restriction
  on property: è metodo di indagine di
  some values from: Indagine
version info: stabile
version info: stable @en
iccd norm tag: ICCD Normativa Trasversale 4.00: RE/RCG/RCGM; RE/DSC/DSCM

modalità di acquisizione
type: DatatypeProperty
comment: This property represents how the cultural entity was inserted inside a collection. @en
comment: Questa proprietà rappresenta, a testo libero, le modalità di acquisizione del bene nel patrimonio.
domain: Inventario Patrimoniale
label: method of insertion @en
range: Literal
version info: stabile
version info: stable @en
iccd norm tag: ICCD Normativa Trasversale 4.00: UB/INP/INPM

collocazione dell'opera preparatoria o finale
type: DatatypeProperty
comment: Questa proprietà rappresenta la localizzazione geografica e collocazione specifica dell'opera derivata dal bene culturale.
comment: This property represents geographical location and specific location of the work derived from the cultural property. @en
domain: Opera preparatoria o finale
label: preparatory or final work location @en
range: Literal
version info: stable @en
version info: stabile
iccd norm tag: ICCD Normative F, RA, SMO, PST, S, OAC, OA, MI, D, NU: RO/ROF/ROFC - Normativa S: RO/COP/COPC - Normativa F: RO/CRF/CRFC

è ufficio esportazione di
type: ObjectProperty
comment: Questa proprietà collega un ufficio di esportazione a un certificazione di esportazione/importazione.
comment: This property relates an export office to an export/import certification. @en
domain: Agent
label: is export office of @en
range: Certificazione di importazione o esportazione
sub property of: è agente correlato a
version info: stable @en
version info: stabile
iccd norm tag: ICCD Normativa Trasversale 4.00: TU/ESP/ESPU

è responsabile dell'attività
type: ObjectProperty
comment: This is the inverse property of "has activity responsible". @en
comment: Questa è la proprietà inversa di "ha responsabile dell'attività".
domain: Agent
label: is activity responsible of @en
range: Activity
sub property of: è agente correlato a
version info: stable @en
version info: stabile

è contesto di rinvenimento di
type: ObjectProperty
comment: Questa proprietà collega il contesto di rinvenimento di un bene culturale, in particolare un reperto antropologico, al bene culturale.
comment: This property relates the finding context of a cultural property, and in particular an anthropological material, to the related cultural property. @en
domain: Contesto di rinvenimento
label: is finding context of @en
range: CulturalEntity
sub property of: isSituationOf
version info: stabile
version info: stable @en

luogo dell'edizione
type: DatatypeProperty
comment: Questa proprietà rappresenta il luogo dell'edizione di un'opera.
comment: This property represents work's edition place. @en
domain: Edizione
label: edition location @en
range: Literal
version info: stable @en
version info: stabile
iccd norm tag: ICCD Normative VeAC e AT 3.01: DO/BSE/BSEL.

è mutamento di condizione materiale di
type: ObjectProperty
comment: This property relates a change of availability to a cultural entity. @en
comment: Questa proprietà collega un mutamento di condizione materiale a un'entità culturale.
domain: Mutamento condizione materiale
label: is change of availability of @en
range: CulturalEntity
sub property of: isSituationOf
version info: stabile
version info: stable @en

ha musicista
type: ObjectProperty
comment: This property relates a musical instrument to the person who plays (in the present or past) a certain role as the instrument's exectutor. In the ontology this relationship is modelled also by the class AgentRole which allows more expressiveness. @en
comment: Questa proprietà collega uno strumento musicale a una persona che assume - o ha assunto - un ruolo certo come esecutore dello strumento. Questa relazione è modellata anche, con maggiore potere espressivo, tramite il pattern AgentRole, che collega lo strumento musicale a una situazione in cui un agente ha rivestito un ruolo (in questo caso, chitarrista, flautista, pianista, ecc., o genericamente musicista).
domain: CulturalEntity
label: has musician @en
range: Agent
sub property of: ha agente correlato
inverse of: è musicista di
version info: stable @en
version info: stabile
iccd norm tag: ICCD Normativa SM 4.00: MU/MUTN

Indagine su paleopatologia
type: Class
comment: Questa classe rappresenta un'indagine, intesa come attività, in cui viene elaborata una diagnosi di una paleopatologia di un reperto antropologico.
comment: This class represents a particular type of survey on a cultural property, that is a survey in which is possible to make a diagnosis of a paleopathology of an anthropological material. @en
label: Paleopathology survey @en
subclass of: Indagine
subclass of: Restriction
  all values from: Literal
  on property: diagnosi
subclass of: Restriction
  all values from: Literal
  on property: fa riferimento a indagini
subclass of: Restriction
  all values from: Metodo di indagine
  on property: ha metodo di indagine
version info: stable @en
version info: stabile
iccd norm tag: ICCD Normativa AT: PT

Codice SEC
type: Class
comment: Questa classe rappresenta il codice patrimoniale del bene (SEC - Modello 15), con riferimento alla classificazione del Sistema Europeo dei Conti 1995.
comment: This class represents the patrimonial code of a cultural property, referring to the SEC classification 1995. @en
label: SEC Identifier @en
subclass of: Category
version info: stabile
version info: stable @en
iccd norm tag: ICCD Normativa Trasversale 4.00: UB/INP/INPS

è tipo di contesto di rinvenimento di
type: ObjectProperty
comment: This property relates a type of cultural property (i.e. anthropological material) finding context to its context. @en
comment: Questa proprietà collega il tipo di contesto di rinvenimento di un bene culturale, e in particolare di un reperto antropologico, al suo contesto.
domain: Tipo di contesto di rinvenimento
label: is finding context type of @en
range: Contesto di rinvenimento
sub property of: isTypeOf
version info: stable @en
version info: stabile

è tipo di acqusizione di
type: ObjectProperty
comment: This property relates a cultural entity's acquisition type (i.e. donation, seizure) to its acquisition. @en
comment: Questa proprietà collega il tipo di acquisizione (es.: donazione, alienazione, confisca) all'acquisizione di un bene culturale.
domain: Tipo di acquisizione
label: is acquisition type of @en
range: Acquisizione
sub property of: isTypeOf
version info: stable @en
version info: stabile

ha motivo di indagine
type: ObjectProperty
comment: Questa proprietà collega uno scavo archeologico, una ricognizione archeologica, un'indagine archeometrica e diagnostica o una fotointerpretazione e fotorestituzione al motivo principale che li ha determinati.
comment: This property relates an archeological, archaeometric or diagnostic survey or a photo interpretation rendering to the the main motivation that led to it. @en
domain: Class
  union of: Scavo archeologico
  union of: Ricognizione archeologica
  union of: Indagine archeometrica e diagnostica
  union of: Fotointerpretazione e fotorestituzione
label: has survey motivation @en
range: Motivo di indagine
sub property of: hasDescription
inverse of: è motivo di indagine di
version info: stabile
version info: stable @en

ha soggetto fonte dell'acquisizione
type: ObjectProperty
comment: This property relates the event of a cultural entity's acquisition to the agent which is the source of the acquisition. @en
comment: Questa proprietà collega un evento di acquisizione di un bene culturale al soggetto fonte dell'acquisizione.
domain: Acquisizione
label: has previous owner @en
range: Agent
sub property of: ha agente correlato
inverse of: è soggetto fonte dell'acquisizione di
version info: stable @en
version info: stabile
iccd norm tag: ICCD Normativa Trasversale 4.00: TU/ACQ/ACQN

ha tipo di analisi di laboratorio
type: ObjectProperty
comment: Questa proprietà collega un'analisi di laboratorio con il tipo di analisi (es.: analisi metallurgica, analisi chimica, etc.).
comment: This property relates a laboratory test to its test type (i.e. chemical or metallurgical analysis). @en
domain: Analisi di laboratorio
label: has laboratory test type @en
range: Tipo di analisi di laboratorio
sub property of: hasType
inverse of: è tipo di analisi di laboratorio di
version info: stabile
version info: stable @en
iccd norm tag: ICCD Normative NU, RA, BNB, MA, CA: RS/ALB/ALBT

è tipo di analisi di laboratorio di
type: ObjectProperty
comment: This property relates the laboratory test type (i.e. chemical or metallurgical analysis) to the related laboratory test. @en
comment: Questa proprietà collega il tipo di analisi di laboratorio (es.: analisi metallurgica, analisi chimica, etc.) con la relativa analisi.
domain: Tipo di analisi di laboratorio
label: is laboratory test type of @en
range: Analisi di laboratorio
sub property of: isTypeOf
version info: stabile
version info: stable @en

Attribuzione Primaria di Autore
type: Class
comment: Questa classe rappresenta l'attribuzione di autore maggiormente accreditata o convincente.
comment: This class represents the preferred authorship attribution, most accredited or convincing. @en
label: Preferred Authorship Attribution @en
subclass of: Attribuzione di Autore o responsabilità
subclass of: Restriction
  on property: ha autore attribuito
  some values from: Agent
subclass of: Restriction
  all values from: Literal
  on property: intervento dell'autore
version info: stable @en
version info: stabile
iccd norm tag: AU/AUT

situazione ambientale
type: DatatypeProperty
comment: Questa proprietà collega una ricognizione archeologica alla situazione ambientale al momento della ricognizione.
comment: This property relates an archaeological survey to environmental situation. @en
domain: Ricognizione archeologica
label: environmental state @en
range: Literal
version info: stabile
version info: stable @en
iccd norm tag: ICCD Normativa Trasversale 4.00: RE/RCG/RCGT - Versioni precedenti: RE/RCG/RCGU + RE/RCG/RCGC

Sottoserie fotografica
type: Class
comment: This class represents a photographic subseries, that is a component of a photographic series. @en
comment: Questa classe rappresenta una sottoserie di una serie editoriale fotografica, ovvero una partizione interna alla serie.
label: Photographic subseries @en
subclass of: Serie fotografica
subclass of: Restriction
  all values from: Serie fotografica
  on property: isPartOf
version info: stabile
version info: stable @en
iccd norm tag: ICCD Normativa F: PD/SSI

ha fruizione
type: ObjectProperty
comment: This property relates garment to the context in which it has been worn. @en
comment: Questa proprietà collega un vestimento antico o contemporaneo a un'occasione in cui è stato indossato da una o più persone.
domain: CulturalEntity
label: has fruition @en
range: Fruizione
sub property of: hasSituation
inverse of: è fruizione di
version info: stabile
version info: stable @en
iccd norm tag: Normativa VeAC: AU/FRU

codice della scheda dell'opera originale o finale
type: DatatypeProperty
type: FunctionalProperty
comment: This property represents the code which identifies the record relating to the final or preparatory work in relation with the cultural property. @en
comment: Questa proprietà rappresenta il codice, qualora esista, che identifica la scheda relativa all'opera finale o preparatoria in relazione con il bene culturale.
domain: Opera preparatoria o finale
label: preparatory or final work record identifier @en
range: Literal
sub property of: identifier
version info: stabile
version info: stable @en
iccd norm tag: ICCD Normative F, RA, SMO, PST, S, OAC, OA, MI, D, NU: RO/ROF/ROFX

ha fase di realizzazione
type: ObjectProperty
comment: Questa proprietà collega il rapporto tra un bene culturale e un'altra entità collegata (opera preparatoria o opera finale) allo stadio di realizzazione del bene stesso in rapporto a questa entità.
comment: This property relates the relatioship between a cultural property and a related work (preparatory or final work) to the stage of the cultural property referring to this related work. @en
domain: Rapporto con opera collegata
label: has cultural property stage @en
range: Stadio del bene culturale
inverse of: è stadio del bene culturale in
version info: stabile
version info: stable @en
iccd norm tag: ICCD Normative RA, SMO, PST, S, OAC, OA, MI, D, NU, F: RO/ROF/ROFF

Uso storico
type: Tipo d'uso
type: NamedIndividual
comment: This individual represents cultural enity's historical use. @en
comment: Questo individuo rappresenta l'uso storico di un bene.
label: Historical use @en
version info: stable @en
version info: stabile

Buona affidabilità
type: Affidabilità
type: NamedIndividual
label: Good reliability @en

Opera preparatoria o finale
type: Class
comment: Questa classe rappresenta un'entità collegata a un bene culturale, che ne costituisce una fase preparatoria o una fase finale.
comment: This class represents an entity related to a cultural property, that is its preparatory or final stage. @en
label: Preparatory or final work @en
subclass of: CulturalEntity
subclass of: Restriction
  all values from: Inventario
  on property: ha inventario
subclass of: Restriction
  all values from: Cronologia
  on property: ha cronologia
subclass of: Restriction
  all values from: Agent
  on property: ha autore
subclass of: Restriction
  all values from: Titolo
  on property: ha titolo
subclass of: Restriction
  all values from: Literal
  on property: codice della scheda dell'opera originale o finale
subclass of: Restriction
  all values from: Literal
  on property: collocazione precedente dell'opera preparatoria o finale
subclass of: Restriction
  all values from: Literal
  on property: collocazione dell'opera preparatoria o finale
description: An example of usage of the class 'Preparatory or final work' is the following:: resource:PreparatoryOrFinalWork/0500212038-disegno a cd:PreparatoryOrFinalWork ; rdfs:label "Preparatory or final work 1 of cultural property 0500212038: disegno"@en ; cd:hasAuthor resource:Agent/tiziano-vecellio ; cd:hasDating resoruce:Dating/0500212038-disegno . @en
description: Un esempio di utilizzo della classe "Opera preparatoria o finale" è il seguente: resource:PreparatoryOrFinalWork/0500212038-disegno a cd:PreparatoryOrFinalWork ; rdfs:label "Opera originale o finale 1 del bene culturale 0500212038: disegno"@it ; cd:hasAuthor resource:Agent/tiziano-vecellio ; cd:hasDating resoruce:Dating/0500212038-disegno .
version info: stabile
version info: stable @en
iccd norm tag: ICCD Normative F, RA, SMO, PST, S, OAC, OA, MI, D, NU: RO/ROF

età della morte stimata
type: FunctionalProperty
type: DatatypeProperty
comment: This property represents an anthropological finding estimated age of death. @en
comment: Questa proprietà rappresenta l'età della morte stimata nel contesto della stima dell'età della morte di un reperto antropologico.
domain: Interpretazione dell'età della morte
label: estimated age of death @en
range: Literal
version info: stable @en
version info: stabile

informazioni storiche
type: DatatypeProperty
domain: CulturalEntity
label: historical information @en
range: Literal
version info: stable @en
version info: stabile
iccd norm tag: ICCD Normativa Trasversale 4.00: DA/NSC

Documentazione
type: Class
comment: This class represents the documentation, with subclasses for each specific type of documentation (images, drawings, audio, video, etc.) @en
comment: Classe che rappresenta la documentazione, specializzata nelle sottoclassi che rappresentano tipi specifici di documentazione di corredo (immagini, disegni e rilievi, cartografia, documenti audio e video, fonti e documenti editi e inediti, referenze bibliografiche).
label: Documentation @en
subclass of: Object
subclass of: Restriction
  all values from: Formato
  on property: ha formato
subclass of: Restriction
  on property: codice identificativo della documentazione
  some values from: Literal
subclass of: Restriction
  all values from: Literal
  on property: gestione diritti
subclass of: Restriction
  on property: è documentazione di
  some values from: Thing
subclass of: Restriction
  all values from: anyURI
  on property: URL
subclass of: Restriction
  all values from: Literal
  on property: nome del file digitale
subclass of: Restriction
  all values from: Literal
  on property: specifications
subclass of: Restriction
  all values from: Tipo di documentazione
  on property: ha tipo di documentazione
description: Un esempio d'uso di una delle sottoclassi della classe 'Documentazione' è il seguente: resource:AudioDocumentation/1200924650-audio-documentation-1 a cd:AudioDocumentation ; rdfs:label "Documentazione audio 1 del bene culturale: 1200924650"@it ; cd:documentationIdentifier "New_1401358982589" ; cd:hasDocumentationType resource:DocumentationType/cassetta-dat ; cd:hasFormat resource:Format/cassetta-dat ; core:hasCategory cd:AttachedDocumentation . @en
description: An example of usage of one of the subclasses of the class 'Documentation' is the following: resource:AudioDocumentation/1200924650-audio-documentation-1 a cd:AudioDocumentation ; rdfs:label "Audio documentation 1 of cultural property: 1200924650"@en ; cd:documentationIdentifier "New_1401358982589" ; cd:hasDocumentationType resource:DocumentationType/cassetta-dat ; cd:hasFormat resource:Format/cassetta-dat ; core:hasCategory cd:AttachedDocumentation . @en
version info: stable @en
version info: stabile
iccd norm tag: ICCD Normativa Trasversale 4.00: DO

ha serie fotografica
type: ObjectProperty
comment: This property relates a photographic series a the cultural entity which belongs to it. @en
comment: Questa proprietà, inversa a "è serie in", collega il rapporto tra una serie e un bene fotografico che ne fa parte alla serie stessa.
domain: Appartenenza a serie fotografica
label: has photographic series @en
range: Serie fotografica
inverse of: è serie fotografica in
version info: stabile
version info: stable @en
iccd norm tag: ICCD Normativa Trasversale: PD/SFI; PD/SSI

Unità documentaria
type: Class
comment: Questa classe rappresenta una unità documentaria che fa parte di una unità archivistica complessa.
comment: This class represents the archival record that is part of an archival record set. @en
label: Archival record @en
subclass of: Object
subclass of: Restriction
  all values from: Literal
  on property: identificativo di unità documentaria
subclass of: Restriction
  all values from: Unità archivistica complessa
  on property: isPartOf
is native to: BornDigitalArchives ODP.owl
version info: stable @en
version info: stabile
iccd norm tag: ICCD Normativa F: UB/UBF

Provvedimento di tutela
type: Class
comment: Questa classe rappresenta un provvedimento di tutela nazionale o internazionale, che ha interessato un bene culturale.
comment: This class represents the protective measure, national or international, related to a cultural property. @en
label: Protective measure @en
subclass of: Object
subclass of: Restriction
  all values from: Literal
  on property: data di comunicazione di avvio
subclass of: Restriction
  all values from: Literal
  on property: data di notifica
subclass of: Restriction
  all values from: Agent
  on property: ha ente proponente
subclass of: Restriction
  all values from: Literal
  on property: data di emissione
subclass of: Restriction
  all values from: Literal
  on property: data di registrazione o gazzetta ufficiale
subclass of: Restriction
  on property: è provvedimento di tutela di
  some values from: CulturalEntity
version info: stabile
version info: stable @en
iccd norm tag: ICCD Normativa Trasversale 4.00: TU/NVC

numero nella tiratura
type: FunctionalProperty
type: DatatypeProperty
comment: Questa proprietà rappresenta la numerazione dell'esemplare della fotografia o della stampa all'interno della tiratura e il numero complessivo degli esemplari tirati, qualora la fotografia o la stampa risalgano a una tiratura. Nel caso delle fotografie, per tiratura si intende un insieme prestabilito e limitato di esemplari (uguali) tratti dallo stesso negativo o dalla stessa, ovvero non modificata, fotografia digitale (o dalla stessa serie di matrici), numerati progressivamente.
comment: This property represents photograph copies numbering. @en
domain: CulturalEntity
label: number in circulation @en
range: Literal
version info: stable @en
version info: stabile
iccd norm tag: ICCD Normativa F: PD/TRT; ICCD Normativa S: PD/TRT/TRTN

Anomalia lineare
type: Tipo di anomalia
type: NamedIndividual
label: Line anomaly @en

è indagine su
type: ObjectProperty
comment: Questa proprietà collega un'indagine effettuata su un bene culturale al bene stesso.
comment: This property relates a cultural entity's survey to the cultural entity. @en
domain: Indagine
label: is survey on @en
range: CulturalEntity
version info: stabile
version info: stable @en
iccd norm tag: ICCD Normativa Trasversale 4.00: RE; CM/ISP - ICCD Normative NU, RA, BNB, MA, CA: RS/ALB - ICCD Normativa AT 3.00: IN/INI - Normativa BDM e SM 4.00: DR

Anomalia puntuale
type: Tipo di anomalia
type: NamedIndividual
label: Point anomaly @en

Titolo parallelo
type: Tipo di Titolo
type: NamedIndividual
comment: Rappresenta un titolo parallelo, cioè lo stesso titolo principale tradotto in altre lingue e presentato come equivalente.
comment: I represents a parallel title, that is main title translated into other languages and presented as equivalent. @en
label: Parallel title @en
iccd norm tag: Normativa F: SG/SGL/SGLL - Normative S e MI: OG/SGT/SGTR

Documentazione esistente
type: Genere della documentazione
type: NamedIndividual
comment: This individual represents documentation definition that is only mentioned. @en
comment: Questo individuo rappresenta la definizione (vocabolario chiuso) della documentazione che viene solo citata: non è acclusa alla scheda di catalogo, ma si trova presso un luogo di conservazione (Archivio, Biblioteca, ecc.), anche “virtuale”, come nel caso delle risorse disponibili sul web e consultabili on line.
label: Existing documentation @en
version info: stable @en
version info: stabile

ha sottospecie
type: FunctionalProperty
type: ObjectProperty
comment: Questa proprietà collega una tassonomia biologica alla sottospecie, che è uno dei concetti della tassonomia.
comment: This property relates a biological taxon to the subspecies, that is one of the concept of the taxon. @en
domain: Tassonomia biologica
label: has subspecies @en
range: Sottospecie
sub property of: hasConcept
inverse of: è sottospecie in
version info: stabile
version info: stable @en
iccd norm tag: ICCD Normativa AT: OG/OGS/OGST

Fotointerpretazione e fotorestituzione
type: Class
comment: Questa classe rappresenta un tipo particolare di indagine su bene culturale, ovvero una fotointerpretazione e fotorestituzione, intesa come indagine territoriale.
comment: This class represents a particular type of survey on a cultural property, that is photo interpretation and rendering. @en
label: Photo interpretation and rendering @en
subclass of: Indagine
subclass of: Restriction
  all values from: Literal
  on property: specifiche sulla sovrapposizione
subclass of: Restriction
  all values from: Agent
  on property: ha responsabile dell'attività
subclass of: Restriction
  all values from: Anomalia
  on property: ha anomalia
subclass of: Restriction
  all values from: Immagine di indagine
  on property: ha immagine di indagine
subclass of: Restriction
  all values from: Affidabilità
  on property: ha affidabilità
subclass of: Restriction
  all values from: Agent
  on property: ha responsabile scientifico dell'indagine
subclass of: Restriction
  all values from: Motivo di indagine
  on property: ha motivo di indagine
version info: stabile
version info: stable @en
iccd norm tag: ICCD Normativa Trasversale 4.00: RE/FOI

collocazione della documentazione
type: DatatypeProperty
comment: This property represents document location, which can also be expressed by inventory location or identifier. @en
comment: Questa proprietà rappresenta la collocazione del documento, che può anche essere espressa per mezzo della collocazione inventariale o dell'identificativo (numerico o alfanumerico) della fonte o del documento.
domain: Documentazione
label: documentation location @en
range: Literal
version info: stable @en
version info: stabile
iccd norm tag: ICCD Normativa Trasversale 4.00: DO/FTA/FTAC, DO/DRA/DRAC, DO/VDC/VDCC, DO/REG/REGC, DO/FNT/FNTS

Attribuzione di Autore o responsabilità
type: Class
comment: Questa classe rappresenta l'attribuzione di un autore o di una responsabilità per la creazione di un bene culturale, cioè le informazioni relative ai soggetti (persone singole o enti collettivi) intervenuti nella realizzazione del bene e/o all'ambito culturale di riferimento.
comment: This class represents the attribution of authorship or a responsibility for the creation of a cultural property, referring to the agents that played a role in the creation of the cultural property or to the reference cultural scope. @en
label: Authorship Attribution @en
subclass of: Interpretazione
subclass of: Restriction
  all values from: Role
  on property: ha ruolo nell'intervento
subclass of: Restriction
  all values from: Agent
  on property: ha autore attribuito
subclass of: Restriction
  all values from: Agent
  on property: ha ente schedatore dell'authority file
subclass of: Restriction
  on property: è attribuzione di autore/responsabilità di
  some values from: CulturalEntity
subclass of: Restriction
  all values from: Ambito culturale
  on property: ha ambito culturale
version info: stable @en
version info: stabile
iccd norm tag: ICCD Normativa Trasversale: AU/AAT; AU/ATB; AU/AUT

ha intervento
type: ObjectProperty
comment: This property relates a cultural entity to a intervention on it, for conservational or other purposes. @en
comment: Questa proprietà collega un bene culturale con un intervento, a fini conservativi o di altro tipo, che lo ha interessato.
domain: CulturalEntity
label: has intervention @en
range: Intervento
sub property of: isMemberOf
inverse of: è intervento su
version info: stable @en
version info: stabile
iccd norm tag: ICCD Normativa Trasversale 4.00: CO/RST; normative di versioni precedenti: RS/RST - Normativa VeAC: CO/RIA - Normativa CA: RO/RIS

titolo della documentazione
type: DatatypeProperty
comment: Questa proprietà rappresenta il titolo o la denominazione del documento.
comment: This property represents document title or denomination. @en
domain: Documentazione
label: documentation title @en
range: Literal
version info: stable @en
version info: stabile
iccd norm tag: FTAM, DRAM, VDCA, REGZ, FNTT

Tipo di responsabilità
type: Class
comment: This class represents the type of responsibility related to the production and dissemination of photographic heritage (e.g.: printer, editor) @en
comment: Questa classe rappresenta il tipo di responsabilità individuata relativamente ai processi di produzione e di divulgazione che caratterizzano specificamente i beni fotografici (es.: stampatori, ritoccatori, coloritori, ecc.).
label: Responsibility type @en
subclass of: Type
version info: stabile
version info: stable @en
iccd norm tag: ICCD Normative F e FF: PD/PDF/PDFR

Tipo di anomalia
type: Class
comment: Questa classe rappresenta il tipo di anomalia (puntuale, lineare, areale) rilevata durante una fotointerpretazione o fotorestituzione.
comment: This class represents the type of anomaly (line anomaly, point anomaly, polygon anomaly) observed during a photo interpretation or rendering survey. @en
label: Anomaly type @en
subclass of: Type
version info: stabile
version info: stable @en
iccd norm tag: ICCD Normativa Trasversale 4.00: RE/FOI/FOIQ

collocazione di unità documentaria
type: DatatypeProperty
comment: Questa proprietà rappresenta la collocazione di un'unità documentaria all'interno di un'unità archivistica complessa.
comment: This property represents the location of a documentary unit within a complex archival unit. @en
domain: Appartenenza a unità archivistica complessa
label: archival record location @en
range: Literal
version info: stabile
version info: stable @en
iccd norm tag: ICCD Normativa F: UB/UBF/UBFC

Titolo secondario
type: Tipo di Titolo
type: NamedIndividual
comment: This individual represents publication's secondary title. @en
comment: Questo individuo rappresenta il tipo di titolo secondario di una pubblicazione.
label: Secondary title @en
iccd norm tag: ICCD Normative VeAC e AT 3.01: DO/BSE/BSEC

Tipo di circostanza
type: Class
comment: Questa classe rappresenta il tipo di occasione (es.: civile, religiosa).
comment: This class represents the circumstance type (e.g.: civil, religious) @en
comment: This class represents the type of circumstance (e.g. civil, religious) @en
label: Circumstance type @en
subclass of: Type
version info: stabile
version info: stable @en
iccd norm tag: ICCD Normativa BDI: CA/CAR; CA/CAC

è tipo d'uso di
type: ObjectProperty
comment: This property relates the type of a cultural entity use to its use. @en
comment: Questa proprietà collega il tipo di uso del bene (attuale, precedente, storico) con il suo uso.
domain: Tipo d'uso
label: is use type of @en
range: Uso
sub property of: isTypeOf
version info: stable @en
version info: stabile

Indagine di rilevamento
type: Class
comment: Questa classe rappresenta un tipo particolare di indagine, ovvero il rilevamento (l'occasione o l'indagine in occasione della quale è stato rilevato, individuato, osservato il bene) di un bene musicale di interesse etno-organologico o di un bene demoetno-antropologico.
comment: This class represents a particular type of survey on a cultural property, that is an observation survey: the observation of musical heritage or demoethnoanthropological heritage. @en
label: Observation survey @en
subclass of: Indagine
subclass of: Restriction
  all values from: Agent
  on property: ha fonico dell'indagine
subclass of: Restriction
  all values from: Tipo di indagine di rilevamento
  on property: ha tipo di indagine di rilevamento
subclass of: Restriction
  all values from: Agent
  on property: ha fotografo dell'indagine
subclass of: Restriction
  all values from: Agent
  on property: ha operatore dell'attività
subclass of: Restriction
  all values from: Agent
  on property: ha responsabile dell'attività
subclass of: Restriction
  all values from: Ricerca
  on property: si riferisce a ricerca
version info: stable @en
version info: stabile
iccd norm tag: ICCD Normativa SM e BDM 4.00: DR

è emissione di moneta
type: ObjectProperty
comment: Questa è la proprietà inversa a "ha emissione di moneta".
comment: This is the inverse property of "has coin issuance". @en
domain: Emissione di moneta
label: is coin issuance of @en
range: Class
  union of: CulturalEntity
  union of: Counterstamp
sub property of: isSituationOf
version info: stabile
version info: stable @en

ha professione
type: ObjectProperty
comment: This property relates an agent to its job. For example the agent responsible of the production of a cultual entity. @en
comment: Questa proprietà collega un agente al suo mestiere o professione, per esempio l'utente del bene oppure il responsabile della fabbricazione di un bene con il suo mestiere o la sua professione.
domain: Agent
label: has profession @en
range: Professione
inverse of: è professione di
version info: stable @en
version info: stabile
iccd norm tag: ICCD Normativa BDM 2.00: UT/UTN/UTNM - ICCD Normativa BDM 4.00: AU/AUT/AUTE

Genere della bibliografia
type: Class
comment: This class represents the category associated to a bibliography (e.g. accompanying bibliography, comparative bibliography, specific bibliography). @en
comment: Questa classe rappresenta la categoria della bibliografia. Nel contesto delle normative per la catalogazione ICCD, questa classe ha associato un vocabolario chiuso definito in tre tipi: bibliografia specifica, bibliografia di confronto e bibliografia di corredo.
label: Bibliography category @en
subclass of: Category
version info: stable @en
version info: stabile
iccd norm tag: ICCD Normative OA-OAC-MI-D-S-RA-TMA-CA-MA-SAS-SI 3.00: DO/BIB/BIBX - Normative VeAC e AT 3.01: DO/BSE/BSEX.

Tipo d'uso
type: Class
comment: This class represents the type of use of a cultural property (current, previous, historical) @en
comment: Questa classe rappresenta il tipo di uso del bene (attuale, precedente, storico o dato non disponibile).
label: Use type @en
subclass of: Type
version info: stable @en
version info: stabile
iccd norm tag: ICCD Normativa Trasversale: UT/UTU/UTUT

ha stima di bene culturale
type: ObjectProperty
comment: Questa proprietà collega un bene culturale alla stima effettuata sul bene stesso.
comment: This property relates a cultural property to the estimate of that cultural property. @en
domain: CulturalEntity
label: has cultural property estimate @en
range: Stima di bene culturale
sub property of: ha stima
inverse of: è stima del bene culturale
version info: stabile
version info: stable @en

è titolare dei diritti d'autore in
type: ObjectProperty
comment: This is the inverse property of "has copyright holder". @en
comment: Questa è la proprietà inversa di "ha titolare dei diritti d'autore"
domain: Agent
label: is copyright holder in @en
range: Diritti d'autore
sub property of: è agente correlato a
version info: stabile
version info: stable @en

è cronologia di
type: ObjectProperty
comment: Questa proprietà collega una cronologia all'entità cui si riferisce.
comment: This property relates a dating to an entity. @en
domain: Cronologia
label: is dating of @en
range: Thing
sub property of: isSituationOf
version info: stabile
version info: stable @en

Bibliografia di confronto
type: Genere della bibliografia
type: NamedIndividual
comment: This individual represents the definition relative to the kind of bibliography used for comparisons. @en
comment: Questo individuo rappresenta la definizione (vocabolario chiuso) relativa al genere di bibliografia utilizzata per confronti (stilistici, tipologici, ecc.).
label: Comparative bibliography @en
version info: stable @en
version info: stabile

Contraffazione
type: Class
comment: Questa classe rappresenta una contraffazione di un bene culturale, cioè una riproduzione di un bene culturale da parte di un autore che non dichiari l'autore dell'originale.
comment: This class represents a forgery of a cultural property, that is a copy of a cultural property for which the author doesn't declare the original author. @en
label: Forgery @en
subclass of: Opera derivata
version info: stabile
version info: stable @en
iccd norm tag: ICCD Normativa F: RO/CRF/CRFT = 'contraffazione'

ha responsabilità
type: ObjectProperty
comment: Questa proprietà collega un bene fotografico (fotografia o fondo fotografico) all'individuazione di una responsabilità attribuibile a un agente relativamente ai processi di produzione e di divulgazione che caratterizzano specificamente i beni fotografici, quindi alle diverse personalità responsabili, a vario titolo, del ciclo produttivo del bene in esame, oltre che della sua circolazione, divulgazione, commercializzazione e promozione (committenti, stampatori, ritoccatori, coloritori, editori, distributori, sponsor, curatori e responsabili di edizioni e di serie, dedicanti e dedicatari, responsabili di collezioni e di collazioni, ecc.).
comment: This property relates a photographic cultural entity (photography or photographic fond) to the responsibility attribution of an agent. The agent is in charge of the production or disclosure process which characterises photographic heritage (i.e. printers, editors, distributors, sposors, collection responsibles etc.) @en
domain: CulturalEntity
is defined by: This property relates a photographic heritage to the the attribution of a responsibility to an agent, relating to the activities of production and dissemination of photographic heritage (e.g.: committent, editor, printer, dedicatee, etc.). @en
label: has responsibility @en
range: Responsabilità
inverse of: è responsibilità su
version info: stable @en
version info: stabile
iccd norm tag: ICCD Normativa F: PD/PDF

Anomalia
type: Class
comment: Questa classe rappresenta un'anomalia rilevata nel corso di una fotointerpretazione o fotorestituzione.
comment: This class represents an anomaly detected during a photo interpretation or rendering. @en
label: Anomaly @en
subclass of: Situation
subclass of: Restriction
  all values from: Origine dell'anomalia
  on property: ha origine dell'anomalia
subclass of: Restriction
  all values from: Tipo di anomalia
  on property: ha tipo di anomalia
subclass of: Restriction
  on property: è anomalia di
  some values from: Fotointerpretazione e fotorestituzione
version info: stable @en
version info: stabile
iccd norm tag: ICCD Normativa Trasversale 4.00: RE/FOI/FOIA

titolo di unità archivistica complessa
type: DatatypeProperty
comment: Questa proprietà rappresenta il titolo dell'unità archivistica complessa (fondo, serie, sottoserie, etc.) in cui si trova un'unità documentaria.
comment: This property represents the title of the archival record set in which a documentary unit is located. @en
domain: Appartenenza a unità archivistica complessa
label: archival record set title @en
range: Literal
version info: stable @en
version info: stabile
iccd norm tag: ICCD Normativa F: UB/UBF/UBFU

ha membro di serie fotografica
type: ObjectProperty
comment: Questa proprietà, inversa a "è membro di serie", collega l'appartenenza di un bene fotografico a una serie editoriale al bene fotografico coinvolto nella relazione.
comment: This property relates the membership of a cultural entity (e.g. photographic heritage) to its photographic series. It is the inverse property of "isMemberPhotographicSeries". @en
domain: Appartenenza a serie fotografica
label: has member of photographic series @en
range: CulturalEntity
inverse of: è membro di serie fotografica in
version info: stable @en
version info: stabile
iccd norm tag: ICCD Normativa F: PD/SFI; PD/SSI

data di registrazione o gazzetta ufficiale
type: DatatypeProperty
comment: Questa proprietà rappresenta la data dell'avvenuta trascrizione al registro immobiliare, quando trattasi di vincoli imposti con leggi che richiedano la trascrizione, o il numero della Gazzetta Ufficiale su cui è stato pubblicato il decreto.
comment: This property represents the date of the registration or the number of the Official Journal on which the decree was published. @en
domain: Provvedimento di tutela
label: registration date or official journal @en
range: Literal
version info: stable @en
version info: stabile
iccd norm tag: ICCD Normativa Trasversale 4.00: TU/NVC/NVCR

Origine dell'anomalia
type: Class
comment: Questa classe rappresenta l'origine dell'anomalia rilevata nell'indagine di fotointerpretazione o fotorestituzione.
comment: This class represents the anomaly origin of the photo interpretation rendering. @en
label: Anomaly origin @en
subclass of: CulturalEntityCharacteristic
subclass of: Restriction
  all values from: Anomalia
  on property:
    inverse of: ha origine dell'anomalia
disjoint with: Stadio del bene culturale
version info: stabile
version info: stable @en
iccd norm tag: ICCD Normativa Trasversale 4.00: RE/FOI/FOIA

è proprietario in
type: ObjectProperty
comment: Questa proprietà, inversa a "ha proprietario", rappresenta la partecipazione di un agente alla condizione giuridica di un bene culturale, di cui l'agente ha la proprietà.
comment: This class relates an agent, that is the owner of a cultural property, to the legal situation of that cultural property. @en
domain: Agent
label: is owner in @en
range: Situazione giuridica
sub property of: è agente correlato a
version info: stable @en
version info: stabile
iccd norm tag: ICCD Normativa Trasversale 4.00: TU/CDG/CDGS

è tipo di anomalia di
type: ObjectProperty
comment: Questa proprietà collega il tipo di anomalia (puntuale, lineare, areale) a un'anomalia rilevata nel corso di una fotointerpretazione o fotorestituzione.
comment: This property relates the anomaly type (line, point, poligony anomaly) to an anomaly revealed by a photo interpretation rendering. @en
domain: Tipo di anomalia
label: is anomaly type of @en
range: Anomalia
sub property of: isTypeOf
version info: stable @en
version info: stabile

Tipo di certificazione di esportazione o importazione
type: Class
comment: This class represents the type of export/import certification of a cultural property (e.g.: temporary movement certification, temporary export license, free movement certification, etc.). @en
comment: Questa classe rappresenta il tipo di certificazione amministrativa di circolazione ed esportazione/importazione di un bene culturale (es.: attestato di libera circolazione, licenza di esportazione definitiva, ecc).
label: Export import certification type @en
subclass of: Type
version info: stable @en
version info: stabile
iccd norm tag: ICCD Normativa Trasversale 4.00: TU/ESP/ESPT

è tipo di intervento di
type: ObjectProperty
comment: Questa proprietà collega il tipo di intervento, a fini conservativi o di altro tipo, che ha interessato un bene culturale al relativo intervento.
comment: This property relates the type of intervention on a cultural property to the related intervention. @en
domain: Tipo di intervento
label: is intervention type of @en
range: Intervento
sub property of: isTypeOf
version info: stable @en
version info: stabile

Stampa non più in volume
type: Class
comment: Questa classe rappresenta una stampa che non è più parte integrante della pubblicazione, ma che lo è stata in passato.
comment: This class represents a print that is no longer was a part of a publication. @en
label: Print no longer in publication @en
subclass of: Riproduzione
version info: stable @en
version info: stabile
iccd norm tag: ICCD Normativa S 3: RO/ADL/ADLS

è repertorio di riferimento di
type: ObjectProperty
comment: This is the inverse property of "has reference catalogue". @en
comment: Questa è la proprietà inversa di "ha repertorio di riferimento".
domain: Repertorio
label: is reference catalogue of @en
range: Copia
version info: stable @en
version info: stabile

indirizzo
type: DatatypeProperty
comment: Questa proprietà rappresenta l'indirizzo di riferimento di un agente (persona, organizzazione), inteso come un tipo specifico di contatto presso il quale l'agente è reperibile.
comment: This property represents a specific type of contact at which the agent is available. @en
domain: Agent
label: address @en
range: Literal
sub property of: contatti
version info: stable @en
version info: stabile
iccd norm tag: ICCD Normativa Trasversale 4.00: TU/CDG/CDGI

Ricognizione archeologica
type: Class
comment: This class represents a particular type of survey on a cultural property, that is an archaeological field survey, limited to the surface. @en
comment: Questa classe rappresenta un tipo particolare di indagine su bene culturale, ovvero una ricognizione archeologica, intesa come ricognizione di superficie.
label: Archaeological field survey @en
subclass of: Indagine
subclass of: Restriction
  all values from: Agent
  on property: ha responsabile scientifico dell'indagine
subclass of: Restriction
  all values from: Metodo di indagine
  on property: ha metodo di indagine
subclass of: Restriction
  all values from: Literal
  on property: codice identificativo locale della ricognizione archeologica
subclass of: Restriction
  all values from: Literal
  on property: codice univoco ICCD della ricognizione archeologica
subclass of: Restriction
  all values from: Agent
  on property: ha responsabile dell'attività
subclass of: Restriction
  all values from: Literal
  on property: situazione ambientale
version info: stabile
version info: stable @en
iccd norm tag: ICCD Normativa Trasversale 4.00: RE/RCG

funzione d'uso
type: DatatypeProperty
type: FunctionalProperty
comment: This property represents object function. @en
comment: Questa proprietà rappresenta la funzione che l'oggetto ha o ha avuto.
domain: Funzione d'uso
label: use function @en
range: Literal
version info: stabile
version info: stable @en
iccd norm tag: ICCD Normativa Trasversale: UT/UTU/UTUF - BDM 2.00:UT/UTF - PST 3.01: DA/UTF

Ornamentale
type: Specifiche del tipo d'uso
type: NamedIndividual
comment: This individual represents cultural entity's ornamental use specifications. @en
comment: Questo individuo rappresenta le specifiche d'uso ornamentale di un bene.
label: Ornamental @en
version info: stable @en
version info: stabile

ha autore secondario
type: ObjectProperty
comment: Questa proprietà collega un'entità al suo autore secondario, come ad esempio l'autore di un contributo o una parte di una pubblicazione.
comment: This property relates an entity to its secondary authors. For example an author of a publication's contribution or section. @en
domain: Thing
label: has secondary author @en
range: Agent
sub property of: ha agente correlato
inverse of: è autore secondario di
version info: stable @en
version info: stabile
iccd norm tag: ICCD Normative VeAC e AT 3.01: DO/BSE/BSER

è editore di
type: ObjectProperty
comment: Questa è la proprietà inversa di "ha editore".
comment: This is the inverse property of "has editor". @en
domain: Agent
label: is editor of @en
range: Edizione
sub property of: è agente correlato a
version info: stabile
version info: stable @en

è committenza di
type: ObjectProperty
comment: Questa proprietà collega l'individuazione di una committenza all'entità culturale che è stata commissionata.
comment: This property relates a commission to the cultural entity that was commissioned. @en
domain: Committenza
label: is commission of @en
range: CulturalEntity
sub property of: isSituationOf
version info: stabile
version info: stable @en

ha deposizione funeraria
type: ObjectProperty
comment: This property relates an archaeological excavation to the tomb detected during the survey. @en
comment: Questa proprietà collega uno scavo archeologico alla deposizione funeraria individuata durante l'indagine.
domain: Scavo archeologico
label: has tomb @en
range: Deposizione funeraria
inverse of: è deposizione funeraria di
version info: stable @en
version info: stabile
iccd norm tag: ICCD Normativa Trasversale 4.00: RE/DSC/DSCS

Replica
type: Class
comment: This class represents a copy of a cultural property created by the same author of the original cultural property. @en
comment: Questa classe rappresenta una replica di un bene culturale, cioè una duplicazione dell'originale da parte dello stesso autore.
label: Same author copy @en
subclass of: Copia
version info: stable @en
version info: stabile
iccd norm tag: ICCD Normativa F: RO/CRF/CRFT = 'replica'

ha opera collegata
type: ObjectProperty
comment: Questa proprietà collega un bene culturale a un'altra opera collegata (es.: copia, fase preparatoria, etc.), che può essere essa stessa un bene culturale.
comment: This property relates a cultural property to a related work (e.g. copy, preparatory work). @en
domain: CulturalEntity
label: has related work @en
range: CulturalEntity
inverse of: è opera collegata a
version info: stable @en
version info: stabile

abbreviazione
type: DatatypeProperty
comment: Questa proprietà rappresenta l'abbreviazione che identifica il riferimento bibliografico.
comment: This property represents the abbreviation that identifies the bibliographic reference. @en
domain: Bibliografia
label: abbreviation @en
range: Literal
version info: stabile
version info: stable @en
iccd norm tag: BIBR

has export import certification type
type: ObjectProperty
comment: ha tipo di certificazione di esportazione o importazione
comment: Questa proprietà collega una certificazione amministrativa di circolazione ed esportazione/importazione di un bene culturale alla sua tipologia (es.: attestato di libera circolazione, licenza di esportazione definitiva, ecc).
comment: This property relates a import-export certification of a cultural entity to its type (i.e. delivery confirmation certification, free movement certification etc). @en
domain: Certificazione di importazione o esportazione
range: Tipo di certificazione di esportazione o importazione
sub property of: hasType
inverse of: è tipo di certificazione di esportazione o importazione di
version info: stable @en
version info: stabile
iccd norm tag: ICCD Normativa Trasversale 4.00: TU/ESP/ESPT

ha tipo di documentazione
type: ObjectProperty
comment: This property relates a documentation to its type. @en
comment: Questa proprietà collega una documentazione al tipo di documentazione.
domain: Documentazione
label: has documentation type @en
range: Tipo di documentazione
sub property of: hasType
inverse of: è tipo di documentazione di
version info: stabile
version info: stable @en
iccd norm tag: FTAP, DRAT, FNTP (+VDCP, REGP), ADMP (v. 3.00 e 3.01)

è titolo di
type: ObjectProperty
comment: This property relates a title to the entity to which it is referred. @en
comment: Questa proprietà collega un titolo all'entità cui si riferisce.
domain: Titolo
label: is title of @en
range: Thing
version info: stabile
version info: stable @en
iccd norm tag: OG/SGT/SGTP; SG/SGL/SGLT; SG/SGL/SGLL; OG/SGT/SGTR; DA/AID/AIDN; SG/SGL/SGLA; DA/AID/AIDT; OG/SGT/SGTT; RO/ROF/ROFT; DO/BSE/BSET; DO/BSE/BSEC.

è autore di
type: ObjectProperty
comment: Questa proprietà collega un agent a una entità di qualsiasi tipo (documentazione, bene culturale, etc.) di cui quell'agente è autore.
comment: This property relates an agent to an entity the agent is author of. @en
domain: Agent
label: is author of @en
range: Thing
sub property of: è agente correlato a
property chain axiom: è autore attribuito in
property chain axiom: è attribuzione di autore/responsabilità di
version info: stable @en
version info: stabile

è sede di provenienza di
type: ObjectProperty
comment: This is the inverse property of "has previous location". @en
comment: Questa è la proprietà inversa di "ha sede di provenienza".
domain: CulturalEntity
label: is previous location of @en
range: CulturalEntity
sub property of: è opera collegata a
version info: stable @en
version info: stabile

collocazione precedente dell'opera preparatoria o finale
type: DatatypeProperty
comment: This property represents information relating to ancient or previous location of the work from which the matrix or print is ​​drawn. @en
comment: Questa proprietà rappresenta le informazioni relative all'antica o precedente l'attuale collocazione dell'opera da cui è tratta la matrice o la stampa presso collezioni, palazzi, chiese, ecc., quando questa è segnalata sulla matrice/stampa o sicuramente deducibile dalle fonti bibliografiche.
domain: Opera preparatoria o finale
label: preparatory or final work previous location @en
range: Literal
version info: stabile
version info: stable @en
iccd norm tag: ICCD Normative S, MI 3: RO/ROF/ROFR

ha titolo
type: ObjectProperty
comment: Questa proprietà collega un oggetto al suo titolo. Nel caso del dominio dei beni culturali, può collegare un bene culturale o un'opera collegata al bene culturale perché sua fase finale o preparatoria (proprio, attribuito, parallelo, alternativo), oppure un'edizione al suo titolo (principale o secondario), oppure una serie fotografica al suo titolo, etc.
comment: This property relates an object to its title. @en
domain: Thing
label: has title @en
range: Titolo
inverse of: è titolo di
version info: stabile
version info: stable @en
iccd norm tag: OG/SGT/SGTP; SG/SGL/SGLT; SG/SGL/SGLL; OG/SGT/SGTR; DA/AID/AIDN; SG/SGL/SGLA; DA/AID/AIDT; OG/SGT/SGTT; RO/ROF/ROFT; DO/BSE/BSET; DO/BSE/BSEC.

è ambito culturale di
type: ObjectProperty
comment: This property relates a cultural scope of a cultural entity to the situation where this cultural scope is attributed. @en
comment: Questa proprietà collega l'ambito culturale attribuito a un bene culturale alla situazione in cui è avvenuta tale attribuzione.
domain: Ambito culturale
label: is cultural scope of @en
range: Attribuzione di Ambito Culturale
sub property of: isTopicOf
version info: stable @en
version info: stabile