Comic Book Ontology
type: Ontology
version info: 0.14.1
description: A metadata vocabulary for describing comic books and comic book collections.
preferred namespace uri: http://comicmeta.org/cbo
preferred namespace prefix: cbo
modified: 2015-12-05
rights: Copyright © PD&C, LLC
license: http://creativecommons.org/licenses/by/4.0
creator: Sean Petiya

level
type: AnnotationProperty
comment: The level of description associated with a term.

standard
type: AnnotationProperty
comment: A recommended encoding standard or guidelines.

dcterms:created
type: AnnotationProperty

dcterms:issued
type: AnnotationProperty

preferredNamespacePrefix
type: AnnotationProperty
preferred namespace prefix: The preferred namespace prefix to use when using terms from this vocabulary in an XML document.
qlabel: vann:preferredNamespacePrefix

preferredNamespaceUri
type: AnnotationProperty
comment: The preferred namespace URI to use when using terms from this vocabulary in an XML document.
qlabel: vann:preferredNamespaceUri

label
qlabel: rdfs:label

term status
type: AnnotationProperty
comment: The status of a vocabulary term, expressed as a short symbolic string; known values include 'unstable','testing', 'stable' and 'archaic'.
qlabel: vs:term_status

issue of
type: ObjectProperty
term status: unstable
comment: Links a comic issue to a volume.
domain: Issue
range: Volume
inverse of: issue
sub property of: isPartOf

adaptation
type: ObjectProperty
term status: unstable
comment: Links a comic to an adaptation.
domain: Comic
inverse of: adaptation of
sub property of: hasVersion
range: CreativeWork

adaptation of
type: ObjectProperty
comment: Links a work to the comic work it is an adaptation of.
term status: unstable
range: Comic
domain: Comic
sub property of: isVersionOf

appearance
type: ObjectProperty
comment: Describes the appearance of a comic universe element within a comic work.
term status: unstable
domain: Comic
range: Thing

artist
type: ObjectProperty
comment: Associates an artist with a comic work.
term status: unstable
domain: Comic
range: Contributor
sub property of: contributor

artwork
type: ObjectProperty
term status: unstable
comment: Links a comic page to its original artwork.
range: Artwork
domain: Page

artwork of
type: ObjectProperty
comment: Links orginal comic artwork to a page.
term status: unstable
domain: Artwork
range: Page
inverse of: artwork

artwork type
type: ObjectProperty
term status: unstable
comment: Describes the artwork type of one or more pages of comic art.

attribute
type: ObjectProperty
comment: Describes a physical attribute of a comic item.
term status: unstable
range: Attribute
domain: PhysicalObject

bagged
type: ObjectProperty
term status: unstable
comment: Describes the bag in which a comic is contained.
description: Having this property implies that the comic is bagged.
domain: Copy
range: Material
sub property of: attribute

balloon
type: ObjectProperty
comment: Links a panel to a word balloon.
range: Balloon
domain: Panel
sub property of: sequence

binding
type: ObjectProperty
comment: Describes the binding of a comic issue.
term status: unstable
range: Binding
domain: Issue
sub property of: material

boarded
type: ObjectProperty
comment: Describes the backing board of a comic.
description: Having this property implies that the comic is boarded.
term status: unstable
domain: Copy
range: Material
sub property of: attribute

box
type: ObjectProperty
comment: Associates a box with a comic book collection.
term status: unstable
range: Box
domain: Collection
sub property of: hasPart

cameo
type: ObjectProperty
term status: unstable
comment: Describes a cameo appearance by a comic character in a comic work.
range: Character
domain: Comic
sub property of: character

caption
type: ObjectProperty
comment: Links a panel to a caption.
term status: unstable
range: Caption
domain: Panel
sub property of: sequence

character
type: ObjectProperty
comment: Describes the appearance of a comic character in a comic work.
term status: unstable
range: Character
domain: Comic
sub property of: appearance

collected in
type: ObjectProperty
comment: Links a comic work to another work that reprints it as part of a comprehensive collection of reprinted material.
term status: unstable
domain: Issue
range: Issue
inverse of: collects
sub property of: reprinted in

collection
type: ObjectProperty
term status: unstable
comment: Links a collector to a collection.
range: Collection
domain: Collector

collects
type: ObjectProperty
term status: unstable
comment: Links a comic issue to another work that reprints it as part of a comprehensive collection of reprinted material.
range: Issue
domain: Issue
sub property of: reprints
sub property of: hasPart

colorist
type: ObjectProperty
term status: unstable
comment: Associates a colorist with a comic work.
domain: Comic
range: Contributor
sub property of: contributor

comic age
type: ObjectProperty
comment: Associates a comic with an era of comic book history.
term status: unstable
domain: Comic
range: Comic Age

condition
type: ObjectProperty
comment: Describes the physical condition of a comic item.
term status: unstable
range: Condition
domain: Copy

contains
type: ObjectProperty
term status: unstable
comment: Describes the contents of a box of comics.
domain: Container
range: Copy

contributor
type: ObjectProperty
term status: unstable
comment: Associates a contributor with a comic work.
domain: Comic
range: Contributor
sub property of: contributor

copy
type: ObjectProperty
term status: unstable
comment: Links a comic issue to a specific copy.
range: Copy
domain: Issue
inverse of: copy of

copy of
type: ObjectProperty
comment: Links a specific copy to a comic issue.
term status: unstable
domain: Copy
range: Issue

copy state
type: ObjectProperty
comment: Describes the physical state of a copy of a comic issue.
term status: unstable
domain: Copy
range: State

country
type: ObjectProperty
term status: unstable
comment: Links a comic series to its country of origin.
domain: Series
range: Thing

cover art
type: ObjectProperty
term status: unstable
comment: Describes the cover art of a comic issue.
domain: Issue
range: Page

cover artist
type: ObjectProperty
comment: Associates an artist with cover artwork for a comic.
term status: unstable
domain: Comic
range: Contributor
sub property of: artist

creator
type: ObjectProperty
term status: unstable
comment: Associates a creator with a comic work.
domain: Comic
domain: Comic Universe
range: Creator
sub property of: creator

distributed by
type: ObjectProperty
comment: Links a comic series to a distributor.
term status: unstable
range: Distributor
domain: Publication

edition
type: ObjectProperty
comment: Describes the edition of a comic issue.
term status: unstable
range: Edition
domain: Issue

editor
type: ObjectProperty
comment: Associates an editor with a comic work.
term status: unstable
domain: Comic
range: Contributor
sub property of: contributor

encased
type: ObjectProperty
comment: Describes the case in which a comic is encapsulated.
description: Having this property implies that the comic is encapsulated.
term status: unstable
domain: Copy
range: Material
sub property of: attribute

event
type: ObjectProperty
term status: unstable
comment: Describes a comic universe event depicted in a comic work.
domain: Comic
range: Event

format
type: ObjectProperty
term status: unstable
comment: Describes the format of a comic work.
range: Format
domain: Publication

genre
type: ObjectProperty
term status: unstable
comment: Describes the genre of a comic work.
domain: Comic
range: Genre

grade
type: ObjectProperty
term status: unstable
comment: Describes the grade assigned to a comic item by a guarantor.
domain: Copy
range: Grade

guaranteed by
type: ObjectProperty
term status: unstable
comment: Links a graded copy of a comic issue to a guarantor.
domain: Copy
range: Guarantor

imprint
type: ObjectProperty
term status: unstable
comment: Associates a comic publisher with an imprint.
range: Imprint
domain: Publisher
inverse of: imprint of

imprint of
type: ObjectProperty
comment: Associates an imprint with a comic publisher.
term status: unstable
domain: Imprint
range: Publisher

in box
type: ObjectProperty
comment: Links a comic item to a box.
term status: unstable
range: Box
domain: Copy
inverse of: contains

inker
type: ObjectProperty
term status: unstable
comment: Associates an inker with a comic work.
domain: Comic
range: Contributor
sub property of: contributor

issue
type: ObjectProperty
term status: unstable
comment: Links a volume of comics to an issue.
range: Issue
domain: Volume
sub property of: hasPart

item
type: ObjectProperty
term status: unstable
comment: Links a comic book collection to an item.
domain: Collection
range: Item
inverse of: item of
sub property of: hasPart

item of
type: ObjectProperty
term status: unstable
comment: Links an item to a comic book collection.
range: Collection
domain: Item
sub property of: isPartOf

language
type: ObjectProperty
term status: unstable
comment: Decribes the language of a comic series.
domain: Series
sub property of: language
range: Thing

letterer
type: ObjectProperty
term status: unstable
comment: Associates a letterer with a comic work.
domain: Comic
range: Contributor
sub property of: contributor

material
type: ObjectProperty
term status: unstable
comment: Describes the material of which a physical item is composed.
range: Material
domain: PhysicalObject

object
type: ObjectProperty
comment: Describes the appearance of a comic object in a comic work.
term status: unstable
domain: Comic
range: Object
sub property of: appearance

owner
type: ObjectProperty
comment: Links an item or collection to the agent that owns it.
term status: unstable
domain: Collection
domain: Item
range: Agent

owner of
type: ObjectProperty
term status: unstable
comment: Links an agent to an owned item or collection.
range: Collection
range: Item
domain: Agent

page
type: ObjectProperty
comment: Links a comic page to a document.
term status: unstable
domain: Document
range: Page

page type
type: ObjectProperty
term status: unstable
comment: Describes the type of one or more comic pages.
domain: Page
range: Page Type

panel
type: ObjectProperty
comment: Links a sequence to a comic panel.
term status: unstable
range: Panel
domain: Sequence
sub property of: sequence

paper
type: ObjectProperty
comment: Describes the paper stock of a comic issue.
term status: unstable
domain: Issue
range: Paper
sub property of: material

penciller
type: ObjectProperty
term status: unstable
comment: Associates a penciller with a comic work.
domain: Comic
range: Contributor
sub property of: contributor

plotter
type: ObjectProperty
comment: Associates a plotter with a comic work.
term status: unstable
sub property of: contributor

preview
type: ObjectProperty
comment: Links a comic issue to a preview or sample of that work.
term status: unstable
range: Issue
domain: Issue

publication frequency
type: ObjectProperty
term status: unstable
comment: The publication frequency of a comic.
range: Frequency
domain: Volume

publisher
type: ObjectProperty
comment: Links a publisher to a comic publication.
term status: unstable
range: Publisher
domain: Series
sub property of: publisher

quality
type: ObjectProperty
term status: unstable
comment: Describes a distinctive quality of an object.
range: Quality
domain: PhysicalObject

rating
type: ObjectProperty
term status: unstable
comment: The rating of a comics publication.
domain: Publication
range: Thing

related
type: ObjectProperty
comment: Links a comic to a related object.
term status: unstable
domain: Comic
range: Thing

reprinted in
type: ObjectProperty
comment: Links a comic issue to a work that reprints it.
term status: unstable
range: Issue
domain: Issue
inverse of: reprints
sub property of: hasVersion

reprints
type: ObjectProperty
term status: unstable
comment: Links a comic to the original work it reprints.
range: Issue
domain: Issue
sub property of: isVersionOf

role
type: ObjectProperty
comment: Describes the role of a contributor in the creation of a comic work.
term status: unstable
domain: Contributor
range: Role

sequence
type: ObjectProperty
comment: Links a sequence to a page.
term status: unstable
domain: Page
range: Sequence

series
type: ObjectProperty
comment: Links a comic to a series.
term status: unstable
domain: Comic
range: Series
sub property of: hasPart

series of
type: ObjectProperty
comment: Links a series to a comic work.
term status: unstable
range: Publication
domain: Series
inverse of: series
sub property of: isPartOf

state
type: ObjectProperty
comment: Describes the physical state of a comic item.
term status: unstable
domain: Copy
range: State
domain: PhysicalObject

story
type: ObjectProperty
comment: Links a comic issue to a story.
term status: unstable
domain: Issue
range: Story
sub property of: hasPart

story arc
type: ObjectProperty
comment: Links a comic story to a story arc.
term status: unstable
range: Story
domain: Story
sub property of: hasPart

has story
type: ObjectProperty
comment: Connects an individual story to the story arc it is a part of.
term status: unstable
domain: Story
range: Story
inverse of: story arc
sub property of: isPartOf

subject
type: ObjectProperty
term status: unstable
comment: The subject of a comic story.
domain: Story
range: Thing

team
type: ObjectProperty
term status: unstable
comment: Describes the appearance of a team of comic characters in a comic work.
domain: Comic
range: Team
sub property of: appearance

translation
type: ObjectProperty
comment: Links a comic issue to a translation.
term status: unstable
range: Issue
domain: Issue
inverse of: translation of
sub property of: hasVersion

translation of
type: ObjectProperty
term status: unstable
comment: Links a comic issue to the issue it is a translation of.
range: Issue
domain: Issue
sub property of: isVersionOf

universe
type: ObjectProperty
term status: unstable
comment: Links a thing to a comic universe.
range: Comic Universe
domain: Thing

universe of
type: ObjectProperty
comment: Links a comic universe to the universe from which it originates.
term status: unstable
domain: Comic Universe
range: Comic Universe

variant
type: ObjectProperty
comment: Links a comic issue to a variant.
term status: unstable
range: Issue
domain: Issue
inverse of: variant of
sub property of: hasVersion

variant of
type: ObjectProperty
comment: Links a comic issue to the issue it is a variant of.
term status: unstable
domain: Issue
range: Issue
sub property of: isVersionOf

volume
type: ObjectProperty
term status: unstable
comment: Links a series to a comic volume.
domain: Series
range: Volume
sub property of: hasPart

volume of
type: ObjectProperty
comment: Links a volume to a comic series.
term status: unstable
range: Series
domain: Volume
inverse of: volume
sub property of: isPartOf

writer
type: ObjectProperty
term status: unstable
comment: Associates a writer with a comic work.
domain: Comic
range: Contributor
sub property of: contributor

contributor
type: ObjectProperty
description: Used to associate a contributor with any creative work.

alternative title
type: DatatypeProperty
comment: An alternative title for any comic work.
term status: unstable
domain: Comic
sub property of: alternative
range: Literal

CCA
type: DatatypeProperty
term status: unstable
comment: Comics Code Authority (CCA) approved.
domain: Issue
range: boolean

certificate number
type: DatatypeProperty
comment: The certificate number assigned to a graded copy of a comic by a guarantor.
term status: unstable
domain: Copy
sub property of: identifier
range: Literal

copyright date
type: DatatypeProperty
comment: The copyright date of a comic issue.
term status: unstable
domain: Issue
sub property of: date
range: Literal

cover date
type: DatatypeProperty
term status: testing
comment: The cover date of a comic issue.
domain: Issue
sub property of: date
range: Literal

coverPrice
type: DatatypeProperty
comment: The cover price of a comic issue.
term status: unstable
domain: Issue
sub property of: price
range: Literal

Diamond code
type: DatatypeProperty
term status: unstable
comment: A Diamond Comic Distributors code.
domain: Publication
sub property of: distributor code
range: Literal

distributor code
type: DatatypeProperty
term status: unstable
comment: The distributor code associated with a comics publication.
domain: Publication
sub property of: identifier
range: Literal

end year
type: DatatypeProperty
term status: unstable
comment: The date a comic ended publication.
domain: Publication
sub property of: date
range: Literal

feature
type: DatatypeProperty
comment: Describes the feature or primary focus of a comic work.
term status: unstable
domain: Comic
range: Literal

imprint name
type: DatatypeProperty
comment: The name of a comic imprint.
term status: unstable
domain: Imprint
sub property of: name
range: Literal

indicia frequency
type: DatatypeProperty
comment: The publication frequency of a comic as printed in the indicia of an issue.
term status: unstable
domain: Issue
range: Literal

indicia publisher
type: DatatypeProperty
term status: unstable
comment: The publisher name as printed in the indicia of a comic issue.
domain: Issue
range: Literal

ISBN
type: DatatypeProperty
comment: The ISBN of a comic publication.
term status: unstable
sub property of: isbn

issue count
type: DatatypeProperty
comment: The total number of issues in a volume of comics.
domain: Volume
range: integer
sub property of: topDataProperty

issueNumber
type: DatatypeProperty
comment: The number of a comic issue.
term status: testing
domain: Issue
sub property of: identifier
range: Literal

item number
type: DatatypeProperty
comment: An unique identifier assigned to a comic item.
term status: unstable
domain: Issue
sub property of: identifier
range: Literal

note
type: DatatypeProperty
comment: A note.
term status: unstable
range: Literal
domain: Thing

on-sale date
type: DatatypeProperty
term status: testing
comment: The date of availability of a comic issue.
domain: Issue
sub property of: date
range: Literal

page count
type: DatatypeProperty
comment: The number of pages in a comic issue.
term status: unstable
domain: Document
domain: Story
range: Literal
sub property of: topDataProperty

page count
type: DatatypeProperty
comment: The page number of a comic.
domain: Page
range: Literal

price
type: DatatypeProperty
comment: A general price.
term status: unstable

printing
type: DatatypeProperty
type: FunctionalProperty
comment: The numerical print run of a comic issue.
term status: unstable
domain: Issue
range: Literal

publication date
type: DatatypeProperty
term status: testing
comment: The date a comic issue was published.
domain: Issue
sub property of: date
range: Literal

publisher name
type: DatatypeProperty
comment: The name of a comic publisher.
term status: testing
domain: Publisher
sub property of: name
range: Literal

purchase price
type: DatatypeProperty
comment: The purchase price of a comic item.
term status: unstable
domain: Item
sub property of: price
range: Literal

sale price
type: DatatypeProperty
comment: The sale price of a comic item.
term status: unstable
domain: Item
sub property of: price
range: Literal

series title
type: DatatypeProperty
term status: testing
comment: The title of a comic series.
domain: Series
sub property of: title
range: Literal

series year
type: DatatypeProperty
comment: The year a comic series began publication.
term status: unstable
domain: Series
sub property of: start year
range: Literal

start year
type: DatatypeProperty
comment: The date a comic began publication.
term status: unstable
domain: Publication
sub property of: date
range: Literal

story title
type: DatatypeProperty
term status: unstable
comment: The title of a comic story.
domain: Story
sub property of: title
range: Literal

synopsis
type: DatatypeProperty
comment: The synopsis of a comic story.
term status: unstable
domain: Story
range: Literal

tracking
type: DatatypeProperty
term status: unstable
comment: Describes the tracking or numbering between comic series.
domain: Series
range: Literal

UPC
type: DatatypeProperty
term status: unstable
comment: The UPC of a comic publication.
domain: Publication
sub property of: identifier
range: Literal

value
type: DatatypeProperty
comment: The estimated value of a comic item.
term status: unstable
domain: Copy
range: Literal

variance
type: DatatypeProperty
comment: Any variance to the regular manifestation of a comic issue.
term status: unstable
domain: Issue
range: Literal

volumeNumber
type: DatatypeProperty
comment: The unique identifier of a comic volume.
term status: testing
domain: Volume
sub property of: identifier
range: Literal

alternative
type: DatatypeProperty
comment: An alternative title.
description: Used to indicate an alternative title for a resource.
range: Literal
domain: Thing

description
type: DatatypeProperty
comment: A description.
description: Used to provide a description for any resource.
range: Literal
domain: Thing

identifier
type: DatatypeProperty
comment: An identifier.
description: Any unique identifier of a comic resource.
range: Literal
domain: Thing

title
type: DatatypeProperty
comment: A title.
range: Literal
domain: Thing

name
type: DatatypeProperty
comment: A name.
description: Used to describe the name of an agent.
range: Literal
domain: Agent

SKU
type: DatatypeProperty
description: The SKU of a comics product.
domain: Product
range: Literal

url
type: DatatypeProperty
comment: A URL.
description: Used to indicate web content related to a resource.
range: Literal
domain: Thing

Agent
type: Class
subclass of: Thing
term status: unstable
comment: A person, organization, or intelligence in a comic universe.

Artwork
type: Class
subclass of: Item
subclass of: IndividualProduct
comment: Original comic artwork.
term status: unstable

Balloon
type: Class
subclass of: Sequence
term status: unstable
comment: A word balloon containing dialogue or thought.

Binding
type: Class
subclass of: Material
comment: A binding method or material used to bind the pages of a comic.
term status: unstable

Box
type: Class
subclass of: Container
comment: A box that contains comic books.
term status: unstable

Building
type: Class
subclass of: Object
comment: A building in a comic universe.
term status: unstable

Caption
type: Class
subclass of: Sequence
term status: unstable
comment: A caption containing narration.

Character
type: Class
subclass of: Agent
term status: unstable
comment: A comic character.

Collection
type: Class
subclass of: Collection
term status: unstable
comment: A collection of comic books and related resources.

Collector
type: Class
subclass of: Person
term status: unstable
comment: A comic book collector.

Comic
type: Class
subclass of: CreativeWork
comment: A visual and literary work of sequential art.
term status: testing

Comic Age
type: Class
subclass of: Intangible
term status: unstable
comment: A period of comic book history.

Comic Universe
type: Class
subclass of: CreativeWork
comment: A comic universe.
term status: unstable

Condition
type: Class
subclass of: Attribute
comment: A physical condition describing an object.
term status: unstable

Container
type: Class
subclass of: PhysicalObject
comment: An object containing comic books.
term status: unstable

Contributor
type: Class
subclass of: Person
term status: unstable
comment: An agent contributing to the creation of a comic work.

Copy
type: Class
subclass of: Issue
subclass of: Item
subclass of: IndividualProduct
term status: unstable
comment: A copy of a comic issue.

Costume
type: Class
subclass of: Object
term status: unstable
comment: A comic character's costume.

Creator
type: Class
subclass of: Person
term status: unstable
comment: An agent primarily responsible for the creation of a comic work.

Distributor
type: Class
subclass of: Organization
comment: An agent responsible for the distribution of a comic publication.
term status: unstable

Document
type: Class
subclass of: Comic
comment: A document composed of the pages in a comic publication.
term status: unstable

Edition
type: Class
subclass of: Intangible
term status: unstable
comment: An edition of a comic issue.

Event
type: Class
subclass of: Thing
comment: An event in a comic universe.
term status: unstable

Format
type: Class
subclass of: Intangible
comment: A format in which a comic is embodied.
term status: unstable

Frequency
type: Class
subclass of: Intangible
term status: unstable
comment: A frequency with which a comic is published.

Genre
type: Class
subclass of: Intangible
comment: A comics genre.
term status: unstable

Grade
type: Class
subclass of: Intangible
term status: unstable
comment: A grade assigned to a comic item that represents a summary of its condition.

Guarantor
type: Class
subclass of: Organization
comment: An organization that guarantees the stated condition of a comic book.
term status: unstable

Imprint
type: Class
subclass of: Publisher
term status: unstable
comment: An imprint or tradename of a comic publisher.

Issue
type: Class
subclass of: Publication
subclass of: Product
subclass of: PublicationIssue
term status: unstable
comment: An issue of a comic publication.

Item
type: Class
comment: A physical or digital item.
term status: unstable

Library
type: Class
subclass of: Organization
term status: unstable
comment: A physical or digital library containing a collection of comic resources.

Location
type: Class
subclass of: Thing
comment: A location in a comic universe.
term status: unstable

Material
type: Class
subclass of: Attribute
comment: A material or medium of which an object is composed.
term status: unstable

Museum
type: Class
subclass of: Organization
term status: unstable
comment: A physical or digital museum exhibiting a collection of comic resources.

Object
type: Class
subclass of: Thing
term status: unstable
comment: An object in a comic universe.

Page
type: Class
subclass of: Document
comment: One or more pages in a comic document.
term status: unstable

Page Type
type: Class
subclass of: Intangible
comment: A type of page appearing in a comic document.
term status: unstable

Panel
type: Class
subclass of: Sequence
term status: unstable
comment: A visual frame containing part of a sequence.

Paper
type: Class
subclass of: Material
term status: unstable
comment: A paper stock on which a comic is printed.

Pedigree
type: Class
subclass of: Collection
term status: unstable
comment: An exceptional original owner collection of high quality, vintage comic books often containing copies that are considered exemplars of key issues.

Attribute
type: Class
term status: unstable
comment: An physical attribute or property of an item.

Planet
type: Class
subclass of: Location
comment: A planetary body in a comic universe.
term status: unstable

Plastic
type: Class
subclass of: Material
term status: unstable
comment: A plastic of which a supply item is composed.

Publication
type: Class
subclass of: Comic
comment: A comics publication.
term status: unstable

Publisher
type: Class
subclass of: Organization
comment: An agent responsible for the publication of a comic.
term status: unstable

Quality
type: Class
subclass of: Attribute
term status: unstable
comment: A distinctive quality belonging to an object.

Role
type: Class
subclass of: Intangible
comment: A creative role in the production of a comic work.
term status: unstable

Sequence
type: Class
subclass of: Comic
comment: A visual sequence of juxtaposed panels and pictorial elements.
term status: unstable

Series
type: Class
subclass of: Publication
subclass of: Periodical
term status: unstable
comment: A comic publication containing one or more volumes and issues.

State
type: Class
subclass of: Attribute
comment: A physical state describing an object.
term status: unstable

Story
type: Class
subclass of: Comic
comment: A comic story.
term status: unstable

Team
type: Class
subclass of: Agent
comment: A group of comic characters.
term status: unstable

Thing
type: Class
subclass of: Comic Universe
comment: A thing in a comic universe.
term status: unstable

Vehicle
type: Class
subclass of: Object
comment: A vehicle in a comic universe.
term status: unstable

Volume
type: Class
subclass of: Publication
subclass of: PublicationVolume
comment: A single issue or group of issues published in a comic series.
term status: unstable

Collection
type: Class
qlabel: dctype:Collection

PhysicalObject
type: Class
qlabel: dctype:PhysicalObject

CreativeWork
type: Class
qlabel: schema:CreativeWork

IndividualProduct
type: Class
subclass of: Product
qlabel: schema:IndividualProduct

Intangible
type: Class
qlabel: schema:Intangible

Organization
type: Class
subclass of: Agent
comment: An organization.
qlabel: schema:Organization

Periodical
type: Class
subclass of: CreativeWork
qlabel: schema:Periodical

Person
type: Class
subclass of: Agent
comment: A person.
qlabel: schema:Person

Product
type: Class
qlabel: schema:Product

PublicationIssue
type: Class
subclass of: CreativeWork
qlabel: schema:PublicationIssue

PublicationVolume
type: Class
subclass of: CreativeWork
qlabel: schema:PublicationVolume

Agent
type: Class
qlabel: foaf:Agent
comment: An agent.

Sean Petiya
type: NamedIndividual