comment: This is an entity positioning annotation generated by CoModIDE (https://comodide.com/). Removing this annotation will break rendering the CoModIDE schema diagram view.
entity position x: 270.6598611213299
entity position y: 230.17239798563722

Standard rules application
type: DatatypeProperty
comment: Are the standard rules applied directly without and instead of the start of negotiations with a Special Negotiating Body (SNB)? Instead of an SNB being set up, the standard rules are applied instead. - Yes: the standard rules are applied; - No: standard rules ar enot applied; - Not applicable: the conditions are not met (e.g. no employees, BLER threshold not met) for this criterion to be applicable; - Unclear: the wording of the document is unclear with regard to the impact/effect/measures taken; - Not mentioned: given the parameters, this aspect should be addressed in the transaction document, but is not mentioned
domain: Company transaction
range: string

Non-EEA country
type: Class
comment: A country which does not belong to the European Economic Area (EEA).
subclass of: Non-EU country

Employee works council
type: Class
comment: The exercise of employee participation through the representation of employees vis-a-vis the management of a company. The works council is a shop-floor level representation mechanism with information, consultation and veto-rights - depending on the extent of rights given in a Member State - and also at EU level through European Works Councils.
subclass of: Organisational unit
subclass of: Organisation
subclass of: Stakeholder in a company
subclass of: Restriction
  on property: has member
  some values from: Company employee
subclass of: Restriction
  on property: part of
  some values from: Company

comment: This is an entity positioning annotation generated by CoModIDE (https://comodide.com/). Removing this annotation will break rendering the CoModIDE schema diagram view.
entity position x: 261.3991187414414
entity position y: 216.3773275625499

comment: This is an entity positioning annotation generated by CoModIDE (https://comodide.com/). Removing this annotation will break rendering the CoModIDE schema diagram view.
entity position x: 164.92255628203452
entity position y: 195.7746040140031

Finland
type: EU country
type: NamedIndividual
label: Suomi @fi
iso2code: FI

Special negotiating body agreement
type: Class
comment: A written agreement concerning the involvement of employees in company transactions. Special Negotiating Body (SNB) organisation represents employees in the negotiation of the terms of this agreement with the company authorities. The agreement must be reached in accordance with the EU Company Law Directive and is laid down in the SNB-agreement.
subclass of: Transaction document

comment: This is an entity positioning annotation generated by CoModIDE (https://comodide.com/). Removing this annotation will break rendering the CoModIDE schema diagram view.
entity position x: 233.50701415067806
entity position y: 84.30831286232869

Creditor information right
type: Class
comment: The information rights of creditors in the context of a company transaction, which includes for instance access to documents.
subclass of: Creditor right

comment: This is an entity positioning annotation generated by CoModIDE (https://comodide.com/). Removing this annotation will break rendering the CoModIDE schema diagram view.
entity position x: 145.31812860041032
entity position y: 8.472621286432489

Company pre-division certificate
type: Class
comment: Article 160o: a pre-division certificate attests compliance with all the relevant conditions and the proper completion of all procedures and formalities in the Member State concerned.
subclass of: Company transaction certificate

comment: This is an entity positioning annotation generated by CoModIDE (https://comodide.com/). Removing this annotation will break rendering the CoModIDE schema diagram view.
entity position x: 159.42172416207433
entity position y: 289.50172216822966

Cross-border company mobility organisation relation
type: ObjectProperty
comment: (cbcmOrganisationRelation ?ENTITY1 ?ENTITY2) means that the relation between ?ENTITY1 and ?ENTITY2 captures information pertaining to an organisation.
sub property of: Cross-border company mobility entity relation

part of
type: ObjectProperty
comment: (partOf ?ENTITY1 ?ENTITY2) means (hasPart ?ENTITY2 ?ENTITY1)
sub property of: Cross-border company mobility entity relation

comment: This is an entity positioning annotation generated by CoModIDE (https://comodide.com/). Removing this annotation will break rendering the CoModIDE schema diagram view.
entity position x: 290.78934613918614
entity position y: 285.13237477555566

Republic of Latvia
type: EU country
type: NamedIndividual
label: Latvijas Republika @lv
label: Latvija @lv
label: Latvia
iso2code: LV

comment: This is an entity positioning annotation generated by CoModIDE (https://comodide.com/). Removing this annotation will break rendering the CoModIDE schema diagram view.
entity position x: 149.56315097749217
entity position y: 239.14678840881578

Kingdom of Denmark
type: EU country
type: NamedIndividual
label: Denmark
label: Danmark @dk
iso2code: DK

comment: This is an entity positioning annotation generated by CoModIDE (https://comodide.com/). Removing this annotation will break rendering the CoModIDE schema diagram view.
entity position x: 41.13541617905973
entity position y: 11.028683306666812

has document source
type: ObjectProperty
comment: In which document did the researcher find information about the transaction?
domain: Company transaction
range: Company mobility document
sub property of: Cross-border company mobility entity relation

comment: This is an entity positioning annotation generated by CoModIDE (https://comodide.com/). Removing this annotation will break rendering the CoModIDE schema diagram view.
entity position x: 140.1633297609779
entity position y: 87.43539384190532

Total EU employees
type: DatatypeProperty
comment: total number of employees of the acquiring company in the EU at the moment of the transaction
domain: Company transaction
range: nonNegativeInteger

comment: This is an entity positioning annotation generated by CoModIDE (https://comodide.com/). Removing this annotation will break rendering the CoModIDE schema diagram view.
entity position x: 56.28944966538015
entity position y: 280.96796660163295

comment: This is an entity positioning annotation generated by CoModIDE (https://comodide.com/). Removing this annotation will break rendering the CoModIDE schema diagram view.
entity position x: 102.97791164894174
entity position y: 220.50340919371476

Company mobility document
type: Class
comment: A legal document which provides information related to, or influencing, a company's mobility within a specific country or across national boundaries.
subclass of: BFO_0000030

comment: This is an entity positioning annotation generated by CoModIDE (https://comodide.com/). Removing this annotation will break rendering the CoModIDE schema diagram view.
entity position x: 130.95486209419764
entity position y: 146.4880897944417

comment: This is an entity positioning annotation generated by CoModIDE (https://comodide.com/). Removing this annotation will break rendering the CoModIDE schema diagram view.
entity position x: 81.75626708582863
entity position y: 128.8863631880492

authored by
type: ObjectProperty
comment: (authoredBy ?ENTITY1 ?ENTITY2) means that ?ENTITY1 is an instance of a publication that is created primarily by the entity referred to by ?ENTITY2.
domain: Company mobility document
range: Class
  union of: Organisation
  union of: Person
sub property of: Cross-border company mobility document relation
Example: (authoredBy independentExpertReport1 independentExpert1)
inverse of: authors

Company employee
type: Class
comment: The workforce of a company. An employee is a party to an employment relationship characterised as a contract of employment (or contract of service) between the employer and employee. However, this is only one of several different legal formulations of the concept of ‘worker’ in the EU which differ between Member States.
subclass of: Person
subclass of: Stakeholder in a company
equivalent class: Class
  intersection of: Person
  intersection of: Restriction
    on property: employed by
    some values from: Thing

comment: This is an entity positioning annotation generated by CoModIDE (https://comodide.com/). Removing this annotation will break rendering the CoModIDE schema diagram view.
entity position x: 290.1721926344435
entity position y: 101.7341322933415

comment: This is an entity positioning annotation generated by CoModIDE (https://comodide.com/). Removing this annotation will break rendering the CoModIDE schema diagram view.
entity position x: 209.24203764870728
entity position y: 27.153209016526702

comment: This is an entity positioning annotation generated by CoModIDE (https://comodide.com/). Removing this annotation will break rendering the CoModIDE schema diagram view.
entity position x: 39.26582493769651
entity position y: 20.559888062141415

comment: This is an entity positioning annotation generated by CoModIDE (https://comodide.com/). Removing this annotation will break rendering the CoModIDE schema diagram view.
entity position x: 182.4609448874594
entity position y: 175.2035610509981

The Netherlands
type: EU country
type: NamedIndividual
label: Netherlands
label: Nederland @nl
label: Holland
iso2code: NL

NAT registration number
type: DatatypeProperty
comment: The national registration number of an acquiring/receiving/entry company. A company registration number is a unique combination of numbers and/or letters. It is used to identify a company and verify its legal existence as an incorporated entity.
domain: Company
range: string

Person
type: Class
comment: A person is an object that has certain capacities or attributes constituting personhood. A human being that has existed or continues to exist in the world (either deceased or living). Fictional human beings cannot be instances of this class.
subclass of: Agent

comment: This is an entity positioning annotation generated by CoModIDE (https://comodide.com/). Removing this annotation will break rendering the CoModIDE schema diagram view.
entity position x: 240.0027724881138
entity position y: 111.43258260074302

Board resolution
type: Class
comment: A Board Resolution, or Company Resolution, is a way of documenting a decision made by a Company's Board of Directors on behalf of the company. After the resolution is made during a meeting, a Board Resolution document is typically used to get the specifics of the resolution in writing.
subclass of: Resolution

Company merger plan
type: Class
comment: Article 91: The administrative or management bodies of the merging companies shall draw up draft terms of merger in writing by specifying at least the elements mentioned in article 91.
subclass of: Transaction document

Company pre-merger certificate
type: Class
comment: Article 127: a pre-merger certificate attests compliance with all the relevant conditions and the proper completion of all procedures and formalities in the Member State of the merging company.
subclass of: Company transaction certificate

Company seat transfer
type: Class
comment: The act of changing the location where the company’s business was managed (registered office or headquarters) or the place where that company’s primary business was actually conducted (central administration).
subclass of: Company transaction
subclass of: Restriction
  on class: Transfer of company central administration
  on property: has sub procedure
  qualified cardinality: 1
subclass of: Restriction
  on class: Transfer of company registered office
  on property: has sub procedure
  qualified cardinality: 1
subclass of: Restriction
  on class: Company
  on property: has transaction input
  qualified cardinality: 1
subclass of: Restriction
  on class: Company
  on property: has transaction result
  qualified cardinality: 1
subclass of: Restriction
  on property: requires document
  some values from: Company seat transfer plan
subclass of: Restriction
  on property: source country
  some values from: Country
subclass of: Restriction
  on property: target country
  some values from: Country
equivalent class: Class
  intersection of: Company transaction
  intersection of: Restriction
    on class: Company
    on property: has transaction input
    qualified cardinality: 1
  intersection of: Restriction
    on class: Company
    on property: has transaction result
    qualified cardinality: 1
  intersection of: Restriction
    on class: Central Administration
    on property: involves the change of
    qualified cardinality: 1
  intersection of: Restriction
    on class: Registered office
    on property: involves the change of
    qualified cardinality: 1

comment: This is an entity positioning annotation generated by CoModIDE (https://comodide.com/). Removing this annotation will break rendering the CoModIDE schema diagram view.
entity position x: 222.20200062208355
entity position y: 9.301752353902469

Shareholder information right
type: Class
comment: It is particularly important that the shareholders of the companies involved in a transaction be kept adequately informed in an objective manner, and that their rights be suitably protected. This includes for instance the availability of documents for inspection by shareholders (e.g. article 97 of Directive 2017/1132).
subclass of: Shareholder right

Domestic company conversion
type: Class
comment: A domestic conversion is an operation through which a company's form is converted into a another while still remaining governed by the same law as the original company. For instance, the modification of a company's form from a public to a private limited company.
subclass of: Company conversion
subclass of: Restriction
  on class: Country
  on property: involves country
  qualified cardinality: 1

comment: This is an entity positioning annotation generated by CoModIDE (https://comodide.com/). Removing this annotation will break rendering the CoModIDE schema diagram view.
entity position x: 108.15208532227724
entity position y: 178.8167600210412

comment: This is an entity positioning annotation generated by CoModIDE (https://comodide.com/). Removing this annotation will break rendering the CoModIDE schema diagram view.
entity position x: 66.72994749890702
entity position y: 29.763459687986888

Germany
type: EU country
type: NamedIndividual
label: Deutschland @de
iso2code: DE

comment: This is an entity positioning annotation generated by CoModIDE (https://comodide.com/). Removing this annotation will break rendering the CoModIDE schema diagram view.
entity position x: 92.06451662706473
entity position y: 273.0177715932372

Social right
type: Class
comment: Social rights, as opposed to rights arising from natural law, are rights for legal entities that entitle them to certain levels of societal living conditions (e.g. the right to housing, to food, to health care etc.)
subclass of: Transaction right
subclass of: Restriction
  on property: applicable to
  some values from: Company employee

comment: This is an entity positioning annotation generated by CoModIDE (https://comodide.com/). Removing this annotation will break rendering the CoModIDE schema diagram view.
entity position x: 165.18606165349766
entity position y: 243.95669794464655

country has company form
type: ObjectProperty
comment: (countryHasCompanyForm ?ENTITY1 ?ENTITY2) means that ?ENTITY1 refers to a country the corporate law in that country permits and / or has occurrences of companies in that country which have the corporate legal structure (company legal form) referred to by ?ENTITY2.
domain: Country
range: Company form
sub property of: Cross-border company mobility entity relation

Company conversion
type: Class
comment: The process of changing or converting the corporate structure of a company. For example, a limited liability company of one country to one of another country, or from a private to a public limited liability company, or vice-versa by means of the continuance of an entity into another entity.
subclass of: Company transaction
subclass of: Restriction
  on property: target country
  some values from: Country
subclass of: Restriction
  on property: source country
  some values from: Country
subclass of: Restriction
  on property: requires document
  some values from: Company conversion plan
equivalent class: Class
  intersection of: Company transaction
  intersection of: Restriction
    on class: Company
    on property: has transaction input
    qualified cardinality: 1
  intersection of: Restriction
    on class: Company
    on property: has transaction result
    qualified cardinality: 1
  intersection of: Restriction
    on class: Company form
    on property: involves the change of
    qualified cardinality: 1

comment: This is an entity positioning annotation generated by CoModIDE (https://comodide.com/). Removing this annotation will break rendering the CoModIDE schema diagram view.
entity position x: 262.7768499425678
entity position y: 245.55110052442663

Procedure
type: Class
comment: A procedure is a process that attempts to achieve one or more objectives by following an established set of actions.
subclass of: BFO_0000015

comment: This is an entity positioning annotation generated by CoModIDE (https://comodide.com/). Removing this annotation will break rendering the CoModIDE schema diagram view.
entity position x: 18.896356430331895
entity position y: 293.2391048416998

comment: This is an entity positioning annotation generated by CoModIDE (https://comodide.com/). Removing this annotation will break rendering the CoModIDE schema diagram view.
entity position x: 4.045785894080908
entity position y: 258.29866804820614

comment: This is an entity positioning annotation generated by CoModIDE (https://comodide.com/). Removing this annotation will break rendering the CoModIDE schema diagram view.
entity position x: 139.39903443255537
entity position y: 142.64906693661192

comment: This is an entity positioning annotation generated by CoModIDE (https://comodide.com/). Removing this annotation will break rendering the CoModIDE schema diagram view.
entity position x: 181.12999496968988
entity position y: 149.5393386146698

comment: This is an entity positioning annotation generated by CoModIDE (https://comodide.com/). Removing this annotation will break rendering the CoModIDE schema diagram view.
entity position x: 27.24400809699391
entity position y: 150.84827715993404

Member State Official Journal
type: Class
comment: The national gazette or record in a particular Member State. In the official journal companies publish company transaction notices in order to inform concerned stakeholders and interested parties.
subclass of: Official journal

Company transaction
type: Class
comment: An action taken by a company that modifies its corporate structure with a change of control (for e.g. through either a merger, division, conversion or seat transfer in a domestic or cross-border setting). It involves one or more companies, each of which have a company legal form valid in a Member State of the European Union.
subclass of: Procedure
subclass of: Restriction
  on property: transaction validated by document
  some values from: Company transaction certificate
subclass of: Restriction
  on property: reported in
  some values from: Company transaction notice
subclass of: Restriction
  on property: has transaction result
  some values from: Company

comment: This is an entity positioning annotation generated by CoModIDE (https://comodide.com/). Removing this annotation will break rendering the CoModIDE schema diagram view.
entity position x: 255.03229712273688
entity position y: 132.03848355417568

comment: This is an entity positioning annotation generated by CoModIDE (https://comodide.com/). Removing this annotation will break rendering the CoModIDE schema diagram view.
entity position x: 245.79476251487904
entity position y: 275.1033741128023

Total WW employees at transaction
type: DatatypeProperty
comment: number of employees of company group worldwide at the moment of the transaction
domain: Company transaction
range: nonNegativeInteger

comment: This is an entity positioning annotation generated by CoModIDE (https://comodide.com/). Removing this annotation will break rendering the CoModIDE schema diagram view.
entity position x: 118.49018012003486
entity position y: 283.37643375648975

comment: This is an entity positioning annotation generated by CoModIDE (https://comodide.com/). Removing this annotation will break rendering the CoModIDE schema diagram view.
entity position x: 209.7252878494862
entity position y: 288.0907141087795

Society
type: Class
comment: The society at large is a stakeholder in a company through, inter alia, the government and its agencies, suppliers, customers, trade unions and the communities from which the business draws its resources.
subclass of: Stakeholder in a company

comment: This is an entity positioning annotation generated by CoModIDE (https://comodide.com/). Removing this annotation will break rendering the CoModIDE schema diagram view.
entity position x: 244.43186342713443
entity position y: 242.42091488245512

comment: This is an entity positioning annotation generated by CoModIDE (https://comodide.com/). Removing this annotation will break rendering the CoModIDE schema diagram view.
entity position x: 69.33559435098756
entity position y: 50.91336898555698

comment: This is an entity positioning annotation generated by CoModIDE (https://comodide.com/). Removing this annotation will break rendering the CoModIDE schema diagram view.
entity position x: 53.00501234049062
entity position y: 249.16432506444053

Cross-border company mobility researcher
type: Class
comment: A person that is interested in research about cross-border company mobility, and actively collects and analyses data concerning cross-border company mobility.
subclass of: Person

comment: This is an entity positioning annotation generated by CoModIDE (https://comodide.com/). Removing this annotation will break rendering the CoModIDE schema diagram view.
entity position x: 217.12121779262185
entity position y: 100.83729366048524

European Economic Area country
type: Class
comment: Created in 1994, the European Economic Area (EEA) combines the countries of the European Union (EU) and member countries of the European Free Trade Association (EFTA) to facilitate participation in the European Market trade and movement without having to apply to be one of the EU member countries
subclass of: Country
disjoint with: Non-EEA country

Legal form acronym
type: DatatypeProperty
comment: The acronym of a company legal form
domain: Company form
range: string

comment: This is an entity positioning annotation generated by CoModIDE (https://comodide.com/). Removing this annotation will break rendering the CoModIDE schema diagram view.
entity position x: 60.72612280576839
entity position y: 216.53692750322864

French Republic
type: EU country
type: NamedIndividual
label: République française @fr
label: France
iso2code: FR

BLER to be negotiated
type: DatatypeProperty
comment: Is an employee board level representation/participation (BLER) mechanism going to be re-negotiated in the process of the cross-border transaction? - Yes: BLER be (re-)negotiated with the SNB; - No: no BLER-(re-)negotiation; - Not applicable: the conditions are not met (e.g. no employees, BLER threshold not met) for this criterion to be applicable; - Unclear: the wording of the document is unclear with regard to the impact/effect/measures taken; - Not mentioned: given the parameters, this aspect should be addressed in the transaction document, but is not mentioned
domain: Company transaction
range: string

comment: This is an entity positioning annotation generated by CoModIDE (https://comodide.com/). Removing this annotation will break rendering the CoModIDE schema diagram view.
entity position x: 112.18668389761085
entity position y: 198.7975537218199

comment: This is an entity positioning annotation generated by CoModIDE (https://comodide.com/). Removing this annotation will break rendering the CoModIDE schema diagram view.
entity position x: 110.85517389976832
entity position y: 271.5994274615904

comment: This is an entity positioning annotation generated by CoModIDE (https://comodide.com/). Removing this annotation will break rendering the CoModIDE schema diagram view.
entity position x: 249.11205052540654
entity position y: 260.3454725364793

Iceland
type: European Economic Area country
type: NamedIndividual
label: Ísland @is
iso2code: IS

Company form country
type: ObjectProperty
comment: (companyFormCountry ?ENTITY1 ?ENTITY2) means that ?ENTITY1 is a company form recognized by the law of country ?ENTITY2.
domain: Company form
range: Country
sub property of: Cross-border company mobility entity relation
inverse of: country has company form

Cross-border company seat transfer
type: Class
comment: The act of changing the location where the company’s business was managed (registered office or headquarters) or the place where that company’s primary business was actually conducted (central administration), across national boundaries.
subclass of: Company seat transfer
subclass of: Restriction
  on class: Country
  on property: target country
  qualified cardinality: 1
subclass of: Restriction
  on class: Country
  on property: source country
  qualified cardinality: 1
subclass of: Restriction
  on class: Company
  on property: has transaction input
  qualified cardinality: 1
equivalent class: Class
  intersection of: Company seat transfer
  intersection of: Restriction
    on class: Country
    on property: involves country
    qualified cardinality: 2
  intersection of: Restriction
    on class: Country
    on property: source country
    qualified cardinality: 1
  intersection of: Restriction
    on class: Country
    on property: target country
    qualified cardinality: 1

Resolution
type: Class
comment: A document detailing a decision made by an individual or group of natural or legal persons. This can be a decision concerning the restructuring of a company by its shareholders.
subclass of: Transaction document

comment: This is an entity positioning annotation generated by CoModIDE (https://comodide.com/). Removing this annotation will break rendering the CoModIDE schema diagram view.
entity position x: 217.781961942788
entity position y: 224.7979276936274

comment: This is an entity positioning annotation generated by CoModIDE (https://comodide.com/). Removing this annotation will break rendering the CoModIDE schema diagram view.
entity position x: 179.4149954335206
entity position y: 174.28300216841396

comment: This is an entity positioning annotation generated by CoModIDE (https://comodide.com/). Removing this annotation will break rendering the CoModIDE schema diagram view.
entity position x: 275.757905503565
entity position y: 240.72812695479394

comment: This is an entity positioning annotation generated by CoModIDE (https://comodide.com/). Removing this annotation will break rendering the CoModIDE schema diagram view.
entity position x: 8.429893106041735
entity position y: 161.17776704067705

Company seat transfer plan
type: Class
comment: The management or administrative organ of the company draws up the draft terms of a cross-border seat transfer. The draft terms of a cross-border seat transfer must include at least the particulars specified under national law.
subclass of: Transaction document

Cross-border company merger by acquisition
type: Class
comment: Article 89: The operation whereby one or more companies are wound up without going into liquidation and transfer to another all their assets and liabilities in exchange for the issue to the shareholders of the company or companies being acquired of shares in the acquiring company and a cash payment, if any, not exceeding 10 % of the nominal value of the shares so issued or, where they have no nominal value, of their accounting par value. Companies involved come from two or more distinct countries.
subclass of: Cross-border merger
equivalent class: Class
  intersection of: Cross-border merger
  intersection of: Restriction
    on property: has merging company
    some values from: Company
  intersection of: Restriction
    on class: Company
    on property: has acquiring company
    qualified cardinality: 1

comment: This is an entity positioning annotation generated by CoModIDE (https://comodide.com/). Removing this annotation will break rendering the CoModIDE schema diagram view.
entity position x: 198.29243344570858
entity position y: 243.34073360301582

has transaction result
type: ObjectProperty
comment: (hasTransactionResult ?ENTITY1 ?ENTITY2) means that some company transaction ?ENTITY1 has a byproduct ?ENTITY2 (e.g. a company, transaction certificate etc.) after completion of the process.
domain: Company transaction
range: Company
sub property of: Cross-border company mobility transaction relation
Example: (hasTransactionResult crossBorderMerger1 acquiringCompany1)
Example: (hasTransactionResult crossBorderMerger1 mergerCertificate1)
inverse of: is transaction result of

Has TNIC
type: DatatypeProperty
comment: Is the company having a transnational information and consultation agreement in place? Does the company have an internal body which discusses employee rights and welfare? Different from works council. TNIC is global.
domain: Company
range: boolean

comment: This is an entity positioning annotation generated by CoModIDE (https://comodide.com/). Removing this annotation will break rendering the CoModIDE schema diagram view.
entity position x: 248.07165150045202
entity position y: 159.6891664652149

comment: This is an entity positioning annotation generated by CoModIDE (https://comodide.com/). Removing this annotation will break rendering the CoModIDE schema diagram view.
entity position x: 208.525212634583
entity position y: 206.33370239048014

Transaction document
type: Class
comment: Document required by law to document the step of a company transaction or an agreement made between stakeholders involved in the transaction that are either printed, inserted and mailed, or electronically presented.
subclass of: Company mobility document

comment: This is an entity positioning annotation generated by CoModIDE (https://comodide.com/). Removing this annotation will break rendering the CoModIDE schema diagram view.
entity position x: 143.0760569786945
entity position y: 205.74953025622148

Transferring company
type: Class
comment: Transferring Company means the company transferring its assets and liabilities to a recipient company.
subclass of: Company

comment: This is an entity positioning annotation generated by CoModIDE (https://comodide.com/). Removing this annotation will break rendering the CoModIDE schema diagram view.
entity position x: 255.28713943923407
entity position y: 277.7860413201921

comment: This is an entity positioning annotation generated by CoModIDE (https://comodide.com/). Removing this annotation will break rendering the CoModIDE schema diagram view.
entity position x: 189.1653478306684
entity position y: 289.9707044471894

Last WW employment figure
type: DatatypeProperty
comment: Last available employment figure for the total worldwide employees
domain: Company
range: nonNegativeInteger

Cross-border company mobility document relation
type: ObjectProperty
comment: (cbcmDocumentRelation ?ENTITY1 ?ENTITY2) means that the relation between ?ENTITY1 and ?ENTITY2 captures information pertaining to a company mobility document or similar information source relevant to corporate mobility.
sub property of: Cross-border company mobility entity relation

Data curation activity
type: Class
comment: A data curation activity represents a researcher's involvement in annotating cross border transactions
subclass of: Procedure
subclass of: Restriction
  on class: Agent
  on property: Associated with
  qualified cardinality: 1
subclass of: Restriction
  on property: Used
  some values from: Company mobility document repository
term status: testing

BLER composition
type: DatatypeProperty
comment: What is the employee board level representation (BLER) ratio going to be after the completion of the transaction? The ratio is ranging from 0.00 (no BLER) to 0.33 (1/3 BLER) to 0.5 (50-50 Mitbestimmung) to (theoretically) 1.00, which would be 100% employee representatives on the board and no shareholder representatives.
domain: Company transaction
range: Datatype
  on datatype: float
  with restrictions:
    min inclusive: 0.0
  with restrictions:
    max inclusive: 1.0

Company division
type: Class
comment: Article 160b - Division means: a) company being divided, on being dissolved without going into liquidation, transfers all its assets and liabilities to two or more newly formed companies (‘the recipient companies’), in exchange for the issue to the members of the company being divided of securities or shares in the recipient companies and, if any, a cash payment not exceeding 10 % of the nominal value of those securities or shares or, where they have no nominal value, a cash payment not exceeding 10% of the accounting par value of their securities or shares ('full division'); (b) a company being divided transfers part of its assets and liabilities to one or more newly formed companies (‘the recipient companies’), in exchange for the issue to the members of the company being divided of securities or shares in the recipient companies or in the company being divided or in both the recipient companies and in the company being divided, and if any a cash payment not exceeding 10 % of the nominal value of those securities or shares, or in the absence of a nominal value, a cash payment not exceeding 10 % of the accounting par value of their securities or shares (‘partial division’). (c) a company being divided transfers part of its assets and liabilities to one or more newly formed companies (‘the recipient companies’), in exchange for the issue of securities or shares in the recipient companies to the company being divided (‘division by separation’).
subclass of: Company transaction
subclass of: Restriction
  on property: source country
  some values from: Country
subclass of: Restriction
  on property: requires document
  some values from: Company division plan
subclass of: Restriction
  on property: has recipient company
  some values from: Company
subclass of: Restriction
  on property: target country
  some values from: Country
equivalent class: Class
  intersection of: Company transaction
  intersection of: Restriction
    min qualified cardinality: 2
    on class: Company
    on property: has transaction result
  intersection of: Restriction
    on class: Company
    on property: has transaction input
    qualified cardinality: 1

comment: This is an entity positioning annotation generated by CoModIDE (https://comodide.com/). Removing this annotation will break rendering the CoModIDE schema diagram view.
entity position x: 34.232942432039486
entity position y: 43.59706388390724

comment: This is an entity positioning annotation generated by CoModIDE (https://comodide.com/). Removing this annotation will break rendering the CoModIDE schema diagram view.
entity position x: 131.11688892684865
entity position y: 83.35251365961733

Domestic company merger by acquisition
type: Class
comment: Article 89: The operation whereby one or more companies are wound up without going into liquidation and transfer to another all their assets and liabilities in exchange for the issue to the shareholders of the company or companies being acquired of shares in the acquiring company and a cash payment, if any, not exceeding 10 % of the nominal value of the shares so issued or, where they have no nominal value, of their accounting par value. All companies involved are from a single country.
subclass of: Company domestic merger
subclass of: Restriction
  on class: Acquiring company
  on property: has transaction input
  qualified cardinality: 1
subclass of: Restriction
  on property: has transaction result
  some values from: Merging company
disjoint with: Domestic merger into a new company

Non-EU country
type: Class
comment: A country that does not officially belong to the EU conglomeration
subclass of: Country

comment: This is an entity positioning annotation generated by CoModIDE (https://comodide.com/). Removing this annotation will break rendering the CoModIDE schema diagram view.
entity position x: 196.316332036142
entity position y: 249.95028341974285

comment: This is an entity positioning annotation generated by CoModIDE (https://comodide.com/). Removing this annotation will break rendering the CoModIDE schema diagram view.
entity position x: 297.4816662483587
entity position y: 103.23498423096065

Cross-border merger into a new company
type: Class
comment: Article 90: the operation whereby several companies are wound up without going into liquidation and transfer to a company that they set up all their assets and liabilities in exchange for the issue to their shareholders of shares in the new company and a cash payment, if any, not exceeding 10 % of the nominal value of the shares so issued or, where they have no nominal value, of their accounting par value. Companies involved come from two or more distinct countries.
subclass of: Cross-border merger

NACE code
type: DatatypeProperty
comment: NACE Classification Code for companies. NACE (Nomenclature des Activités Économiques dans la Communauté Européenne) is a European industry standard classification system similar in function to Standard Industry Classification (SIC) and North American Industry Classification System (NAICS) for classifying business activities. From EUROSTAT
domain: Company
range: Datatype
  on datatype: positiveInteger
  with restrictions:
    min inclusive: 1000
  with restrictions:
    max inclusive: 9999

Recipient company
type: Class
comment: A company being divided transfers part of its assets and liabilities to one or more newly formed companies, which are the recipient companies in a (cross-border) division.
subclass of: Company
subclass of: Restriction
  on property: is transaction result of
  some values from: Company division

Official journal publication
type: Class
comment: Publication of a legally valid record or act in an official national gazette to inform stakeholders.
subclass of: Company mobility document

Slovakia
type: EU country
type: NamedIndividual
label: Slovenská republika @sk
label: Slovensko @sk
label: Slovak Republic
iso2code: SK

comment: This is an entity positioning annotation generated by CoModIDE (https://comodide.com/). Removing this annotation will break rendering the CoModIDE schema diagram view.
entity position x: 137.8726186678454
entity position y: 150.42486588976413

SNB voluntary application
type: DatatypeProperty
comment: Is a Special Negotiating Body (SNB) set up voluntary? Whether or not a SNB is created/will be created voluntarily. - Yes: an SNB is created voluntarily; - No: no voluntary SNB set up; - Not applicable: the conditions are not met (e.g. no employees, BLER threshold not met) for this criterion to be applicable; - Unclear: the wording of the document is unclear with regard to the impact/effect/measures taken; - Not mentioned: given the parameters, this aspect should be addressed in the transaction document, but is not mentioned
domain: Company transaction
range: string

Norway
type: European Economic Area country
type: NamedIndividual
label: Kongeriket Noreg @no
label: Kongeriket Norge @no
label: Norgga @no
label: Vuona @no
label: Norge @no
label: Nöörjen @no
label: Norgga gonagasriika @no
label: Kingdom of Norway
label: Noreg @no
iso2code: NO

comment: This is an entity positioning annotation generated by CoModIDE (https://comodide.com/). Removing this annotation will break rendering the CoModIDE schema diagram view.
entity position x: 269.5633829773079
entity position y: 122.87965078063148

Type of SE
type: ObjectProperty
comment: Variable indicating the SE-establishment mode: by merger, conversion, holding-SE, subsidiary-SE or unsure
domain: Company transaction
range: Societas Europaea (SE) type
sub property of: Cross-border company mobility transaction relation

employs
type: ObjectProperty
comment: (employs ?ENTITY1 ?ENTITY2) means (employedBy ?ENTITY2 ?ENTITY1)
sub property of: has company stakeholder

comment: This is an entity positioning annotation generated by CoModIDE (https://comodide.com/). Removing this annotation will break rendering the CoModIDE schema diagram view.
entity position x: 143.0121185287264
entity position y: 175.37034131435243

Generated by
type: ObjectProperty
comment: Generation is the completion of production of a new entity by a process. This entity did not exist before generation and becomes available for usage after this generation. Based on: https://www.w3.org/TR/prov-o/#wasGeneratedBy
sub property of: Cross-border company mobility data provenance relation

comment: This is an entity positioning annotation generated by CoModIDE (https://comodide.com/). Removing this annotation will break rendering the CoModIDE schema diagram view.
entity position x: 50.58595729952889
entity position y: 244.26994172626837

located in
type: ObjectProperty
comment: (locatedIn ?ENTITY1 ?ENTITY2) means that some entity ?ENTITY1 occupies the spatial region referred to by ?ENTITY2.
sub property of: Cross-border company mobility organisation relation

is transaction result of
type: ObjectProperty
comment: (isTransactionResultOf ?ENTITY1 ?ENTITY2) means (hasTransactionResult ?ENTITY2 ?ENTITY1)
sub property of: Cross-border company mobility transaction relation
Example: has transaction result

Annual report
type: Class
comment: Annual reports measure a company's financial health. They focus on past and present financial performance, and make predictions about future prospects. The revenue and financial performance of a company.
subclass of: Company mobility document

Republic of Lithuania
type: EU country
type: NamedIndividual
label: Lithuania
label: Lietuvos Respublika @lt
label: Lietuva @lt
iso2code: LT

comment: This is an entity positioning annotation generated by CoModIDE (https://comodide.com/). Removing this annotation will break rendering the CoModIDE schema diagram view.
entity position x: 31.733812683874483
entity position y: 124.25202636218214

has transaction input
type: ObjectProperty
comment: (hasTransactionInput ?ENTITY1 ?ENTITY2) means that some company transaction ?ENTITY1 has a prerequisite entity ?ENTITY2 that needs to be considered, assessed, or modified during the transaction referred to by ?ENTITY1.
domain: Company transaction
range: Company
sub property of: Cross-border company mobility transaction relation
Example: (hasTransactionInput crossBorderMerger1 company1)
inverse of: is transaction input of

comment: This is an entity positioning annotation generated by CoModIDE (https://comodide.com/). Removing this annotation will break rendering the CoModIDE schema diagram view.
entity position x: 13.492948758835098
entity position y: 254.38646259999092

comment: This is an entity positioning annotation generated by CoModIDE (https://comodide.com/). Removing this annotation will break rendering the CoModIDE schema diagram view.
entity position x: 232.05108775996405
entity position y: 94.87943358517005

comment: This is an entity positioning annotation generated by CoModIDE (https://comodide.com/). Removing this annotation will break rendering the CoModIDE schema diagram view.
entity position x: 266.18798107220033
entity position y: 177.08003492861513

source country
type: ObjectProperty
comment: (sourceCountry ?ENTITY1 ?ENTITY2) means that some company transaction ?ENTITY1 has some transaction input (a company) whose place of business is located in the country ?ENTITY2.
sub property of: involves country
Example: (sourceCountry crossBorderMerger1 france)

requires document
type: ObjectProperty
comment: (requiresDocument ?ENTITY1 ?ENTITY2) means that some significant event or process ?ENTITY1 needs a compulsory document ?ENTITY2 to be submitted and reviewed before the process ?ENTITY1 can be completed.
domain: Company transaction
range: Company mobility document
sub property of: Cross-border company mobility document relation
Example: (requiresDocument crossBorderMerger1 mergerPlan1)

comment: This is an entity positioning annotation generated by CoModIDE (https://comodide.com/). Removing this annotation will break rendering the CoModIDE schema diagram view.
entity position x: 241.61522720124236
entity position y: 148.61742870165108

Transaction plan available
type: DatatypeProperty
comment: Is the transaction plan available for analysis? Merger plan, Seat transfer plan or Division plan. Transaction notice is where the transaction is announced. The other documents are where the nature and details of the transaction are specified.
domain: Company transaction
range: boolean

comment: This is an entity positioning annotation generated by CoModIDE (https://comodide.com/). Removing this annotation will break rendering the CoModIDE schema diagram view.
entity position x: 295.9330197078383
entity position y: 66.09191894254323

comment: This is an entity positioning annotation generated by CoModIDE (https://comodide.com/). Removing this annotation will break rendering the CoModIDE schema diagram view.
entity position x: 44.37433370834429
entity position y: 103.69004799077238

comment: This is an entity positioning annotation generated by CoModIDE (https://comodide.com/). Removing this annotation will break rendering the CoModIDE schema diagram view.
entity position x: 266.3774679637017
entity position y: 151.75255166372014

Last employment figure for the acquiring company
type: DatatypeProperty
comment: The last available annual employment figure for the acquiring company
domain: Company transaction
range: nonNegativeInteger

Croatia
type: EU country
type: NamedIndividual
label: Hrvatska @hr
iso2code: HR

comment: This is an entity positioning annotation generated by CoModIDE (https://comodide.com/). Removing this annotation will break rendering the CoModIDE schema diagram view.
entity position x: 214.11641253731037
entity position y: 134.19157709173146

Management board
type: Class
comment: The group of persons comprising the governing body of the legal entity that is entrusted with the decision-making in the company. It is also called Executive Board in a one-tier board system.
subclass of: Manager
subclass of: Restriction
  on property: part of
  some values from: Company

Website
type: DatatypeProperty
comment: Homepage of a company/organization website
domain: Organisation
range: string

comment: This is an entity positioning annotation generated by CoModIDE (https://comodide.com/). Removing this annotation will break rendering the CoModIDE schema diagram view.
entity position x: 68.478522511586
entity position y: 223.39629614148157

Associated with
type: ObjectProperty
comment: An activity association is an assignment of responsibility to an agent for a process, indicating that the agent had a role in the activity. Based on: https://www.w3.org/TR/prov-o/#wasAssociatedWith
range: Agent
sub property of: Cross-border company mobility data provenance relation

comment: This is an entity positioning annotation generated by CoModIDE (https://comodide.com/). Removing this annotation will break rendering the CoModIDE schema diagram view.
entity position x: 64.26195094994145
entity position y: 130.33558418291966

Company conversion plan
type: Class
comment: A document providing details of how the conversion of a company will be implemented. Article 86d: The management or administrative organ of the company shall draw up the draft terms of a cross-border conversion. The draft terms of a cross-border conversion shall include at least the particulars listed in article 86d
subclass of: Transaction document

comment: This is an entity positioning annotation generated by CoModIDE (https://comodide.com/). Removing this annotation will break rendering the CoModIDE schema diagram view.
entity position x: 95.57191324621544
entity position y: 18.09904131507916

has merging company
type: ObjectProperty
comment: (hasMergingCompany ?ENTITY1 ?ENTITY2) means that some company merger transaction ?ENTITY1 involves a company ?ENTITY2 which will be dissolved during the process of ?ENTITY1 and will be acquired (via a universal transfer of assets and liabilities) by another distinct company involved in ?ENTITY1.
domain: Company merger
range: Company
sub property of: has transaction input
Example: (hasMergingCompany crossBorderMerger1 company1)

comment: This is an entity positioning annotation generated by CoModIDE (https://comodide.com/). Removing this annotation will break rendering the CoModIDE schema diagram view.
entity position x: 226.41529346648915
entity position y: 151.00297655613727

NACE sector
type: DatatypeProperty
comment: Company NACE sector. NACE (Nomenclature of Economic Activities) is the European statistical classification of economic activities. Classification of a company according to which kinds of sector (i.e. industry / market / product type) they deal in. From EUROSTAT
domain: Company
range: Datatype
  on datatype: string
  with restrictions:
    length: 1

comment: This is an entity positioning annotation generated by CoModIDE (https://comodide.com/). Removing this annotation will break rendering the CoModIDE schema diagram view.
entity position x: 71.03680677110084
entity position y: 52.05298320883994

National registry
type: Class
comment: A national registry is a business registry in a Member State, which includes information on the population of companies in the jurisdiction and holds inter alia data on registration numbers, place of registration, notices and transaction documents in the national registry repository.
subclass of: Organisation

Multi-transaction
type: DatatypeProperty
comment: A transaction whereby more than two companies (i.e. multiple merging companies) are involved and merged into one acquiring company
domain: Company transaction
range: boolean

comment: This is an entity positioning annotation generated by CoModIDE (https://comodide.com/). Removing this annotation will break rendering the CoModIDE schema diagram view.
entity position x: 101.5931884899861
entity position y: 186.71127758816417

After-transaction company form
type: ObjectProperty
comment: (?ENTITY1 hasPostCompanyForm ?ENTITY2) indicates the new company form of a company undergoing a cross border conversion or a national conversion.
domain: Company transaction
range: Company form
sub property of: has transaction result

comment: This is an entity positioning annotation generated by CoModIDE (https://comodide.com/). Removing this annotation will break rendering the CoModIDE schema diagram view.
entity position x: 141.60152732818455
entity position y: 232.75293984177262

The European Union Company Mobility Ontology (EUCM ontology)
type: Ontology
type: Vocabulary
license: https://creativecommons.org/licenses/by-sa/4.0
creator: Marcus Meyer
creator: Thomas Biermeyer
creator: Stephan Rammeloo
creator: Q59418334
description: This ontology describes terms concerning companies, their cross-border movements within the European Union (EU), and associated EU company legislation.
issued: 2021-12-09T00:00:00
publisher: Q1137652
rights: Copyright © 2021 Maastricht University
contributor: Walter Simoncini
contributor: Tobias Breuer
contributor: Q58177227
preferred namespace prefix: eucm
preferred namespace uri: http://w3id.org/um/cbcm/eu-cm-ontology#
imports: bfo.owl
version IRI: http://w3id.org/um/cbcm/eu-cm-ontology/1.2.2
version info: 1.2.2
was attributed to: Institute of Data Science at Maastricht University
was attributed to: Maastricht University

Transaction right
type: Class
comment: A legal right of a legal entity involved in the process of a company transaction. A legal right here refers to the entitlement of a person to be allowed to perform an activity, or to possess or obtain access to an object.
subclass of: BFO_0000017

comment: This is an entity positioning annotation generated by CoModIDE (https://comodide.com/). Removing this annotation will break rendering the CoModIDE schema diagram view.
entity position x: 226.86760350018855
entity position y: 168.21082276004154

comment: This is an entity positioning annotation generated by CoModIDE (https://comodide.com/). Removing this annotation will break rendering the CoModIDE schema diagram view.
entity position x: 106.45559196571034
entity position y: 69.94751308456023

comment: This is an entity positioning annotation generated by CoModIDE (https://comodide.com/). Removing this annotation will break rendering the CoModIDE schema diagram view.
entity position x: 24.25001224840435
entity position y: 264.57556265040444

Country
type: Class
comment: A geo-political region that has a distinct and common political governance structure for people that inhabit it for a significant portion of their lives. The majority of people that inhabit such a region are also usually united by common descent, history, culture and language.
subclass of: Geo-political region

Central Administration
type: Class
comment: The headquarters or body of a company which governs it's financial and administrative activities
subclass of: Organisational unit
equivalent class: Company headquarter

Annual account
type: Class
comment: Annual reports measure a company's financial health. They focus on past and present financial performance, and make predictions about future prospects. The revenue and financial performance of a company.
subclass of: Company mobility document
equivalent class: Annual report

Manager information right
type: Class
comment: The right of a manager to information and access to documents that he or she has in accordance with national or European company law.
subclass of: Manager right

comment: This is an entity positioning annotation generated by CoModIDE (https://comodide.com/). Removing this annotation will break rendering the CoModIDE schema diagram view.
entity position x: 139.10665490384542
entity position y: 171.75380343990585

Used
type: ObjectProperty
comment: Usage is the beginning of utilizing an entity by an activity. Before usage, the activity had not begun to utilize this entity and could not have been affected by the entity. Based on: https://www.w3.org/TR/prov-o/#used
sub property of: Cross-border company mobility data provenance relation

Creditor right
type: Class
comment: The rights of creditors, which includes debenture holders, vis-a-vis the company that obtained credit from the individual or organisation. Legal safeguards are put in place to ensure that rights of creditors are not negatively affected by a company transaction.
subclass of: Transaction right
subclass of: Restriction
  on property: applicable to
  some values from: Creditor

Management report
type: Class
comment: A report drawn up by the company's management on the intended transaction, laying out the main features of the transactions and its consequences.
subclass of: Transaction document

comment: This is an entity positioning annotation generated by CoModIDE (https://comodide.com/). Removing this annotation will break rendering the CoModIDE schema diagram view.
entity position x: 143.6432675101612
entity position y: 123.39626348456598

comment: This is an entity positioning annotation generated by CoModIDE (https://comodide.com/). Removing this annotation will break rendering the CoModIDE schema diagram view.
entity position x: 236.74617899157928
entity position y: 273.1051930252097

comment: This is an entity positioning annotation generated by CoModIDE (https://comodide.com/). Removing this annotation will break rendering the CoModIDE schema diagram view.
entity position x: 272.6072752966426
entity position y: 207.15905473890163

comment: This is an entity positioning annotation generated by CoModIDE (https://comodide.com/). Removing this annotation will break rendering the CoModIDE schema diagram view.
entity position x: 276.9733905621957
entity position y: 147.23970510616738

Consultation right
type: Class
comment: The right of employees or their representatives to be consulted and to give advice on a business decision, such as an intended merger/division/conversion/seat transfer.
subclass of: Social right

comment: This is an entity positioning annotation generated by CoModIDE (https://comodide.com/). Removing this annotation will break rendering the CoModIDE schema diagram view.
entity position x: 143.47748596911322
entity position y: 219.3996038495368

comment: This is an entity positioning annotation generated by CoModIDE (https://comodide.com/). Removing this annotation will break rendering the CoModIDE schema diagram view.
entity position x: 18.23164396733823
entity position y: 104.96258901033252

data found in registry from country
type: ObjectProperty
comment: In which countries' registry did the researcher find information about the transaction?
domain: Company transaction
range: Country
sub property of: Cross-border company mobility entity relation

comment: This is an entity positioning annotation generated by CoModIDE (https://comodide.com/). Removing this annotation will break rendering the CoModIDE schema diagram view.
entity position x: 199.91687244031976
entity position y: 291.65970907681094

authors
type: ObjectProperty
comment: (authors ?ENTITY1 ?ENTITY2) means that (authoredBy ?ENTITY2 ?ENTITY1)
sub property of: Cross-border company mobility document relation

MC Last employment figure year
type: DatatypeProperty
comment: The year the last annual employment figure was obtained for merging companies
domain: Company transaction
range: dateTime

Interim account
type: Class
comment: Interim accounts are accounts that are published during a company's financial year and that show the financial situation on a given accounting date.
subclass of: Annual account

Impact on employees
type: DatatypeProperty
comment: Is the impact on employees of the envisaged transaction specified in the transaction document (e.g. the merger plan)? Part of merger plan that specifies how the transaction will affect employees. - Yes: there is an impact on employees (positive or negative); - No: no impact on employees; - Not applicable: the conditions are not met (e.g. no employees, BLER threshold not met) for this criterion to be applicable; - Unclear: the wording of the document is unclear with regard to the impact/effect/measures taken; - Not mentioned: given the parameters, this aspect should be addressed in the transaction document, but is not mentioned
domain: Company transaction
range: string

comment: This is an entity positioning annotation generated by CoModIDE (https://comodide.com/). Removing this annotation will break rendering the CoModIDE schema diagram view.
entity position x: 7.1808630554767
entity position y: 241.6783288255424

Creditor decision right
type: Class
comment: The right of a creditor to influence or take a decision in the context of a transaction.
subclass of: Creditor right

Ended at
type: DatatypeProperty
comment: The date and time a process ended
range: dateTime

comment: This is an entity positioning annotation generated by CoModIDE (https://comodide.com/). Removing this annotation will break rendering the CoModIDE schema diagram view.
entity position x: 58.06505889581793
entity position y: 291.31313144550154

comment: This is an entity positioning annotation generated by CoModIDE (https://comodide.com/). Removing this annotation will break rendering the CoModIDE schema diagram view.
entity position x: 153.2388903125871
entity position y: 111.86056274753707

comment: This is an entity positioning annotation generated by CoModIDE (https://comodide.com/). Removing this annotation will break rendering the CoModIDE schema diagram view.
entity position x: 46.31957247761616
entity position y: 34.96391683939311

Companies have Works Council
type: DatatypeProperty
comment: Are the companies involved in the transaction having a works council? Works councils safeguard employees' welfare
domain: Company transaction
range: boolean

Merging company
type: Class
comment: Merging Company means the dissolving company that is being acquired by another (acquiring) company in the process of a transaction. In the context of company mobility, this means a universal transfer of assets and liabilities from the merging to the acquiring company (see article 131 of Directive 2017/1132).
subclass of: Company
subclass of: Restriction
  on property: is transaction input of
  some values from: Company merger

comment: This is an entity positioning annotation generated by CoModIDE (https://comodide.com/). Removing this annotation will break rendering the CoModIDE schema diagram view.
entity position x: 65.42451098340007
entity position y: 177.53694512511427

comment: This is an entity positioning annotation generated by CoModIDE (https://comodide.com/). Removing this annotation will break rendering the CoModIDE schema diagram view.
entity position x: 256.9075679272785
entity position y: 53.80105649965677

Company domestic division
type: Class
comment: A company which in a process of the domestic division - in case of a full division - transfers all its assets and liabilities to two or more companies, or - in case of a partial division or division by separation - transfers part of its assets and liabilities to one or more companies. All companies involved in the process are located in a single country.
subclass of: Company division
subclass of: Restriction
  on class: Country
  on property: involves country
  qualified cardinality: 1

is transaction input of
type: ObjectProperty
comment: (isTransactionInputOf ?ENTITY1 ?ENTITY2) means (hasTransactionInput ?ENTITY2 ?ENTITY1)
sub property of: Cross-border company mobility transaction relation
Example: has transaction input

MC Employees count at transaction
type: DatatypeProperty
comment: Number of employees of the acquiring company - at the moment of the transaction
domain: Company transaction
range: nonNegativeInteger

Is listed
type: DatatypeProperty
comment: Whether the company is publicly listed. A company whose shares are bought and sold on a particular stock market.
domain: Company
range: boolean

comment: This is an entity positioning annotation generated by CoModIDE (https://comodide.com/). Removing this annotation will break rendering the CoModIDE schema diagram view.
entity position x: 55.28213929989567
entity position y: 196.86427483194888

Companies have employees
type: DatatypeProperty
comment: Are the companies involved in the transaction having employees? Only one company needs to have employees for this property to be true
domain: Company transaction
range: boolean

comment: This is an entity positioning annotation generated by CoModIDE (https://comodide.com/). Removing this annotation will break rendering the CoModIDE schema diagram view.
entity position x: 138.3469489059055
entity position y: 99.0876742197817

comment: This is an entity positioning annotation generated by CoModIDE (https://comodide.com/). Removing this annotation will break rendering the CoModIDE schema diagram view.
entity position x: 234.2005530811132
entity position y: 268.9536177481755

Law Firm
type: DatatypeProperty
comment: Name of the lawfirm involved in the transaction, if available (for internal use; cross-border divisions and seat transfers are currently not possible within an EU legal framework.)
domain: Company transaction
range: string

Stakeholder in a company
type: Class
comment: A person, group or organization that has interest or concern in an organization or company in particular. Stakeholders can affect or be affected by the company's actions, objectives and policies.
subclass of: Agent
subclass of: Class
  union of: Organisation
  union of: Person

comment: This is an entity positioning annotation generated by CoModIDE (https://comodide.com/). Removing this annotation will break rendering the CoModIDE schema diagram view.
entity position x: 139.53115916189458
entity position y: 289.20143563808284

Cross-border company mobility transaction relation
type: ObjectProperty
comment: (cbcmTransactionRelation ?ENTITY1 ?ENTITY2) means that the relation between ?ENTITY1 and ?ENTITY2 captures information pertaining to a company mobility transaction.
sub property of: Cross-border company mobility entity relation

comment: This is an entity positioning annotation generated by CoModIDE (https://comodide.com/). Removing this annotation will break rendering the CoModIDE schema diagram view.
entity position x: 191.67731560974352
entity position y: 281.3627119441426

owns
type: ObjectProperty
comment: (owns ?ENTITY1 ?ENTITY2) means (owns ?ENTITY2 ?ENTITY1)
domain: Class
  union of: Organisation
  union of: Person
range: Organisation
sub property of: has company stakeholder

comment: This is an entity positioning annotation generated by CoModIDE (https://comodide.com/). Removing this annotation will break rendering the CoModIDE schema diagram view.
entity position x: 115.67252467915873
entity position y: 107.91167534620872

Acquiring company
type: Class
comment: Acquiring Company means the resulting or surviving company in a transaction that takes over another, merging company.
subclass of: Company
subclass of: Restriction
  on property: is transaction result of
  some values from: Company merger

comment: This is an entity positioning annotation generated by CoModIDE (https://comodide.com/). Removing this annotation will break rendering the CoModIDE schema diagram view.
entity position x: 5.230804892398894
entity position y: 190.27823337848955

AC Last employment figure year
type: DatatypeProperty
comment: The year the last annual employment figure was obtained for acquiring companies
domain: Company transaction
range: dateTime

Cross-border company mobility entity relation
type: ObjectProperty
comment: (cbcmEntityRelation ?ENTITY1 ?ENTITY2) means that ?ENTITY1 is related to ?ENTITY2.

comment: This is an entity positioning annotation generated by CoModIDE (https://comodide.com/). Removing this annotation will break rendering the CoModIDE schema diagram view.
entity position x: 134.2048824296458
entity position y: 243.74535550131444

comment: This is an entity positioning annotation generated by CoModIDE (https://comodide.com/). Removing this annotation will break rendering the CoModIDE schema diagram view.
entity position x: 60.104481168433864
entity position y: 57.8326666648158

comment: This is an entity positioning annotation generated by CoModIDE (https://comodide.com/). Removing this annotation will break rendering the CoModIDE schema diagram view.
entity position x: 202.01210091125137
entity position y: 299.5595446738471

has original company
type: ObjectProperty
comment: (hasOriginalCompany ?ENTITY1 ?ENTITY2) means that some company division transaction ?ENTITY1 involves a company ?ENTITY2 which will be divided (or "split") into multiple recipient or emerging companies.
domain: Company division
range: Company
sub property of: has transaction input
Example: (hasOriginalCompany crossBorderDivision1 company1)

Cross-border company mobility data provenance relation
type: ObjectProperty
comment: (cbcmDataProvenanceRelation ?ENTITY1 ?ENTITY2) means that the relation between ?ENTITY1 and ?ENTITY2 captures provenance information for company transaction data.
sub property of: Cross-border company mobility entity relation

comment: This is an entity positioning annotation generated by CoModIDE (https://comodide.com/). Removing this annotation will break rendering the CoModIDE schema diagram view.
entity position x: 80.8771489838024
entity position y: 17.963298319155722

transaction validated by document
type: ObjectProperty
comment: (transactionValidatedByDocument ?ENTITY1 ?ENTITY2) means that some company transaction ?ENTITY1 went through a process of approval and assessment through various criteria such as veracity, eligibility, legal relevance etc. and a document ?ENTITY2 was produced to prove the satisfaction of the critieria by ?ENTITY1.
domain: Company transaction
range: Company mobility document
sub property of: Cross-border company mobility document relation
Example: (transactionValidatedByDocument crossBorderMerger1 mergerCertificate1)

Manager
type: Class
comment: A person or group of persons that are responsible for overseeing the operations of a company.
subclass of: Stakeholder in a company

document validated by document
type: ObjectProperty
comment: (documentValidatedByDocument ?ENTITY1 ?ENTITY2) means that some document or publication, ?ENTITY1, went through a process of approval and assessment through various criteria such as veracity, eligibility, legal relevance etc. and another document ?ENTITY2 was produced to prove the satisfaction of the critieria by ?ENTITY1.
domain: Company mobility document
range: Company mobility document
sub property of: Cross-border company mobility document relation
Example: (documentValidatedByDocument mergerPlan1 mergerCertificate1)

comment: This is an entity positioning annotation generated by CoModIDE (https://comodide.com/). Removing this annotation will break rendering the CoModIDE schema diagram view.
entity position x: 77.00914110402874
entity position y: 293.9661756024349

Notary
type: Class
comment: A person authorized to perform certain legal formalities, especially to draw up or certify contracts, deeds, and other documents for use in other jurisdictions.
subclass of: Competent authority

Behaviour
type: Class
comment: Behaviour is the set of actions and mannerisms made by systems (biological or otherwise) in response to stimuli or inputs, whether internal or external, conscious or subconscious, overt or covert, and voluntary or involuntary.
subclass of: BFO_0000015
disjoint with: Procedure
term status: deprecated

comment: This is an entity positioning annotation generated by CoModIDE (https://comodide.com/). Removing this annotation will break rendering the CoModIDE schema diagram view.
entity position x: 203.15647508716086
entity position y: 13.47221136421604

Principality of Liechtenstein
type: European Economic Area country
type: NamedIndividual
label: Liechtenstein
label: Fürstentum Liechtenstein @de
iso2code: LI

comment: This is an entity positioning annotation generated by CoModIDE (https://comodide.com/). Removing this annotation will break rendering the CoModIDE schema diagram view.
entity position x: 282.45502237433436
entity position y: 231.05248398309334

Melita
type: EU country
type: NamedIndividual
label: Repubblika ta' Malta @mt
label: Malta
iso2code: MT

comment: This is an entity positioning annotation generated by CoModIDE (https://comodide.com/). Removing this annotation will break rendering the CoModIDE schema diagram view.
entity position x: 169.3838654440731
entity position y: 16.55813918693264

Official journal repository
type: Class
comment: The digital repository in which documents published in the official journal are kept as well as related documents. In some EU Member States, this repository is overlapping or identical with the National Registry Repository.
subclass of: Company mobility document repository
subclass of: Restriction
  on property: maintained by
  some values from: Official journal

Company mobility document repository
type: Class
comment: A digital document repository containing documents related to company mobility.
subclass of: BFO_0000030

comment: This is an entity positioning annotation generated by CoModIDE (https://comodide.com/). Removing this annotation will break rendering the CoModIDE schema diagram view.
entity position x: 80.17428163453475
entity position y: 275.24668244143015

Report by an independent expert
type: Class
comment: Article 86g and 160i: Member States must ensure that an independent expert examines the draft terms of the transaction and draws up a report intended for members which is made available to them not less than one month before the date of the general meeting. Depending on the law of Member States, the expert may be a natural person or a legal person. The report must assess the cash compensation proposed and valuation method.
subclass of: Transaction document
subclass of: Restriction
  on property: authored by
  some values from: Independent expert

comment: This is an entity positioning annotation generated by CoModIDE (https://comodide.com/). Removing this annotation will break rendering the CoModIDE schema diagram view.
entity position x: 30.945899686803486
entity position y: 29.564885717520582

comment: This is an entity positioning annotation generated by CoModIDE (https://comodide.com/). Removing this annotation will break rendering the CoModIDE schema diagram view.
entity position x: 52.12446089724935
entity position y: 30.267912068108608

maintains
type: ObjectProperty
comment: (maintains ?ENTITY1 ?ENTITY2) means (maintainedBy ?ENTITY2 ?ENTITY1)
sub property of: Cross-border company mobility document relation

Supervisory board
type: Class
comment: A supervisory board must approve of major business decisions. It is a group of individuals chosen by the shareholders - and employee representatives in board-level employee representation systems - of a company to promote their interests through the governance of the company and to hire and supervise the management board. It is also called non-executive board in a one-tier board system.
subclass of: Manager
subclass of: Restriction
  on property: part of
  some values from: Company

has company stakeholder
type: ObjectProperty
comment: (hasCompanyStakeholder ?ENTITY1 ?ENTITY2) means that some entity ?ENTITY1, which is either a significant process or agent has another agent ?ENTITY2 with personal interests in benefiting either financially or otherwise from the outcomes of ?ENTITY1 (if it is an event or process), or in its byproducts and profits (if it is an agent).
range: Agent
sub property of: Cross-border company mobility organisation relation
Example: (hasCompanyStakeholder company1 person1)

comment: This is an entity positioning annotation generated by CoModIDE (https://comodide.com/). Removing this annotation will break rendering the CoModIDE schema diagram view.
entity position x: 61.530578065886296
entity position y: 60.210456156221056

comment: This is an entity positioning annotation generated by CoModIDE (https://comodide.com/). Removing this annotation will break rendering the CoModIDE schema diagram view.
entity position x: 90.9861772743164
entity position y: 109.03647135579364

has parent company
type: ObjectProperty
comment: (hasParentCompany ?ENTITY1 ?ENTITY2) means that some company ?ENTITY1 is owned and under direct or indirect control by the company ?ENTITY2.
domain: Company
range: Company
sub property of: Cross-border company mobility organisation relation
Example: (hasParentCompany company1 company2)
inverse of: has subsidiary company

comment: This is an entity positioning annotation generated by CoModIDE (https://comodide.com/). Removing this annotation will break rendering the CoModIDE schema diagram view.
entity position x: 131.1694963522508
entity position y: 116.43831846425745

Company form
type: Class
comment: Name given to describe the structure of a corporation or business in the different legal orders. For example Limited (Ltd.), Public Limited Company (PLC), Gesellschaft mit beschränkter Haftung (GmbH), Aktiengesellschaft (AG). The company legal form is regulated under national law and grants specific rights and obligations to the company stakeholders (such as shareholders, management & employees).
subclass of: Attribute

Generated
type: ObjectProperty
comment: Generation is the completion of production of a new entity by a process. This entity did not exist before generation and becomes available for usage after this generation. Based (inverse of) on: https://www.w3.org/TR/prov-o/#wasGeneratedBy
sub property of: Cross-border company mobility data provenance relation
inverse of: Generated by

comment: This is an entity positioning annotation generated by CoModIDE (https://comodide.com/). Removing this annotation will break rendering the CoModIDE schema diagram view.
entity position x: 30.70103706546807
entity position y: 82.95180979707261

Creditor
type: Class
comment: A person, organization, or government that is owed money. A creditor's claims and the safeguarding of these creditor rights is laid down in the company law of the Member States and EU law.
subclass of: Stakeholder in a company

comment: This is an entity positioning annotation generated by CoModIDE (https://comodide.com/). Removing this annotation will break rendering the CoModIDE schema diagram view.
entity position x: 67.26592136482995
entity position y: 195.39358378832364

comment: This is an entity positioning annotation generated by CoModIDE (https://comodide.com/). Removing this annotation will break rendering the CoModIDE schema diagram view.
entity position x: 250.935230379447
entity position y: 217.644898075059

Company transaction notice
type: Class
comment: A written notice, published in an official journal of a Member State of the EU and/or the European Official Journal indicating the intention to engage in a transaction and which informs the members, creditors and representatives of the employees of the company, or, where there are no such representatives, the employees themselves of said transaction.
subclass of: Transaction document
subclass of: Restriction
  on property: contained in
  some values from: Official journal repository

comment: This is an entity positioning annotation generated by CoModIDE (https://comodide.com/). Removing this annotation will break rendering the CoModIDE schema diagram view.
entity position x: 45.54262094480286
entity position y: 22.868311703824315

Registered office
type: Class
comment: The physical address or location at which the primary business activities of a company are carried out.
subclass of: Geo-political region

Shareholder resolution
type: Class
comment: a shareholder resolution is a proposal submitted by shareholders for a vote at the company's shareholder meeting.
subclass of: Resolution

comment: This is an entity positioning annotation generated by CoModIDE (https://comodide.com/). Removing this annotation will break rendering the CoModIDE schema diagram view.
entity position x: 46.82985876509674
entity position y: 252.14393321570253

Transaction ID
type: DatatypeProperty
comment: unique identifier for a transaction
domain: Company transaction
range: positiveInteger

comment: This is an entity positioning annotation generated by CoModIDE (https://comodide.com/). Removing this annotation will break rendering the CoModIDE schema diagram view.
entity position x: 35.38141223492617
entity position y: 292.3640814981097

Company merger
type: Class
comment: ‘merger’ in Directive (EU) 2017/1132 means an operation whereby: (a) one or more companies, on being dissolved without going into liquidation, transfer all their assets and liabilities to another existing company, the acquiring company, in exchange for the issue to their members of securities or shares representing the capital of that other company and, if applicable, a cash payment not exceeding 10 % of the nominal value, or, in the absence of a nominal value, of the accounting par value of those securities or shares; or (b) two or more companies, on being dissolved without going into liquidation, transfer all their assets and liabilities to a company that they form, the new company, in exchange for the issue to their members of securities or shares representing the capital of that new company and, if applicable, a cash payment not exceeding 10 % of the nominal value, or in the absence of a nominal value, of the accounting par value of those securities or shares; or (c) a company, on being dissolved without going into liquidation, transfers all its assets and liabilities to the company holding all the securities or shares representing its capital;" (d) one or more companies, on being dissolved without going into liquidation, transfer all their assets and liabilities to another existing company, the acquiring company, without the issue of any new shares by the acquiring company, provided that one person holds directly or indirectly all the shares in the merging companies or the members of the merging companies hold their shares in the same proportion in all merging companies.";
subclass of: Company transaction
subclass of: Restriction
  on property: requires document
  some values from: Company merger plan
equivalent class: Class
  intersection of: Company transaction
  intersection of: Restriction
    min qualified cardinality: 2
    on class: Company
    on property: has transaction input
  intersection of: Restriction
    on class: Company
    on property: has transaction result
    qualified cardinality: 1

Czechia
type: EU country
type: NamedIndividual
label: Česká republika @cz
label: Czech Republic
iso2code: CZ

comment: This is an entity positioning annotation generated by CoModIDE (https://comodide.com/). Removing this annotation will break rendering the CoModIDE schema diagram view.
entity position x: 259.8641767341787
entity position y: 141.81062591873996

comment: This is an entity positioning annotation generated by CoModIDE (https://comodide.com/). Removing this annotation will break rendering the CoModIDE schema diagram view.
entity position x: 73.05750474990312
entity position y: 213.43746597077725

Company conversion certificate
type: Class
comment: A document issued by a Competent Authority declaring that the legally required steps of a conversion are completed. The certificate needs to be presented by a company to either be registered in another company registry or to be removed from a company register.
subclass of: Company transaction certificate

Ultimate beneficial owner
type: Class
comment: Ultimate Beneficial owner refers to the natural person(s) who ultimately owns or controls a customer and/or the natural person on whose behalf a transaction is being conducted. It also includes those persons who exercise ultimate effective control over a legal person or arrangement.
subclass of: Person
subclass of: Company shareholder
subclass of: Restriction
  on property: owns
  some values from: Class
    intersection of: Company
    intersection of: Class
      complement of: Restriction
        on property: has parent company
        some values from: Thing

Domestic company seat transfer
type: Class
comment: The act of changing the location where the company’s business was managed (registered office or headquarters) or the place where that company’s primary business was actually conducted (central administration), within a specific country.
subclass of: Company seat transfer
subclass of: Restriction
  on class: Country
  on property: involves country
  qualified cardinality: 1
equivalent class: Class
  intersection of: Company seat transfer
  intersection of: Restriction
    on class: Country
    on property: involves country
    qualified cardinality: 1
  intersection of: Restriction
    on class: Country
    on property: source country
    qualified cardinality: 1
  intersection of: Restriction
    on class: Country
    on property: target country
    qualified cardinality: 1

Italy
type: EU country
type: NamedIndividual
label: Repubblica Italiana @it
label: Italian Republic
label: Italia @it
iso2code: IT

Cyprus
type: EU country
type: NamedIndividual
iso2code: CY

comment: This is an entity positioning annotation generated by CoModIDE (https://comodide.com/). Removing this annotation will break rendering the CoModIDE schema diagram view.
entity position x: 50.302555531775546
entity position y: 246.93820263180197

comment: This is an entity positioning annotation generated by CoModIDE (https://comodide.com/). Removing this annotation will break rendering the CoModIDE schema diagram view.
entity position x: 18.60762027636168
entity position y: 158.12098050565604

comment: This is an entity positioning annotation generated by CoModIDE (https://comodide.com/). Removing this annotation will break rendering the CoModIDE schema diagram view.
entity position x: 118.52899267564982
entity position y: 235.53118442980525

Company division certificate
type: Class
comment: A document issued by a Competent Authority declaring that the legally required steps of a division are completed. The certificate needs to be presented by a company to either be registered (or register a newly established emerging/recipient company) in another company registry or to be removed from a company register.
subclass of: Company transaction certificate

has sub procedure
type: ObjectProperty
comment: (hasSubProcedure ?ENTITY1 ?ENTITY2) means that some process ?ENTITY1 contains another (shorter) process ?ENTITY2 that should be completed before ?ENTITY1 can complete.
domain: Company transaction
sub property of: Cross-border company mobility transaction relation
Example: (hasSubProcedure seatTransfer1 changeOfCompanyAddress1)

Shareholder exit right
type: Class
comment: The right of a shareholder to exit the company by being bought out.
subclass of: Shareholder right

contained in
type: ObjectProperty
comment: (containedIn ?ENTITY1 ?ENTITY2) means that some document or publication ?ENTITY1 is archived or stored in some other document collection, database or data repository referred to by ?ENTITY2.
domain: Company mobility document
range: Company mobility document repository
sub property of: Cross-border company mobility document relation
Example: (containedIn transactionNotice1 nationalRegistry1)

comment: This is an entity positioning annotation generated by CoModIDE (https://comodide.com/). Removing this annotation will break rendering the CoModIDE schema diagram view.
entity position x: 74.06439273412745
entity position y: 141.5983054032879

comment: This is an entity positioning annotation generated by CoModIDE (https://comodide.com/). Removing this annotation will break rendering the CoModIDE schema diagram view.
entity position x: 30.41568814879539
entity position y: 44.482295217479006

has part
type: ObjectProperty
comment: (hasPart ?ENTITY1 ?ENTITY2) means that the entity referred to by ?ENTITY1 has a constituent entity referred to by ?ENTITY2.
sub property of: Cross-border company mobility entity relation
inverse of: part of

comment: This is an entity positioning annotation generated by CoModIDE (https://comodide.com/). Removing this annotation will break rendering the CoModIDE schema diagram view.
entity position x: 271.4060191302092
entity position y: 136.12357204672944

comment: This is an entity positioning annotation generated by CoModIDE (https://comodide.com/). Removing this annotation will break rendering the CoModIDE schema diagram view.
entity position x: 179.99500355435825
entity position y: 2.5621061400510543

comment: This is an entity positioning annotation generated by CoModIDE (https://comodide.com/). Removing this annotation will break rendering the CoModIDE schema diagram view.
entity position x: 208.96179101635812
entity position y: 248.0793141112707

Data found in registry from country
type: ObjectProperty
comment: In which countries' registry did the researcher find information about the transaction?
domain: Company transaction
range: Country
sub property of: Used

target country
type: ObjectProperty
comment: (targetCountry ?ENTITY1 ?ENTITY2) means that some company transaction ?ENTITY1 has some transaction result (a company) whose place of business is located in the country ?ENTITY2.
sub property of: involves country
Example: (targetCountry crossBorderMerger1 belgium)

Has document source
type: ObjectProperty
comment: In which document did the researcher find information about the transaction?
domain: Company transaction
range: Company mobility document
sub property of: Used

comment: This is an entity positioning annotation generated by CoModIDE (https://comodide.com/). Removing this annotation will break rendering the CoModIDE schema diagram view.
entity position x: 293.41528659106655
entity position y: 32.344300374582026

Raw transaction ID
type: DatatypeProperty
comment: unique identifier before database entry. This id is the old ID-structure used before entry into the CbCMdb
domain: Company transaction
range: positiveInteger

Original company
type: Class
comment: An original company, in the context of a (cross-border) division, means a company which - in case of a full division - transfers all its assets and liabilities to two or more companies, or - in case of a partial division or division by separation - transfers part of its assets and liabilities to one or more companies.
subclass of: Company
subclass of: Restriction
  on property: is transaction input of
  some values from: Company transaction

comment: This is an entity positioning annotation generated by CoModIDE (https://comodide.com/). Removing this annotation will break rendering the CoModIDE schema diagram view.
entity position x: 86.70589945626561
entity position y: 80.59915240550438

comment: This is an entity positioning annotation generated by CoModIDE (https://comodide.com/). Removing this annotation will break rendering the CoModIDE schema diagram view.
entity position x: 255.74268679131885
entity position y: 42.2059024226523

Requirement level
type: AnnotationProperty
comment: Specifies a phrase to indicate the degree to which the providing of a value for the entity (e.g. a data or object property) in question is compulsory, recommended or optional.
sub property of: comment
Example: Examples include: MUST, SHOULD, RECOMMENDED and OPTIONAL

Hungary
type: EU country
type: NamedIndividual
label: Magyarország @hu
iso2code: HU

comment: This is an entity positioning annotation generated by CoModIDE (https://comodide.com/). Removing this annotation will break rendering the CoModIDE schema diagram view.
entity position x: 42.011423587201364
entity position y: 77.61589925340833

applicable to
type: ObjectProperty
comment: (applicableTo ?ENTITY1 ?ENTITY2) means that some legal right ?ENTITY1 is awarded or assigned to a particular person or agent ?ENTITY2.
domain: Transaction right
range: Agent
sub property of: Cross-border company mobility object relation
Example: (applicableTo creditorRight1 person1)

comment: This is an entity positioning annotation generated by CoModIDE (https://comodide.com/). Removing this annotation will break rendering the CoModIDE schema diagram view.
entity position x: 54.567750498984374
entity position y: 266.3528805993735

comment: This is an entity positioning annotation generated by CoModIDE (https://comodide.com/). Removing this annotation will break rendering the CoModIDE schema diagram view.
entity position x: 76.24578994947785
entity position y: 294.15047197456164

Ireland
type: EU country
type: NamedIndividual
label: Éire @ga
iso2code: IE

Creditor security right
type: Class
comment: Member States shall provide for an adequate system of protection of the interest of creditors, and shall ensure that creditors who are dissatisfied with the safeguards offered in the draft terms of the transaction, as provided for in Article 86d (1) point (f), may apply to the appropriate administrative or judicial authority for adequate safeguards provided that they can credibly demonstrate that due to the transaction the satisfaction of their claims is at stake and that no adequate safeguards have been obtained from the company.
subclass of: Creditor right

comment: This is an entity positioning annotation generated by CoModIDE (https://comodide.com/). Removing this annotation will break rendering the CoModIDE schema diagram view.
entity position x: 255.33872816165007
entity position y: 101.74018980534287

Geo-political region
type: Class
comment: A spatial region on earth whose boundaries are determined by a combination of geographical, ecological, climatic, socio-economic and political criteria.
subclass of: BFO_0000028

comment: This is an entity positioning annotation generated by CoModIDE (https://comodide.com/). Removing this annotation will break rendering the CoModIDE schema diagram view.
entity position x: 56.79302020727886
entity position y: 120.19618503015933

Manager decision right
type: Class
comment: The right of the board of management or individual managers to take decisions or to not take a decision in the context of a transaction. These are in the form of a board resolution.
subclass of: Manager right

comment: This is an entity positioning annotation generated by CoModIDE (https://comodide.com/). Removing this annotation will break rendering the CoModIDE schema diagram view.
entity position x: 284.76647483358886
entity position y: 69.88501053785384

Transaction notice date
type: DatatypeProperty
comment: Date of the transaction notice (document announcing the transaction) constituting the start of the transaction process. Date that the document was published (which is the important date because this is when it becomes legally binding)
domain: Company transaction
range: dateTime

comment: This is an entity positioning annotation generated by CoModIDE (https://comodide.com/). Removing this annotation will break rendering the CoModIDE schema diagram view.
entity position x: 144.54909990026624
entity position y: 46.502018924869994

City
type: Class
comment: A city (plural "cities") is a geo-political region in which there is a large human settlement. The distinction with the term "town" (plural "towns") is that cities are generally larger than towns. Countries are generally larger than cities and, in fact, usually consist of multiple cities.
subclass of: Geo-political region
subclass of: Restriction
  on class: Country
  on property: located in
  qualified cardinality: 1

comment: This is an entity positioning annotation generated by CoModIDE (https://comodide.com/). Removing this annotation will break rendering the CoModIDE schema diagram view.
entity position x: 108.47238212220519
entity position y: 214.27123601513512

has recipient company
type: ObjectProperty
comment: (hasRecipientCompany ?ENTITY1 ?ENTITY2) means that some company division transaction ?ENTITY1 produces two or more distinct companies, one of which is ?ENTITY2 (a so-called "recipient company").
domain: Company division
range: Company
sub property of: has transaction result
Example: (hasMergingCompany crossBorderMerger1 company1)

comment: This is an entity positioning annotation generated by CoModIDE (https://comodide.com/). Removing this annotation will break rendering the CoModIDE schema diagram view.
entity position x: 276.0115870665009
entity position y: 294.9635318549822

Cross-border merger into a new company with a Societas Europaea form
type: Class
comment: This is a cross-border merger where two or more companies from different Member States merge into a new company that has a special legal form called a Societas Europaea (SE) which allows the behavior of this new company to be regulated under European Law (rather than national law).
subclass of: Cross-border merger into a new company

SupervisoryAuthority
type: Class
comment: An individual authority established by its member state to supervise the compliance with a specific regulation.
subclass of: Organisation

Global ultimate owner
type: Class
comment: A global ultimate owner (GUO) is the individual or entity at the top of the corporate ownership structure.
subclass of: Stakeholder in a company
subclass of: Restriction
  on property: owns
  some values from: Company

Subsidiary company
type: Class
comment: A subsidiary, subsidiary company or daughter company is a company that is owned or controlled by another company, which is called the parent company, parent, or holding company.
equivalent class: Class
  intersection of: Company
  intersection of: Restriction
    on property: has parent company
    some values from: Company

comment: This is an entity positioning annotation generated by CoModIDE (https://comodide.com/). Removing this annotation will break rendering the CoModIDE schema diagram view.
entity position x: 11.505726890655758
entity position y: 298.46981551503904

comment: This is an entity positioning annotation generated by CoModIDE (https://comodide.com/). Removing this annotation will break rendering the CoModIDE schema diagram view.
entity position x: 126.91251100807739
entity position y: 194.54094889701943

comment: This is an entity positioning annotation generated by CoModIDE (https://comodide.com/). Removing this annotation will break rendering the CoModIDE schema diagram view.
entity position x: 298.5674566125939
entity position y: 90.52226590467312

Greece
type: EU country
type: NamedIndividual
label: Ελλάδα @gr
label: Ellada @gr
iso2code: GR
iso2code: EL

Company
type: Class
comment: A company is a legal entity formed by a group of individuals to engage in and operate a business—commercial or industrial—enterprise. A company may be organized in various ways for tax and financial liability purposes depending on the corporate law of its jurisdiction.
subclass of: Organisation
subclass of: Restriction
  on class: Registered office
  on property: has part
  qualified cardinality: 1
subclass of: Restriction
  on class: Central Administration
  on property: has part
  qualified cardinality: 1
subclass of: Restriction
  on property: has member
  some values from: Company employee

Estonia
type: EU country
type: NamedIndividual
label: Eesti @ee
iso2code: EE

Agent
type: Class
comment: An entity or group of entities (either biological or non-biological) that is able to perform actions autonomously in the world.
subclass of: BFO_0000040

comment: This is an entity positioning annotation generated by CoModIDE (https://comodide.com/). Removing this annotation will break rendering the CoModIDE schema diagram view.
entity position x: 107.43623102247348
entity position y: 129.88046751595175

Company pre-conversion certificate
type: Class
comment: Article 86m: a pre-conversion certificate attests compliance with all the relevant conditions and the proper completion of all procedures and formalities in the departure Member State.
subclass of: Company transaction certificate

Organisation
type: Class
comment: Represents a collection of people organized together into a community or other social, commercial or political structure. The group has some common purpose or reason for existence which goes beyond the set of people belonging to it and can act as an Agent. Organizations are often decomposable into hierarchical structures.
subclass of: Agent
disjoint with: Person

maintained by
type: ObjectProperty
comment: (maintainedBy ?ENTITY1 ?ENTITY2) means that some digital resource ?ENTITY1 (e.g. database, website, document repository etc.) has stewardship by some agent or organisation ?ENTITY2 who is responsible for the upkeep of ?ENTITY1.
sub property of: Cross-border company mobility document relation
Example: (maintainedBy officialJournalRepository1 officialJournalAdministration1)
inverse of: maintains

Romania
type: EU country
type: NamedIndividual
label: România @ro
iso2code: RO

comment: This is an entity positioning annotation generated by CoModIDE (https://comodide.com/). Removing this annotation will break rendering the CoModIDE schema diagram view.
entity position x: 100.68738477341026
entity position y: 213.01461505654413

employed by
type: ObjectProperty
comment: (employedBy ?ENTITY1 ?ENTITY2) means that some agent (person or organisation) ?ENTITY1 is promised and delivered an incentive (usually financial) to perform some work for ?ENTITY2 where ?ENTITY2 is an organisation. This exchange is usually governed by law and formal regulations in the particular country or social context in which the work is being performed.
domain: Class
  union of: Organisation
  union of: Person
range: Class
  union of: Organisation
  union of: Person
sub property of: has company stakeholder
Example: (employedBy person1 company1)
inverse of: employs

Creditor exit right
type: Class
comment: The creditors right to be paid out and therefore to exit the company in the context of a transaction.
subclass of: Creditor right

comment: This is an entity positioning annotation generated by CoModIDE (https://comodide.com/). Removing this annotation will break rendering the CoModIDE schema diagram view.
entity position x: 200.4737250571208
entity position y: 61.89354059165436

Company division plan
type: Class
comment: The management or administrative organ of the company shall draw up the draft terms of a division. The draft terms of a division shall include at least the particulars listed in article 160d.
subclass of: Transaction document

comment: This is an entity positioning annotation generated by CoModIDE (https://comodide.com/). Removing this annotation will break rendering the CoModIDE schema diagram view.
entity position x: 7.893435210269165
entity position y: 235.7528455758641

Attribute
type: Class
comment: An attribute is a characteristic of some entity.
subclass of: BFO_0000141

comment: This is an entity positioning annotation generated by CoModIDE (https://comodide.com/). Removing this annotation will break rendering the CoModIDE schema diagram view.
entity position x: 107.24090116681467
entity position y: 97.57588854422639

comment: This is an entity positioning annotation generated by CoModIDE (https://comodide.com/). Removing this annotation will break rendering the CoModIDE schema diagram view.
entity position x: 151.79064556421153
entity position y: 223.262266343131

Belgium
type: EU country
type: NamedIndividual
label: Belgique @fr
iso2code: BE

comment: This is an entity positioning annotation generated by CoModIDE (https://comodide.com/). Removing this annotation will break rendering the CoModIDE schema diagram view.
entity position x: 11.806501569175973
entity position y: 266.3880979890687

Cross-border company mobility object relation
type: ObjectProperty
comment: (cbcmObjectRelation ?ENTITY1 ?ENTITY2) means that the relation between ?ENTITY1 and ?ENTITY2 captures information pertaining to an object.
sub property of: Cross-border company mobility entity relation

comment: This is an entity positioning annotation generated by CoModIDE (https://comodide.com/). Removing this annotation will break rendering the CoModIDE schema diagram view.
entity position x: 56.39142121243984
entity position y: 216.7825777726235

reported in
type: ObjectProperty
comment: (reportedIn ?ENTITY1 ?ENTITY2) means that some significant event, process or statement ?ENTITY1 is published or mentioned or declared in writing in some publication, document or database ?ENTITY2.
domain: Company transaction
range: Company transaction notice
sub property of: Cross-border company mobility document relation
Example: (reportedIn crossBorderMerger1 transactionNotice1)

comment: This is an entity positioning annotation generated by CoModIDE (https://comodide.com/). Removing this annotation will break rendering the CoModIDE schema diagram view.
entity position x: 266.82391948733857
entity position y: 212.27581118427403

comment: This is an entity positioning annotation generated by CoModIDE (https://comodide.com/). Removing this annotation will break rendering the CoModIDE schema diagram view.
entity position x: 200.92840759111368
entity position y: 14.241868874997104

Financial service authority
type: Class
comment: A body that regulates the financial services industry in a country (e.g. the UK), including most financial services markets, exchanges and firms.
subclass of: Competent authority

Information right
type: Class
comment: The right of employees or their representatives to be informed and to receive any documents necessary for the exercise of their consultation and board-level employee representation rights in the context of an intended merger/division/conversion/seat transfer.
subclass of: Social right

Shareholder right
type: Class
comment: The rights of shareholders of a company in the context of a transaction. Often, shreholder resolutions are used to effectuate shareholder rights. Many rights are laid down in the so-called Shareholder Rights Directive.
subclass of: Transaction right
subclass of: Restriction
  on property: applicable to
  some values from: Company shareholder

comment: This is an entity positioning annotation generated by CoModIDE (https://comodide.com/). Removing this annotation will break rendering the CoModIDE schema diagram view.
entity position x: 39.890708486514455
entity position y: 90.27129916163625

comment: This is an entity positioning annotation generated by CoModIDE (https://comodide.com/). Removing this annotation will break rendering the CoModIDE schema diagram view.
entity position x: 221.92898583435658
entity position y: 196.58312903470244

comment: This is an entity positioning annotation generated by CoModIDE (https://comodide.com/). Removing this annotation will break rendering the CoModIDE schema diagram view.
entity position x: 255.33845538498926
entity position y: 160.2244819330443

Diverging employment figure
type: DatatypeProperty
comment: If a different employee number for the acquiring company is found, it is recorded in this field
domain: Company transaction
range: nonNegativeInteger

Pre-transaction company form
type: ObjectProperty
comment: (?ENTITY1 hasPriorCompanyForm ?ENTITY2) indicates the original company form of a company undergoing a cross border conversion or a national conversion.
domain: Company transaction
range: Company form
sub property of: has transaction input

comment: This is an entity positioning annotation generated by CoModIDE (https://comodide.com/). Removing this annotation will break rendering the CoModIDE schema diagram view.
entity position x: 83.62888044594364
entity position y: 188.84200669650346

Cross-border merger
type: Class
comment: A cross border merger involves at least one company based in an EU Member State and one company that is registered elsewhere within the European Union and is leading to a universal transfer of assets and liabilities from the merging company to the acquiring company.
subclass of: Company merger
subclass of: Restriction
  on property: has transaction input
  some values from: Acquiring company
subclass of: Restriction
  on property: source country
  some values from: Country
subclass of: Restriction
  on property: has transaction input
  some values from: Merging company
subclass of: Restriction
  on class: Country
  on property: target country
  qualified cardinality: 1
equivalent class: Class
  intersection of: Company merger
  intersection of: Restriction
    on property: source country
    some values from: Country
  intersection of: Restriction
    min qualified cardinality: 2
    on class: Country
    on property: involves country
  intersection of: Restriction
    on class: Country
    on property: target country
    qualified cardinality: 1

Is SE creation
type: DatatypeProperty
comment: Variable indicating whether this case concerns an SE-creation (yes/no) to distinguish creations of SEs from other transactions
domain: Company transaction
range: boolean

Company domestic merger
type: Class
comment: A domestic merger involves at least two companies based in the same EU Member State and is leading to a universal transfer of assets and liabilities from the merging company to the acquiring company.
subclass of: Company merger
subclass of: Restriction
  on class: Country
  on property: involves country
  qualified cardinality: 1
subclass of: Restriction
  on property: has transaction input
  some values from: Merging company
subclass of: Restriction
  on property: has transaction input
  some values from: Acquiring company

comment: This is an entity positioning annotation generated by CoModIDE (https://comodide.com/). Removing this annotation will break rendering the CoModIDE schema diagram view.
entity position x: 270.8596897409068
entity position y: 157.43078465846642

Independent expert
type: Class
comment: An Independent Expert provides impartial advice to shareholders and other company stakeholders on the fairness and/or reasonableness of a transaction. A company may be required to commission an Independent Expert Report (IER) in the case of a (cross-border) merger, division or conversion.
subclass of: Stakeholder in a company

comment: This is an entity positioning annotation generated by CoModIDE (https://comodide.com/). Removing this annotation will break rendering the CoModIDE schema diagram view.
entity position x: 90.9580734272183
entity position y: 177.1083906910626

Emerging company
type: Class
comment: A company being divided transfers part of its assets and liabilities to one or more newly formed companies, which are the recipient companies in a (cross-border) division.
subclass of: Company

comment: This is an entity positioning annotation generated by CoModIDE (https://comodide.com/). Removing this annotation will break rendering the CoModIDE schema diagram view.
entity position x: 238.3474594368345
entity position y: 123.46221383706843

Luxembourg
type: EU country
type: NamedIndividual
label: Lëtzebuerg @lb
label: Großherzogtum Luxemburg​ @de
label: Groussherzogtum Lëtzebuerg @lb
label: Grand-Duché de Luxembourg @fr
label: Grand Duchy of Luxembourg
iso2code: LU

comment: This is an entity positioning annotation generated by CoModIDE (https://comodide.com/). Removing this annotation will break rendering the CoModIDE schema diagram view.
entity position x: 272.05118963883785
entity position y: 279.7317598351278

Company merger certificate
type: Class
comment: A document issued by a Competent Authority declaring that the legally required steps of a merger are completed. The certificate needs to be presented by a company to either be registered in another company registry or to be removed from a company register (depending on the company being the merging or acquiring company).
subclass of: Company transaction certificate

Manager exit right
type: Class
comment: The right of a manager or the board of management to resign and therefore exit a company.
subclass of: Manager right

comment: This is an entity positioning annotation generated by CoModIDE (https://comodide.com/). Removing this annotation will break rendering the CoModIDE schema diagram view.
entity position x: 28.764216387775047
entity position y: 243.23796989617148

Impact on employment information right
type: Class
comment: The right of employees or their representatives to be informed on the likely repercussions of the cross-border transaction on employment, which includes the dismissal as well as the hiring of employees or relocation of work. See for instance article 122 of Directive 2017/1132.
subclass of: Information right

comment: This is an entity positioning annotation generated by CoModIDE (https://comodide.com/). Removing this annotation will break rendering the CoModIDE schema diagram view.
entity position x: 13.979425487423738
entity position y: 212.70736804000302

Has EWC
type: DatatypeProperty
comment: Is the company having a European Works Council (EWC)?
domain: Company
range: boolean

Official journal
type: Class
comment: The official gazette of record for the European Union or national gazette of record of a Member State. In the official journal companies publish transaction notices in order to inform concerned stakeholders and interested parties.
subclass of: Organisation

Transfer of company central administration
type: Class
comment: Act of modifying the location where the company’s business was managed or the place where that company’s business was actually conducted.
subclass of: Procedure

comment: This is an entity positioning annotation generated by CoModIDE (https://comodide.com/). Removing this annotation will break rendering the CoModIDE schema diagram view.
entity position x: 30.621950598679454
entity position y: 294.2270568539971

has subsidiary company
type: ObjectProperty
comment: (hasSubsidiaryCompany ?ENTITY1 ?ENTITY2) means (hasParentCompany ?ENTITY2 ?ENTITY1)
sub property of: Cross-border company mobility organisation relation

EU country
type: Class
comment: A country which forms part of the European Union. The European Union is a conglomeration of European countries whose governance structures agree to abide with common political and economic criteria to improve efficiency of goods and services trading as well as movement and migration of inhabitants between these countries
subclass of: European Economic Area country
disjoint with: Non-EU country

comment: This is an entity positioning annotation generated by CoModIDE (https://comodide.com/). Removing this annotation will break rendering the CoModIDE schema diagram view.
entity position x: 51.581143916293996
entity position y: 284.32699686683605

comment: This is an entity positioning annotation generated by CoModIDE (https://comodide.com/). Removing this annotation will break rendering the CoModIDE schema diagram view.
entity position x: 181.53183624074484
entity position y: 279.75477353816734

comment: This is an entity positioning annotation generated by CoModIDE (https://comodide.com/). Removing this annotation will break rendering the CoModIDE schema diagram view.
entity position x: 65.82910021828245
entity position y: 10.307924969462757

comment: This is an entity positioning annotation generated by CoModIDE (https://comodide.com/). Removing this annotation will break rendering the CoModIDE schema diagram view.
entity position x: 137.45599283527315
entity position y: 140.18810313160142

comment: This is an entity positioning annotation generated by CoModIDE (https://comodide.com/). Removing this annotation will break rendering the CoModIDE schema diagram view.
entity position x: 89.07393569063014
entity position y: 255.2221941277188

AC Employees count at transaction
type: DatatypeProperty
comment: number of employees of the acquiring company - at the moment of the transaction
domain: Company transaction
range: nonNegativeInteger

Court
type: Class
comment: Legal forum in which a body of people presided over by a judge, judges, or magistrate, and acting as a tribunal in civil and criminal cases resolve legal disputes.
subclass of: Competent authority

comment: This is an entity positioning annotation generated by CoModIDE (https://comodide.com/). Removing this annotation will break rendering the CoModIDE schema diagram view.
entity position x: 28.54350686833721
entity position y: 279.13445695705747

Has negotiated agreement
type: DatatypeProperty
comment: Is the management of the companies involved starting the process of setting up a Special Negotiating Body (SNB) in order to reach a negotiated agreement on the future employee participation mechanism (BLER) after the transaction? BLER (Board-Level Employee Represenation): highest level of employee involvement in a company in the supervisory board. They can take co-determine decisions of the company's management and where the company is heading. - Yes: there is a negotiated agreement to be negotiated with the SNB; - No: no negotiated agreement; - Not applicable: the conditions are not met (e.g. no employees, BLER threshold not met) for this criterion to be applicable; - Unclear: the wording of the document is unclear with regard to the impact/effect/measures taken; - Not mentioned: given the parameters, this aspect should be addressed in the transaction document, but is not mentioned
domain: Company transaction
range: string

comment: This is an entity positioning annotation generated by CoModIDE (https://comodide.com/). Removing this annotation will break rendering the CoModIDE schema diagram view.
entity position x: 127.92838937233955
entity position y: 295.2726163109125

owned by
type: ObjectProperty
comment: (ownedBy ?ENTITY1 ?ENTITY2) means that some agent ?ENTITY2 has proprietorship over another object or organisational agent ?ENTITY1.
sub property of: has company stakeholder
Example: (ownedBy company1 company2)
inverse of: owns

comment: This is an entity positioning annotation generated by CoModIDE (https://comodide.com/). Removing this annotation will break rendering the CoModIDE schema diagram view.
entity position x: 143.69597681603065
entity position y: 191.57516634769303

Transaction comment
type: DatatypeProperty
comment: Notes from researcher about the transaction
domain: Company transaction
range: string

Transfer of company registered office
type: Class
comment: The act of changing the registered office, which is the official address of an incorporated company, association or any other legal entity.
subclass of: Procedure

Last employment figure for the merging company
type: DatatypeProperty
comment: The last available annual employment figure for the merging company
domain: Company transaction
range: nonNegativeInteger

is BLER existing prior
type: DatatypeProperty
comment: Is an employee board level representation/participation (BLER) mechanism applicable prior to the cross-border transaction? 0 = no BLER prior to cross-border transaction 1 = BLER existing prior to cross-border transaction
domain: Company transaction
range: boolean

comment: This is an entity positioning annotation generated by CoModIDE (https://comodide.com/). Removing this annotation will break rendering the CoModIDE schema diagram view.
entity position x: 87.28614759312607
entity position y: 249.62242605720274

involves the change of
type: ObjectProperty
comment: (involvesChangeOf ?ENTITY1 ?ENTITY2) means that the process ?ENTITY1 requires the modification or alteration of the entity or object ?ENTITY2.
sub property of: Cross-border company mobility entity relation
Example: (involvesChangeOf seatTransfer1 businessAddress1)

comment: This is an entity positioning annotation generated by CoModIDE (https://comodide.com/). Removing this annotation will break rendering the CoModIDE schema diagram view.
entity position x: 62.432611420326666
entity position y: 51.099202273356305

Manager right
type: Class
comment: The rights of members of the management in the context of a company transaction.
subclass of: Transaction right
subclass of: Restriction
  on property: applicable to
  some values from: Manager

comment: This is an entity positioning annotation generated by CoModIDE (https://comodide.com/). Removing this annotation will break rendering the CoModIDE schema diagram view.
entity position x: 191.645511128654
entity position y: 139.17768712299383

has member
type: ObjectProperty
comment: (hasMember ?ENTITY1 ?ENTITY2) means that some agent ?ENTITY1 (usually an organisation) has a person ?ENTITY2 that participates in its activities. This need not represent an employment role nor imply financial incentives between the organisation and person.
domain: Organisation
range: Person
sub property of: has company stakeholder
Example: (hasMember worksCouncil1 employee1)

comment: This is an entity positioning annotation generated by CoModIDE (https://comodide.com/). Removing this annotation will break rendering the CoModIDE schema diagram view.
entity position x: 69.33316759149946
entity position y: 221.56037559499444

comment: This is an entity positioning annotation generated by CoModIDE (https://comodide.com/). Removing this annotation will break rendering the CoModIDE schema diagram view.
entity position x: 38.09816258693692
entity position y: 78.83721973670418

Tax authority
type: Class
comment: Tax Authority means any governmental authority having jurisdiction over the assessment, determination, collection or imposition of any tax.
subclass of: Competent authority

Cross-border conversion
type: Class
comment: A cross-border conversion is an operation through which a company, formed in one country (with the EU/EEA set of countries) is converted into a company governed by the law of another.
subclass of: Company conversion
subclass of: Restriction
  on class: Country
  on property: involves country
  qualified cardinality: 2
subclass of: Restriction
  on property: requires document
  some values from: Company pre-conversion certificate
subclass of: Restriction
  on property: has transaction result
  some values from: Company

comment: This is an entity positioning annotation generated by CoModIDE (https://comodide.com/). Removing this annotation will break rendering the CoModIDE schema diagram view.
entity position x: 250.28265001612223
entity position y: 17.779310164409353

Board-level employee representation right
type: Class
comment: Board-level representation of employees (BLER) refers to the phenomenon where employees or their representatives elect or appoint representatives to the strategic decision-making body of a company (i.e. the supervisory board or non-executive board in a one-tier system). The BLER right requires that if such a system of BLER exists prior to a cross-border company transaction, such a right must be upheld in the acquiring/recipient company under the "before-and-after-principle".
subclass of: Social right

Transaction completion date
type: DatatypeProperty
comment: Date on which the transaction was effectuated (the date that the competent authority e.g., business registry of that country, says that the criteria have been met by merging and acquiring companies and the merging/transferring company is dissolved). This is the final step of a transaction process
domain: Company transaction
range: dateTime

comment: This is an entity positioning annotation generated by CoModIDE (https://comodide.com/). Removing this annotation will break rendering the CoModIDE schema diagram view.
entity position x: 35.11706116658252
entity position y: 293.43814503150423

comment: This is an entity positioning annotation generated by CoModIDE (https://comodide.com/). Removing this annotation will break rendering the CoModIDE schema diagram view.
entity position x: 159.33996695202816
entity position y: 229.01179631361057

Shareholder decision right
type: Class
comment: The shareholders can take a number of decisions affecting the company, such as amending the company's articles of association, appointing or dismissing board members and to approve important transactions (e.g. mergers, divisions and conversions/seat transfers). These are taken through a shareholder resolution.
subclass of: Shareholder right

Companies have Economic Committee
type: DatatypeProperty
comment: Are the companies involved in the transaction having an economic committee? An economic committee advises the work council about the financial parts of the transaction.
domain: Company transaction
range: boolean

Registered Office
type: DatatypeProperty
comment: Deprecated property

comment: This is an entity positioning annotation generated by CoModIDE (https://comodide.com/). Removing this annotation will break rendering the CoModIDE schema diagram view.
entity position x: 131.54816779005884
entity position y: 8.817742238887039

Diverging employment figure year
type: DatatypeProperty
comment: The year for which a diverging employee number is recorded
domain: Company transaction
range: dateTime

Company primary registration location
type: ObjectProperty
comment: Primary country of registration (location) of a company as a full country name
domain: Company
range: Country
sub property of: located in

Competent authority
type: Class
comment: The monitoring of the completion and legality of the decision-making process in each company involved in a transaction is carried out by a national authority having jurisdiction over each of those companies. The national authority could be a court, a notary or any other competent authority appointed by the Member State concerned.
subclass of: Organisation

comment: This is an entity positioning annotation generated by CoModIDE (https://comodide.com/). Removing this annotation will break rendering the CoModIDE schema diagram view.
entity position x: 225.48046952557277
entity position y: 266.03873148666065

has acquiring company
type: ObjectProperty
comment: (hasAcquiringCompany ?ENTITY1 ?ENTITY2) means that some company merger transaction ?ENTITY1 produces a new company or alters an existing one (?ENTITY2) such that ?ENTITY2 will acquire (via a universal transfer of assets and liabilities) one or more other companies involved in the process ?ENTITY1.
domain: Company merger
range: Company
sub property of: has transaction result
Example: (hasAcquiringCompany crossBorderMerger1 company1)

Organization name
type: DatatypeProperty
comment: The name of the organization
range: string

involves country
type: ObjectProperty
comment: (involvesCountry ?ENTITY1 ?ENTITY2) means that some company transaction ?ENTITY1 includes the modification of a company whose place of business is located in the country referred to by ?ENTITY2
domain: Company transaction
range: Country
sub property of: Cross-border company mobility transaction relation
Example: (involvesCountry crossBorderMerger1 france)

comment: This is an entity positioning annotation generated by CoModIDE (https://comodide.com/). Removing this annotation will break rendering the CoModIDE schema diagram view.
entity position x: 155.30759761766964
entity position y: 245.90165854196664

comment: This is an entity positioning annotation generated by CoModIDE (https://comodide.com/). Removing this annotation will break rendering the CoModIDE schema diagram view.
entity position x: 93.06278917729631
entity position y: 31.878096888108217

Last WW employment figure year
type: DatatypeProperty
comment: Year in which the last worldwide employment figure was recorded
domain: Company transaction
range: dateTime

comment: This is an entity positioning annotation generated by CoModIDE (https://comodide.com/). Removing this annotation will break rendering the CoModIDE schema diagram view.
entity position x: 205.63858499468532
entity position y: 211.08101379570442

comment: This is an entity positioning annotation generated by CoModIDE (https://comodide.com/). Removing this annotation will break rendering the CoModIDE schema diagram view.
entity position x: 176.73319936385965
entity position y: 168.4700518123201

Company shareholder
type: Class
comment: An individual, group, or organization that owns one or more shares in a company, and in whose name the share certificate is issued.
subclass of: Stakeholder in a company
subclass of: Restriction
  on property: part of
  some values from: Company

Company Form
type: ObjectProperty
comment: Company legal form. Name given to describe the structure of a corporation or buiness in the different legal orders. For example Limited (Ltd.), Public Limited Company (PLC), Gesellschaft mit beschränkter Haftung (GmbH), Aktiengesellschaft (AG). The company legal form is regulated under national law and grants specific rights and obligations to the company stakeholders (such as shareholders, management & employees).
domain: Company
range: Company form
sub property of: Cross-border company mobility organisation relation

Austria
type: EU country
type: NamedIndividual
label: Österreich @de
iso2code: AT

comment: This is an entity positioning annotation generated by CoModIDE (https://comodide.com/). Removing this annotation will break rendering the CoModIDE schema diagram view.
entity position x: 35.933964425097344
entity position y: 258.5099794114055

Example
type: AnnotationProperty
comment: Provides a human-readable written example of the entity in question.
sub property of: comment

comment: This is an entity positioning annotation generated by CoModIDE (https://comodide.com/). Removing this annotation will break rendering the CoModIDE schema diagram view.
entity position x: 232.7136997444631
entity position y: 106.88266359209778

comment: This is an entity positioning annotation generated by CoModIDE (https://comodide.com/). Removing this annotation will break rendering the CoModIDE schema diagram view.
entity position x: 135.9577611146716
entity position y: 5.799956832418123

Societas Europaea (SE) type
type: Class
comment: Variable indicating the SE-establishment mode: by merger, conversion, holding-SE, subsidiary-SE or unsure (cases)
subclass of: Attribute

National registry repository
type: Class
comment: The digital repository in which documents published in the official journal or by by the national registry (on behalf of a company) are kept as well as related documents. In some EU Member States, this repository is overlapping or identical with the Official Journal Repository.
subclass of: Company mobility document repository
subclass of: Restriction
  on property: maintained by
  some values from: National registry

comment: This is an entity positioning annotation generated by CoModIDE (https://comodide.com/). Removing this annotation will break rendering the CoModIDE schema diagram view.
entity position x: 117.7666860918943
entity position y: 216.65703424349607

comment: This is an entity positioning annotation generated by CoModIDE (https://comodide.com/). Removing this annotation will break rendering the CoModIDE schema diagram view.
entity position x: 21.38698645493781
entity position y: 257.0334908946398

comment: This is an entity positioning annotation generated by CoModIDE (https://comodide.com/). Removing this annotation will break rendering the CoModIDE schema diagram view.
entity position x: 187.87257061929267
entity position y: 273.08685625360033

comment: This is an entity positioning annotation generated by CoModIDE (https://comodide.com/). Removing this annotation will break rendering the CoModIDE schema diagram view.
entity position x: 234.4838716249161
entity position y: 260.13785809555594

comment: This is an entity positioning annotation generated by CoModIDE (https://comodide.com/). Removing this annotation will break rendering the CoModIDE schema diagram view.
entity position x: 210.0879626302195
entity position y: 24.487612524612793

Special negotiating body
type: Class
comment: The Special Negotiation Body (SNB) or Special Negotiating Body is an organisation that represents the employees of companies in negotiations with the company authorities in order to reach a written agreement on the involvement of employees in company transactions.
subclass of: Organisation

comment: This is an entity positioning annotation generated by CoModIDE (https://comodide.com/). Removing this annotation will break rendering the CoModIDE schema diagram view.
entity position x: 187.77010907114797
entity position y: 14.845654119928787

Domestic merger into a new company
type: Class
comment: Article 90: the operation whereby several companies are wound up without going into liquidation and transfer to a company that they set up all their assets and liabilities in exchange for the issue to their shareholders of shares in the new company and a cash payment, if any, not exceeding 10 % of the nominal value of the shares so issued or, where they have no nominal value, of their accounting par value. All companies involved are from a single country.
subclass of: Company domestic merger
subclass of: Restriction
  on property: has transaction result
  some values from: Emerging company
subclass of: Restriction
  on property: has transaction input
  some values from: Merging company

comment: This is an entity positioning annotation generated by CoModIDE (https://comodide.com/). Removing this annotation will break rendering the CoModIDE schema diagram view.
entity position x: 260.3444008641074
entity position y: 17.15921205433361

comment: This is an entity positioning annotation generated by CoModIDE (https://comodide.com/). Removing this annotation will break rendering the CoModIDE schema diagram view.
entity position x: 190.6864679082266
entity position y: 133.79335356253344

comment: This is an entity positioning annotation generated by CoModIDE (https://comodide.com/). Removing this annotation will break rendering the CoModIDE schema diagram view.
entity position x: 133.07894884155147
entity position y: 204.49364169261378

Company secondary registration location
type: ObjectProperty
comment: Country of secondary registration (location) of a company
domain: Company
range: Country
sub property of: located in

comment: This is an entity positioning annotation generated by CoModIDE (https://comodide.com/). Removing this annotation will break rendering the CoModIDE schema diagram view.
entity position x: 257.60865771127436
entity position y: 284.67062326777886

Organisational unit
type: Class
comment: A division of a large organization such as a government, university, or business, dealing with a specific area of activity.
subclass of: Agent
disjoint with: Person

Portuguese Republic
type: EU country
type: NamedIndividual
label: República Portuguesa @pt
label: Portugal
iso2code: PT

comment: This is an entity positioning annotation generated by CoModIDE (https://comodide.com/). Removing this annotation will break rendering the CoModIDE schema diagram view.
entity position x: 165.83544115187456
entity position y: 154.98450044856756

comment: This is an entity positioning annotation generated by CoModIDE (https://comodide.com/). Removing this annotation will break rendering the CoModIDE schema diagram view.
entity position x: 64.72631246318619
entity position y: 61.32884440106744

issued by organisation
type: ObjectProperty
comment: (issuedByOrganisation ?ENTITY1 ?ENTITY2) means that some document or publication, ?ENTITY1, was created (and possibly delivered or administered to another entity) by some entity ?ENTITY2.
domain: Company mobility document
range: Organisation
sub property of: Cross-border company mobility document relation
Example: (issuedByOrganisation document1 organisation1)

Parent company
type: Class
comment: A parent company is a company that has a controlling interest in another company, the subsidiary company, giving it control of its operations through a majority stock-ownership, decisive control over management appointments and therefore over the decision-making process. In the absence of a natural person as ultimate beneficial owner, the highest parent company in a chain of companies is the global ultimate owner.
equivalent class: Class
  intersection of: Company
  intersection of: Restriction
    on property: has subsidiary company
    some values from: Company

Cross-border company division
type: Class
comment: A company which in a process of the cross-border division in case of a full division transfers all its assets and liabilities to two or more companies, or in case of a partial division or division by separation transfers part of its assets and liabilities to one or more companies. The companies involved in the process are located in multiple (two or more) distinct countries.
subclass of: Company division
equivalent class: Class
  intersection of: Company division
  intersection of: Restriction
    min qualified cardinality: 2
    on class: Country
    on property: involves country

Company transaction certificate
type: Class
comment: A document issued by a Competent Authority declaring that certain steps of the transaction are completed.
subclass of: Transaction document

Company headquarter
type: Class
comment: The location of a company headquarter
subclass of: Organisational unit

Republic of Poland
type: EU country
type: NamedIndividual
label: Rzeczpospolita Polska @pl
label: Polska @pl
label: Poland
iso2code: PL

comment: This is an entity positioning annotation generated by CoModIDE (https://comodide.com/). Removing this annotation will break rendering the CoModIDE schema diagram view.
entity position x: 142.23301817604346
entity position y: 127.8720311884132

comment: This is an entity positioning annotation generated by CoModIDE (https://comodide.com/). Removing this annotation will break rendering the CoModIDE schema diagram view.
entity position x: 115.5742918611993
entity position y: 78.99288710365471

comment: This is an entity positioning annotation generated by CoModIDE (https://comodide.com/). Removing this annotation will break rendering the CoModIDE schema diagram view.
entity position x: 176.55479364610375
entity position y: 193.0503398741002

comment: This is an entity positioning annotation generated by CoModIDE (https://comodide.com/). Removing this annotation will break rendering the CoModIDE schema diagram view.
entity position x: 35.78319291697038
entity position y: 101.48120003940404

Bulgaria
type: EU country
type: NamedIndividual
label: България @bg
label: Bǎlgariya @bg
iso2code: BG